Gentoo Forums
Gentoo Forums
Gentoo Forums
Quick Search: in
[SOLVED] Rosegarden emerge error
View unanswered posts
View posts from last 24 hours

 
Reply to topic    Gentoo Forums Forum Index Duplicate Threads
View previous topic :: View next topic  
Author Message
linuxpyro
Apprentice
Apprentice


Joined: 08 Sep 2004
Posts: 255

PostPosted: Mon Dec 19, 2005 11:30 pm    Post subject: [SOLVED] Rosegarden emerge error Reply with quote

I am trying to use Rosegarden 4.1.0-r1 under gnome. While emerging, the KDE libs installed fine. But when it got to compiling Rosegarden, I got this error:

Code:

compilation error: file /usr/kde/3.4/share/apps/ksgmltools2/docbook/xsl/html/chunk-code.xsl line 949 element with-param
xsl:param : could not compile select expression '$footnotes[position() > 1]'
XPath error : Undefined variable
$footnotes[1]
          ^
compilation error: file /usr/kde/3.4/share/apps/ksgmltools2/docbook/xsl/html/chunk-code.xsl line 954 element apply-templates
xsl:apply-templates : could not compile select expression '$footnotes[1]'
XPath error : Undefined variable
compilation error: file /usr/kde/3.4/share/apps/ksgmltools2/docbook/xsl/html/chunk-code.xsl line 956 element with-param
xsl:param : could not compile select expression '$node'
XPath error : Undefined variable
$footnotes[position() > 1]
          ^
compilation error: file /usr/kde/3.4/share/apps/ksgmltools2/docbook/xsl/html/chunk-code.xsl line 958 element with-param
xsl:param : could not compile select expression '$footnotes[position() > 1]'
XPath error : Undefined variable
compilation error: file /usr/kde/3.4/share/apps/ksgmltools2/docbook/xsl/html/chunk-code.xsl line 971 element with-param
xsl:param : could not compile select expression '$footnotes'
XPath error : Undefined variable
compilation error: file /usr/kde/3.4/share/apps/ksgmltools2/docbook/xsl/html/chunk-code.xsl line 990 element with-param
xsl:param : could not compile select expression '$footnotes'
XPath error : Undefined variable
$is.chunk = 1
          ^
compilation error: file /usr/kde/3.4/share/apps/ksgmltools2/docbook/xsl/html/chunk-code.xsl line 1000 element if
xsl:if : could not compile test expression '$is.chunk = 1'
XPath error : Undefined variable
count($prev)>0
           ^
compilation error: file /usr/kde/3.4/share/apps/ksgmltools2/customization/kde-navig.xsl line 70 element if
xsl:if : could not compile test expression 'count($prev)>0'
XPath error : Undefined variable
compilation error: file /usr/kde/3.4/share/apps/ksgmltools2/customization/kde-navig.xsl line 74 element with-param
xsl:param : could not compile select expression '$prev'
XPath error : Undefined variable
count($next)>0
           ^
compilation error: file /usr/kde/3.4/share/apps/ksgmltools2/customization/kde-navig.xsl line 83 element if
xsl:if : could not compile test expression 'count($next)>0'
XPath error : Undefined variable
compilation error: file /usr/kde/3.4/share/apps/ksgmltools2/customization/kde-navig.xsl line 87 element with-param
xsl:param : could not compile select expression '$next'
XPath error : Undefined variable
compilation error: file /usr/kde/3.4/share/apps/ksgmltools2/customization/kde-navig.xsl line 97 element apply-templates
xsl:apply-templates : could not compile select expression '$up'
XPath error : Undefined variable
$suppress.navigation = '0'
                     ^
compilation error: file /usr/kde/3.4/share/apps/ksgmltools2/customization/kde-navig.xsl line 115 element if
xsl:if : could not compile test expression '$suppress.navigation = '0''
XPath error : Undefined variable
count($prev)>0
           ^
compilation error: file /usr/kde/3.4/share/apps/ksgmltools2/customization/kde-navig.xsl line 121 element if
xsl:if : could not compile test expression 'count($prev)>0'
XPath error : Undefined variable
compilation error: file /usr/kde/3.4/share/apps/ksgmltools2/customization/kde-navig.xsl line 125 element with-param
xsl:param : could not compile select expression '$prev'
XPath error : Undefined variable
count($next)>0
           ^
compilation error: file /usr/kde/3.4/share/apps/ksgmltools2/customization/kde-navig.xsl line 133 element if
xsl:if : could not compile test expression 'count($next)>0'
XPath error : Undefined variable
compilation error: file /usr/kde/3.4/share/apps/ksgmltools2/customization/kde-navig.xsl line 137 element with-param
xsl:param : could not compile select expression '$next'
XPath error : Undefined variable
$home != .
      ^
compilation error: file /usr/kde/3.4/share/apps/ksgmltools2/customization/kde-navig.xsl line 146 element when
xsl:when : could not compile test expression '$home != .'
XPath error : Undefined variable
compilation error: file /usr/kde/3.4/share/apps/ksgmltools2/customization/kde-navig.xsl line 150 element with-param
xsl:param : could not compile select expression '$home'
XPath error : Undefined variable
compilation error: file /usr/kde/3.4/share/apps/ksgmltools2/customization/kde-navig.xsl line 165 element apply-templates
xsl:apply-templates : could not compile select expression '$prev'
XPath error : Undefined variable
compilation error: file /usr/kde/3.4/share/apps/ksgmltools2/customization/kde-navig.xsl line 170 element apply-templates
xsl:apply-templates : could not compile select expression '$next'
XPath error : Undefined variable
compilation error: file /usr/kde/3.4/share/apps/ksgmltools2/customization/kde-navig.xsl line 178 element with-param
xsl:param : could not compile select expression '$up'
XPath error : Undefined variable
compilation error: file /usr/kde/3.4/share/apps/ksgmltools2/customization/kde-navig.xsl line 43 element div
Attribute template style: failed to compile $kde.common
XPath error : Undefined variable
compilation error: file /usr/kde/3.4/share/apps/ksgmltools2/customization/kde-navig.xsl line 47 element img
Attribute template src: failed to compile $kde.common
XPath error : Undefined variable
compilation error: file /usr/kde/3.4/share/apps/ksgmltools2/customization/kde-navig.xsl line 50 element img
Attribute template src: failed to compile $kde.common
XPath error : Undefined variable
compilation error: file /usr/kde/3.4/share/apps/ksgmltools2/customization/kde-navig.xsl line 198 element div
Attribute template style: failed to compile $kde.common
unable to parse ./index.docbook
make[4]: *** [index.cache.bz2] Error 1
make[4]: Leaving directory `/var/tmp/portage/rosegarden-4.1.0-r1/work/rosegarden-4-1.0/gui/docs/en'
make[3]: *** [all-recursive] Error 1
make[3]: Leaving directory `/var/tmp/portage/rosegarden-4.1.0-r1/work/rosegarden-4-1.0/gui/docs'
make[2]: *** [all-recursive] Error 1
make[2]: Leaving directory `/var/tmp/portage/rosegarden-4.1.0-r1/work/rosegarden-4-1.0/gui'
make[1]: *** [all-recursive] Error 1
make[1]: Leaving directory `/var/tmp/portage/rosegarden-4.1.0-r1/work/rosegarden-4-1.0'
make: *** [all] Error 2

!!! ERROR: media-sound/rosegarden-4.1.0-r1 failed.
!!! Function kde_src_compile, Line 173, Exitcode 2
!!! died running emake, kde_src_compile:make
!!! If you need support, post the topmost build error, NOT this status message.


There were actually more errors than that, but they were mostly repeats of the ones there. Here is my emerge --info:

Code:

Portage 2.0.51.22-r3 (default-linux/x86/2005.0, gcc-3.3.6, glibc-2.3.5-r1, 2.6.13-gentoo-r5 i686)
=================================================================
System uname: 2.6.13-gentoo-r5 i686 AMD Athlon(tm) MP 2800+
Gentoo Base System version 1.6.13
distcc 2.16 i686-pc-linux-gnu (protocols 1 and 2) (default port 3632) [disabled]dev-lang/python:     2.3.5-r2, 2.4.2
sys-apps/sandbox:    1.2.12
sys-devel/autoconf:  2.13, 2.59-r6
sys-devel/automake:  1.4_p6, 1.5, 1.6.3, 1.7.9-r1, 1.8.5-r3, 1.9.6-r1
sys-devel/binutils:  2.15.92.0.2-r10
sys-devel/libtool:   1.5.18-r1
virtual/os-headers:  2.6.11-r2
ACCEPT_KEYWORDS="x86"
AUTOCLEAN="yes"
CBUILD="i686-pc-linux-gnu"
CFLAGS="-O2 -mcpu=athlon-mp -fomit-frame-pointer"
CHOST="i686-pc-linux-gnu"
CONFIG_PROTECT="/etc /usr/kde/2/share/config /usr/kde/3.4/env /usr/kde/3.4/share/config /usr/kde/3.4/shutdown /usr/kde/3/share/config /usr/lib/X11/xkb /usr/share/config /usr/share/texmf/dvipdfm/config/ /usr/share/texmf/dvips/config/ /usr/share/texmf/tex/generic/config/ /usr/share/texmf/tex/platex/config/ /usr/share/texmf/xdvi/ /var/qmail/control"
CONFIG_PROTECT_MASK="/etc/gconf /etc/terminfo /etc/env.d"
CXXFLAGS="-O2 -mcpu=athlon-mp -fomit-frame-pointer"
DISTDIR="/usr/portage/distfiles"
FEATURES="autoconfig distlocks sandbox sfperms strict"
GENTOO_MIRRORS="http://distfiles.gentoo.org http://distro.ibiblio.org/pub/Linux/distributions/gentoo"
LDFLAGS="-Wl,-O1"
MAKEOPTS="-j3"
PKGDIR="/usr/portage/packages"
PORTAGE_TMPDIR="/var/tmp"
PORTDIR="/usr/portage"
PORTDIR_OVERLAY="/usr/local/portage"
SYNC="rsync://rsync.gentoo.org/gentoo-portage"
USE="x86 X a52 aalib acc alsa apm audiofile avi berkdb bitmap-fonts bonobo bzip2 cdr crypt cups curl divx4linux dv dvdread eds emboss encode esd ethereal exif expat fam fame ffmpeg flac foomaticdb fortran gd gdbm gif glut gmp gnome gphoto2 gpm gstreamer gtk gtk+-2.0 gtk2 gtkhtml idn imagemagick imlib ipv6 jack java jpeg junit lcms libg++ libwww mad matroska mikmod mng motif mp3 mpeg ncurses nls ogg oggvorbis opengl oss pam pcre pdflib perl png python qt quicktime readline recode samba sdl snmp spell ssl subtitle svga tcltk tcpd tetex tiff truetype truetype-fonts type1-fonts udev usb vorbis vorbix win32codecs xine xml xml2 xmms xv xvid zlib userland_GNU kernel_linux elibc_glibc"
Unset:  ASFLAGS, CTARGET, LANG, LC_ALL, LINGUAS


Sorry if there is a solution to this somewhere; I searched the forums and bugzilla and didn't have much luck. Thanks for any info.


Last edited by linuxpyro on Tue Dec 20, 2005 12:33 am; edited 1 time in total
Back to top
View user's profile Send private message
samek
n00b
n00b


Joined: 26 Aug 2004
Posts: 38

PostPosted: Mon Dec 19, 2005 11:49 pm    Post subject: Reply with quote

i had the same error and i solved it by re-emerging or updating package libxslt..
_________________
Best regards,
Samo
Back to top
View user's profile Send private message
linuxpyro
Apprentice
Apprentice


Joined: 08 Sep 2004
Posts: 255

PostPosted: Tue Dec 20, 2005 12:33 am    Post subject: Reply with quote

Thanks, it seemed to have worked for me too. :D
Back to top
View user's profile Send private message
kallamej
Administrator
Administrator


Joined: 27 Jun 2003
Posts: 4924
Location: Gothenburg, Sweden

PostPosted: Sun Dec 25, 2005 8:17 pm    Post subject: Reply with quote

Moved from Multimedia to Duplicate Threads in favour of [Solved] "XPath error : Undefined variable" ;kaffeine etc.
_________________
Please read our FAQ Forum, it answers many of your questions.
irc: #gentoo-forums on irc.freenode.net
Back to top
View user's profile Send private message
Display posts from previous:   
Reply to topic    Gentoo Forums Forum Index Duplicate Threads All times are GMT
Page 1 of 1

 
Jump to:  
You cannot post new topics in this forum
You cannot reply to topics in this forum
You cannot edit your posts in this forum
You cannot delete your posts in this forum
You cannot vote in polls in this forum