Gentoo Forums
Gentoo Forums
Gentoo Forums
Quick Search: in
qtwebengine-5.12.3 error: 'SIOCGSTAMP' was not declared
View unanswered posts
View posts from last 24 hours

 
Reply to topic    Gentoo Forums Forum Index Duplicate Threads
View previous topic :: View next topic  
Author Message
Spargeltarzan
Guru
Guru


Joined: 23 Jul 2017
Posts: 300

PostPosted: Wed Oct 02, 2019 3:37 pm    Post subject: Reply with quote

Hi,

my notebook has 8GB of RAM and I use a swap also of 8GB.

I tried to emerge qtwebengine with MAKEOPTS="-j1" with help of distcc and also without. What could be my issue?!

Thanks in advance!

Code:

[6085/22838] /usr/lib64/distcc/bin/x86_64-pc-linux-gnu-g++ -MMD -MF obj/third_party/webrtc/rtc_base/rtc_base_generic/opensslutility.o.d -DWEBRTC_BUILT_IN_SSL_ROOT_CERTIFICATES -DV8_DEPRECATION_WARNINGS -DUSE_UDEV -DUSE_AURA=1 -DUSE_NSS_CERTS=1 -DUSE_OZONE=1 -DNO_TCMALLOC -DFULL_SAFE_BROWSING -DSAFE_BROWSING_CSD -DSAFE_BROWSING_DB_LOCAL -DOFFICIAL_BUILD -DCHROMIUM_BUILD -DFIELDTRIAL_TESTING_ENABLED -DTOOLKIT_QT -D_FILE_OFFSET_BITS=64 -D_LARGEFILE_SOURCE -D_LARGEFILE64_SOURCE -D__STDC_CONSTANT_MACROS -D__STDC_FORMAT_MACROS -DNDEBUG -DNVALGRIND -DDYNAMIC_ANNOTATIONS_ENABLED=0 -DWEBRTC_ENABLE_PROTOBUF=1 -DHAVE_SCTP -DENABLE_EXTERNAL_AUTH -DUSE_BUILTIN_SW_CODECS -DHAVE_WEBRTC_VIDEO -DHAVE_WEBRTC_VOICE -DLOGGING_INSIDE_WEBRTC -DWEBRTC_NON_STATIC_TRACE_EVENT_HANDLERS=0 -DGTEST_RELATIVE_PATH -DWEBRTC_CHROMIUM_BUILD -DWEBRTC_POSIX -DWEBRTC_LINUX -DABSL_ALLOCATOR_NOTHROW=1 -DNO_MAIN_THREAD_WRAPPING -I../../3rdparty/chromium/third_party/boringssl/src/include -Igen -I../../3rdparty/chromium -I../../3rdparty/chromium/third_party/webrtc_overrides -I../../3rdparty/chromium/third_party/webrtc -Igen -I../../3rdparty/chromium/third_party/boringssl/src/include -fno-strict-aliasing --param=ssp-buffer-size=4 -fstack-protector -funwind-tables -fPIC -pipe -pthread -m64 -Wall -U_FORTIFY_SOURCE -D_FORTIFY_SOURCE=2 -Wno-unused-local-typedefs -Wno-maybe-uninitialized -Wno-deprecated-declarations -fno-delete-null-pointer-checks -Wno-comments -Wno-dangling-else -Wno-packed-not-aligned -Wno-missing-field-initializers -Wno-unused-parameter -O2 -fno-ident -fdata-sections -ffunction-sections -fno-omit-frame-pointer -g0 -fvisibility=hidden -isystem ../../3rdparty/chromium/third_party/abseil-cpp -std=gnu++14 -Wno-narrowing -Wno-attributes -Wno-class-memaccess -Wno-subobject-linkage -fno-exceptions -fno-rtti -fvisibility-inlines-hidden -c ../../3rdparty/chromium/third_party/webrtc/rtc_base/opensslutility.cc -o obj/third_party/webrtc/rtc_base/rtc_base_generic/opensslutility.o
[6086/22838] /usr/lib64/distcc/bin/x86_64-pc-linux-gnu-g++ -MMD -MF obj/third_party/webrtc/rtc_base/rtc_base_generic/physicalsocketserver.o.d -DWEBRTC_BUILT_IN_SSL_ROOT_CERTIFICATES -DV8_DEPRECATION_WARNINGS -DUSE_UDEV -DUSE_AURA=1 -DUSE_NSS_CERTS=1 -DUSE_OZONE=1 -DNO_TCMALLOC -DFULL_SAFE_BROWSING -DSAFE_BROWSING_CSD -DSAFE_BROWSING_DB_LOCAL -DOFFICIAL_BUILD -DCHROMIUM_BUILD -DFIELDTRIAL_TESTING_ENABLED -DTOOLKIT_QT -D_FILE_OFFSET_BITS=64 -D_LARGEFILE_SOURCE -D_LARGEFILE64_SOURCE -D__STDC_CONSTANT_MACROS -D__STDC_FORMAT_MACROS -DNDEBUG -DNVALGRIND -DDYNAMIC_ANNOTATIONS_ENABLED=0 -DWEBRTC_ENABLE_PROTOBUF=1 -DHAVE_SCTP -DENABLE_EXTERNAL_AUTH -DUSE_BUILTIN_SW_CODECS -DHAVE_WEBRTC_VIDEO -DHAVE_WEBRTC_VOICE -DLOGGING_INSIDE_WEBRTC -DWEBRTC_NON_STATIC_TRACE_EVENT_HANDLERS=0 -DGTEST_RELATIVE_PATH -DWEBRTC_CHROMIUM_BUILD -DWEBRTC_POSIX -DWEBRTC_LINUX -DABSL_ALLOCATOR_NOTHROW=1 -DNO_MAIN_THREAD_WRAPPING -I../../3rdparty/chromium/third_party/boringssl/src/include -Igen -I../../3rdparty/chromium -I../../3rdparty/chromium/third_party/webrtc_overrides -I../../3rdparty/chromium/third_party/webrtc -Igen -I../../3rdparty/chromium/third_party/boringssl/src/include -fno-strict-aliasing --param=ssp-buffer-size=4 -fstack-protector -funwind-tables -fPIC -pipe -pthread -m64 -Wall -U_FORTIFY_SOURCE -D_FORTIFY_SOURCE=2 -Wno-unused-local-typedefs -Wno-maybe-uninitialized -Wno-deprecated-declarations -fno-delete-null-pointer-checks -Wno-comments -Wno-dangling-else -Wno-packed-not-aligned -Wno-missing-field-initializers -Wno-unused-parameter -O2 -fno-ident -fdata-sections -ffunction-sections -fno-omit-frame-pointer -g0 -fvisibility=hidden -isystem ../../3rdparty/chromium/third_party/abseil-cpp -std=gnu++14 -Wno-narrowing -Wno-attributes -Wno-class-memaccess -Wno-subobject-linkage -fno-exceptions -fno-rtti -fvisibility-inlines-hidden -c ../../3rdparty/chromium/third_party/webrtc/rtc_base/physicalsocketserver.cc -o obj/third_party/webrtc/rtc_base/rtc_base_generic/physicalsocketserver.o
FAILED: obj/third_party/webrtc/rtc_base/rtc_base_generic/physicalsocketserver.o
/usr/lib64/distcc/bin/x86_64-pc-linux-gnu-g++ -MMD -MF obj/third_party/webrtc/rtc_base/rtc_base_generic/physicalsocketserver.o.d -DWEBRTC_BUILT_IN_SSL_ROOT_CERTIFICATES -DV8_DEPRECATION_WARNINGS -DUSE_UDEV -DUSE_AURA=1 -DUSE_NSS_CERTS=1 -DUSE_OZONE=1 -DNO_TCMALLOC -DFULL_SAFE_BROWSING -DSAFE_BROWSING_CSD -DSAFE_BROWSING_DB_LOCAL -DOFFICIAL_BUILD -DCHROMIUM_BUILD -DFIELDTRIAL_TESTING_ENABLED -DTOOLKIT_QT -D_FILE_OFFSET_BITS=64 -D_LARGEFILE_SOURCE -D_LARGEFILE64_SOURCE -D__STDC_CONSTANT_MACROS -D__STDC_FORMAT_MACROS -DNDEBUG -DNVALGRIND -DDYNAMIC_ANNOTATIONS_ENABLED=0 -DWEBRTC_ENABLE_PROTOBUF=1 -DHAVE_SCTP -DENABLE_EXTERNAL_AUTH -DUSE_BUILTIN_SW_CODECS -DHAVE_WEBRTC_VIDEO -DHAVE_WEBRTC_VOICE -DLOGGING_INSIDE_WEBRTC -DWEBRTC_NON_STATIC_TRACE_EVENT_HANDLERS=0 -DGTEST_RELATIVE_PATH -DWEBRTC_CHROMIUM_BUILD -DWEBRTC_POSIX -DWEBRTC_LINUX -DABSL_ALLOCATOR_NOTHROW=1 -DNO_MAIN_THREAD_WRAPPING -I../../3rdparty/chromium/third_party/boringssl/src/include -Igen -I../../3rdparty/chromium -I../../3rdparty/chromium/third_party/webrtc_overrides -I../../3rdparty/chromium/third_party/webrtc -Igen -I../../3rdparty/chromium/third_party/boringssl/src/include -fno-strict-aliasing --param=ssp-buffer-size=4 -fstack-protector -funwind-tables -fPIC -pipe -pthread -m64 -Wall -U_FORTIFY_SOURCE -D_FORTIFY_SOURCE=2 -Wno-unused-local-typedefs -Wno-maybe-uninitialized -Wno-deprecated-declarations -fno-delete-null-pointer-checks -Wno-comments -Wno-dangling-else -Wno-packed-not-aligned -Wno-missing-field-initializers -Wno-unused-parameter -O2 -fno-ident -fdata-sections -ffunction-sections -fno-omit-frame-pointer -g0 -fvisibility=hidden -isystem ../../3rdparty/chromium/third_party/abseil-cpp -std=gnu++14 -Wno-narrowing -Wno-attributes -Wno-class-memaccess -Wno-subobject-linkage -fno-exceptions -fno-rtti -fvisibility-inlines-hidden -c ../../3rdparty/chromium/third_party/webrtc/rtc_base/physicalsocketserver.cc -o obj/third_party/webrtc/rtc_base/rtc_base_generic/physicalsocketserver.o
distcc[14966] ERROR: compile ../../3rdparty/chromium/third_party/webrtc/rtc_base/physicalsocketserver.cc on 192.168.1.10/16,lzo failed
distcc[14966] (dcc_build_somewhere) Warning: remote compilation of '../../3rdparty/chromium/third_party/webrtc/rtc_base/physicalsocketserver.cc' failed, retrying locally
distcc[14966] Warning: failed to distribute ../../3rdparty/chromium/third_party/webrtc/rtc_base/physicalsocketserver.cc to 192.168.1.10/16,lzo, running locally instead
../../3rdparty/chromium/third_party/webrtc/rtc_base/physicalsocketserver.cc: In function ‘int64_t GetSocketRecvTimestamp(int)’:
../../3rdparty/chromium/third_party/webrtc/rtc_base/physicalsocketserver.cc:74:27: error: ‘SIOCGSTAMP’ was not declared in this scope; did you mean ‘SIOCGARP’?
   74 |   int ret = ioctl(socket, SIOCGSTAMP, &tv_ioctl);
      |                           ^~~~~~~~~~
      |                           SIOCGARP
distcc[14966] ERROR: compile ../../3rdparty/chromium/third_party/webrtc/rtc_base/physicalsocketserver.cc on localhost failed
ninja: build stopped: subcommand failed.
make[3]: *** [Makefile.gn_run:451: run_ninja] Error 1
make[3]: Leaving directory '/var/tmp/portage/dev-qt/qtwebengine-5.12.3/work/qtwebengine-everywhere-src-5.12.3/src/core'
make[2]: *** [Makefile:82: sub-gn_run-pro-make_first] Error 2
make[2]: Leaving directory '/var/tmp/portage/dev-qt/qtwebengine-5.12.3/work/qtwebengine-everywhere-src-5.12.3/src/core'
make[1]: *** [Makefile:81: sub-core-make_first] Error 2
make[1]: Leaving directory '/var/tmp/portage/dev-qt/qtwebengine-5.12.3/work/qtwebengine-everywhere-src-5.12.3/src'
make: *** [Makefile:49: sub-src-make_first] Error 2
 * ERROR: dev-qt/qtwebengine-5.12.3::gentoo failed (compile phase):
 *   emake failed

_________________
___________________
Regards

Spargeltarzan

Notebook: Lenovo YOGA 900-13ISK: Gentoo stable amd64, GNOME systemd, KVM/QEMU
Desktop-PC: Intel Core i7-4770K, 8GB Ram, AMD Radeon R9 280X, ZFS Storage, GNOME openrc, Dantrell, Xen
Back to top
View user's profile Send private message
Chiitoo
Administrator
Administrator


Joined: 28 Feb 2010
Posts: 1832
Location: Here and Away Again

PostPosted: Wed Oct 02, 2019 5:27 pm    Post subject: Reply with quote

Split off of [SOLVED] emerging qtwebengine-5.7.1, which is about a different issue, and placed under Duplicate Threads in favour of qtwebengine-5.12.4 ‘SIOCGSTAMP’ was not declared....
_________________
Kind Regards,
The Noob Unlimited


You might remember me from Gentoo projects such as Forums, LXQt, Qt, and Wine.
Back to top
View user's profile Send private message
Display posts from previous:   
Reply to topic    Gentoo Forums Forum Index Duplicate Threads All times are GMT
Page 1 of 1

 
Jump to:  
You cannot post new topics in this forum
You cannot reply to topics in this forum
You cannot edit your posts in this forum
You cannot delete your posts in this forum
You cannot vote in polls in this forum