Gentoo Forums
Gentoo Forums
Gentoo Forums
Quick Search: in
[SOLVED]compiling a 4.17.x kernel fails (genkernel ...)
View unanswered posts
View posts from last 24 hours

 
Reply to topic    Gentoo Forums Forum Index Kernel & Hardware
View previous topic :: View next topic  
Author Message
gorg86
Tux's lil' helper
Tux's lil' helper


Joined: 20 May 2011
Posts: 128

PostPosted: Tue Jun 26, 2018 1:34 am    Post subject: [SOLVED]compiling a 4.17.x kernel fails (genkernel ...) Reply with quote

Hello,

I compiled gentoo-sources 4.17.0 with genkernel a while ago and I'm running it right now.
Now all of a sudden it fails to build any of the 4.17.x gentoo-sources :(
I didn't try to build anything lower than that right now.

emerge --info: https://pastebin.com/dcPRUiqV
genkernel all: https://pastebin.com/7HCFc4Cq

Code:
* ERROR: Failed to compile the "bzImage" target...
*
* -- Grepping log... --
*
*  CC      arch/x86/events/amd/ibs.o
*  VDSO    arch/x86/entry/vdso/vdso64.so.dbg
*  AS      arch/x86/kernel/acpi/wakeup_64.o
*  VDSO    arch/x86/entry/vdso/vdsox32.so.dbg
*  CC      arch/x86/kernel/acpi/apei.o
*arch/x86/entry/vdso/vclock_gettime.c:168: error: relocation overflow: reference to 'vvar_vsyscall_gtod_data'
*arch/x86/entry/vdso/vclock_gettime.c:271: error: relocation overflow: reference to 'vvar_vsyscall_gtod_data'
[...blabla...]
*collect2: error: ld returned 1 exit status
*  CC      arch/x86/kernel/acpi/cppc_msr.o                                                                                                                                                                                                   
*  VDSO    arch/x86/entry/vdso/vdso32.so.dbg                                                                                                                                                                                                 
*  OBJCOPY arch/x86/entry/vdso/vdso64.so                                                                                                                                                                                                     
*  OBJCOPY arch/x86/entry/vdso/vdsox32.so                                                                                                                                                                                                     
*objcopy: 'arch/x86/entry/vdso/vdsox32.so.dbg': No such file
*make[3]: *** [arch/x86/entry/vdso/Makefile:123: arch/x86/entry/vdso/vdsox32.so] Error 1
*make[2]: *** [scripts/Makefile.build:559: arch/x86/entry/vdso] Error 2
*make[1]: *** [scripts/Makefile.build:559: arch/x86/entry] Error 2
*--
*  CC      fs/open.o
*  CC      kernel/time/timecounter.o
*  CC      kernel/time/alarmtimer.o
*  CC      arch/x86/kernel/smpboot.o
*  CC      kernel/time/posix-timers.o
*  CC      mm/memory-failure.o
*--
*  AR      crypto/asymmetric_keys/built-in.a
*  CC      crypto/api.o
*  CC      drivers/acpi/acpica/evgpe.o
*  LDS     arch/x86/kernel/vmlinux.lds
*  AR      arch/x86/kernel/built-in.a
*make: *** [Makefile:1063: arch/x86] Error 2


Any ideas?


Last edited by gorg86 on Tue Jun 26, 2018 8:38 am; edited 1 time in total
Back to top
View user's profile Send private message
russK
l33t
l33t


Joined: 27 Jun 2006
Posts: 630

PostPosted: Tue Jun 26, 2018 1:48 am    Post subject: Reply with quote

Is it the same as this forum topic?
Back to top
View user's profile Send private message
gorg86
Tux's lil' helper
Tux's lil' helper


Joined: 20 May 2011
Posts: 128

PostPosted: Tue Jun 26, 2018 8:37 am    Post subject: Reply with quote

Yes that was it, thank you.
Back to top
View user's profile Send private message
Display posts from previous:   
Reply to topic    Gentoo Forums Forum Index Kernel & Hardware All times are GMT
Page 1 of 1

 
Jump to:  
You cannot post new topics in this forum
You cannot reply to topics in this forum
You cannot edit your posts in this forum
You cannot delete your posts in this forum
You cannot vote in polls in this forum