Gentoo Forums
Gentoo Forums
Gentoo Forums
Quick Search: in
[erledigt] x11-libs/cairo-1.16.0-r3 lässt sich nicht bauen
View unanswered posts
View posts from last 24 hours
View posts from last 7 days

 
Reply to topic    Gentoo Forums Forum Index Deutsches Forum (German)
View previous topic :: View next topic  
Author Message
michael_w
Guru
Guru


Joined: 22 Feb 2006
Posts: 438
Location: 09xxx

PostPosted: Sat Mar 14, 2020 5:40 pm    Post subject: [erledigt] x11-libs/cairo-1.16.0-r3 lässt sich nicht bauen Reply with quote

Hallo,

seit ca. 1 Woche lässt sich das hier nicht mehr bauen. Habe gedacht, das löst sich von selbst auf, scheinbar nicht.

das dürfte der relevante Teil sein:
Code:

libtool: link: x86_64-pc-linux-gnu-gcc -m32 -D_REENTRANT -I/usr/include/pixman-1 -I/usr/include/uuid -I/usr/include/freetype2 -I/usr/include/freetype2 -I/usr/include/libpng16 -Wall -Wextra -Wmissing-declarations -Werror-implicit-function-declaration -Wpointer-arith -Wwrite-strings -Wsign-compare -Wpacked -Wswitch-enum -Wmissing-format-attribute -Wvolatile-register-var -Wstrict-aliasing=2 -Winit-self -Wunsafe-loop-optimizations -Wno-missing-field-initializers -Wno-unused-parameter -Wno-attributes -Wno-long-long -Winline -fno-strict-aliasing -fno-common -Wp,-D_FORTIFY_SOURCE=2 -Wno-unused-but-set-variable -D_REENTRANT -I/usr/include/glib-2.0 -I/usr/lib32/glib-2.0/include -O2 -march=znver1 -Wl,-O1 -o .libs/cairo-sphinx cairo_sphinx-sphinx.o  -Wl,--as-needed ../../util/cairo-script/.libs/libcairo-script-interpreter.so -llzo2 ../../boilerplate/.libs/libcairoboilerplate.a /var/tmp/portage/x11-libs/cairo-1.16.0-r3/work/cairo-1.16.0-abi_x86_32.x86/src/.libs/libcairo.so ../../src/.libs/libcairo.so -lpthread -lpixman-1 -lfontconfig -lfreetype -lEGL -ldl -lpng16 -lxcb-shm -lxcb -lxcb-render -lXrender -lX11 -lXext -lz -lGL -lglib-2.0 -lrt -lm
/usr/lib/gcc/x86_64-pc-linux-gnu/9.2.0/../../../../x86_64-pc-linux-gnu/bin/ld: /usr/lib/gcc/x86_64-pc-linux-gnu/9.2.0/../../../../lib32/libGL.so: undefined reference to `_glapi_tls_Current'
collect2: error: ld returned 1 exit status
make[4]: *** [Makefile:604: cairo-sphinx] Error 1
make[4]: Leaving directory '/var/tmp/portage/x11-libs/cairo-1.16.0-r3/work/cairo-1.16.0-abi_x86_32.x86/util/cairo-sphinx'
make[3]: *** [Makefile:1002: all-recursive] Error 1
make[3]: Leaving directory '/var/tmp/portage/x11-libs/cairo-1.16.0-r3/work/cairo-1.16.0-abi_x86_32.x86/util'
make[2]: *** [Makefile:779: all] Error 2
make[2]: Leaving directory '/var/tmp/portage/x11-libs/cairo-1.16.0-r3/work/cairo-1.16.0-abi_x86_32.x86/util'
make[1]: *** [Makefile:908: all-recursive] Error 1
make[1]: Leaving directory '/var/tmp/portage/x11-libs/cairo-1.16.0-r3/work/cairo-1.16.0-abi_x86_32.x86'
make: *** [Makefile:759: all] Error 2
 * ERROR: x11-libs/cairo-1.16.0-r3::gentoo failed (compile phase):


Hat jemand ne Idee?
_________________
Linux ryzen 4.19.97-gentoo #1 SMP Fri Mar 27 09:10:25 CET 2020 x86_64 AMD Ryzen 7 3700X 8-Core Processor AuthenticAMD GNU/Linux


Last edited by michael_w on Mon Mar 16, 2020 8:07 am; edited 1 time in total
Back to top
View user's profile Send private message
mike155
Advocate
Advocate


Joined: 17 Sep 2010
Posts: 2126
Location: Frankfurt, Germany

PostPosted: Sat Mar 14, 2020 6:49 pm    Post subject: Reply with quote

Laut Google könnte die Fehlermeldung mit NVIDIA Grafikkarten zusammenzuhängen. Hast Du eine NVIDIA Grafikkarte?

Bitte poste die Ausgabe von
Code:
emerge --info
emerge -pv x11-libs/cairo
Back to top
View user's profile Send private message
michael_w
Guru
Guru


Joined: 22 Feb 2006
Posts: 438
Location: 09xxx

PostPosted: Sat Mar 14, 2020 6:54 pm    Post subject: Reply with quote

mike155 wrote:
Laut Google könnte die Fehlermeldung mit NVIDIA Grafikkarten zusammenzuhängen. Hast Du eine NVIDIA Grafikkarte?


Ja, habe ich. Und ich habe auch dieses Problem hier: https://forums.gentoo.org/viewtopic-t-1109690.html

Code:

ryzen ~ # emerge --info
!!! Repository 'x-portage' is missing masters attribute in '/usr/local/portage/metadata/layout.conf'
!!! Set 'masters = gentoo' in this file for future compatibility
Portage 2.3.89 (python 3.6.10-final-0, default/linux/amd64/17.0/desktop/plasma, gcc-9.2.0, glibc-2.29-r7, 4.19.86-gentoo x86_64)
=================================================================
System uname: Linux-4.19.86-gentoo-x86_64-AMD_Ryzen_7_3700X_8-Core_Processor-with-gentoo-2.6
KiB Mem:    32951120 total,    879656 free
KiB Swap:   33554428 total,  32465384 free
Timestamp of repository gentoo: Sat, 14 Mar 2020 17:00:01 +0000
Head commit of repository gentoo: 56ffc28c749efa412efeca37fca4a6119853c9ff
sh bash 4.4_p23-r1
ld GNU ld (Gentoo 2.32 p2) 2.32.0
app-shells/bash:          4.4_p23-r1::gentoo
dev-java/java-config:     2.2.0-r4::gentoo
dev-lang/perl:            5.30.1::gentoo
dev-lang/python:          2.7.17-r1::gentoo, 3.6.10::gentoo, 3.7.6::gentoo
dev-util/cmake:           3.14.6::gentoo
dev-util/pkgconfig:       0.29.2::gentoo
sys-apps/baselayout:      2.6-r1::gentoo
sys-apps/openrc:          0.42.1::gentoo
sys-apps/sandbox:         2.13::gentoo
sys-devel/autoconf:       2.13-r1::gentoo, 2.69-r4::gentoo
sys-devel/automake:       1.16.1-r1::gentoo
sys-devel/binutils:       2.32-r1::gentoo, 2.33.1-r1::gentoo
sys-devel/gcc:            9.2.0-r2::gentoo
sys-devel/gcc-config:     2.2.1::gentoo
sys-devel/libtool:        2.4.6-r6::gentoo
sys-devel/make:           4.2.1-r4::gentoo
sys-kernel/linux-headers: 4.19::gentoo (virtual/os-headers)
sys-libs/glibc:           2.29-r7::gentoo
Repositories:

gentoo
    location: /usr/portage
    sync-type: rsync
    sync-uri: rsync://rsync.gentoo.org/gentoo-portage
    priority: -1000
    sync-rsync-verify-jobs: 1
    sync-rsync-verify-metamanifest: yes
    sync-rsync-extra-opts:
    sync-rsync-verify-max-age: 24

x-portage
    location: /usr/local/portage
    masters: gentoo
    priority: 0

DuPol
    location: /var/lib/layman/DuPol
    masters: gentoo
    priority: 50

steam-overlay
    location: /var/lib/layman/steam-overlay
    masters: gentoo
    priority: 50

ACCEPT_KEYWORDS="amd64"
ACCEPT_LICENSE="@FREE"
CBUILD="x86_64-pc-linux-gnu"
CFLAGS="-O2 -march=znver1"
CHOST="x86_64-pc-linux-gnu"
CONFIG_PROTECT="/etc /usr/lib64/libreoffice/program/sofficerc /usr/share/config /usr/share/gnupg/qualified.txt"
CONFIG_PROTECT_MASK="/etc/ca-certificates.conf /etc/dconf /etc/env.d /etc/fonts/fonts.conf /etc/gconf /etc/gentoo-release /etc/revdep-rebuild /etc/sandbox.d /etc/terminfo /etc/texmf/language.dat.d /etc/texmf/language.def.d /etc/texmf/updmap.d /etc/texmf/web2c"
CXXFLAGS="-O2 -march=znver1"
DISTDIR="/usr/portage/distfiles"
ENV_UNSET="DBUS_SESSION_BUS_ADDRESS DISPLAY GOBIN PERL5LIB PERL5OPT PERLPREFIX PERL_CORE PERL_MB_OPT PERL_MM_OPT XAUTHORITY XDG_CACHE_HOME XDG_CONFIG_HOME XDG_DATA_HOME XDG_RUNTIME_DIR"
FCFLAGS="-O2 -pipe"
FEATURES="assume-digests binpkg-docompress binpkg-dostrip binpkg-logs config-protect-if-modified distlocks ebuild-locks fixlafiles ipc-sandbox merge-sync multilib-strict network-sandbox news parallel-fetch pid-sandbox preserve-libs protect-owned qa-unresolved-soname-deps sandbox sfperms strict unknown-features-warn unmerge-logs unmerge-orphans userfetch userpriv usersandbox usersync xattr"
FFLAGS="-O2 -pipe"
GENTOO_MIRRORS="ftp://ftp.wh2.tu-dresden.de/pub/mirrors/gentoo ftp://mirror.netcologne.de/gentoo/ ftp://ftp.halifax.rwth-aachen.de/gentoo/"
LANG="de_DE.utf8"
LDFLAGS="-Wl,-O1 -Wl,--as-needed"
LINGUAS="de"
MAKEOPTS="-j17"
PKGDIR="/usr/portage/packages"
PORTAGE_CONFIGROOT="/"
PORTAGE_RSYNC_OPTS="--recursive --links --safe-links --perms --times --omit-dir-times --compress --force --whole-file --delete --stats --human-readable --timeout=180 --exclude=/distfiles --exclude=/local --exclude=/packages --exclude=/.git"
PORTAGE_TMPDIR="/var/tmp"
USE="64bit CPU_FLAGS_X86="aes X a52 aac acl acpi activities alsa amd64 avformat avx avx2 berkdb branding bzip2 cairo cdda cdr cli consolekit crypt cups cxx dbus declarative display-manager dri dts dvd dvdr dvi2tty emboss encode evdev exif ffmpeg flac fma3 fortran gdbm gif gimp gimpprint gphoto2 gpm graphics gtk gui heif hwdb iconv icu ipv6 jpeg kde kipi kmod kwallet lcms ldap libnotify libtirpc lm_sensors mad mmx mmxext mng mp3 mp4 mpeg mplayer multilib ncurses nls nptl ogg opengl openmp pam pango pclmul pcre pdf phonon plasma pm-utils png policykit popcnt ppds qml qt5 readline samba sdl seccomp semantic-desktop spell split-usr sse sse2 sse3 sse4_1 sse4_2 sse4a ssl ssse3" startup-notification svg syslog tcpd threads tiff tools truetype udev udisks unicode upower usb vdpau vorbis webstart widgets wxwidgets x264 xattr xcb xcomposite xml xorg xv xvid zlib" ABI_X86="64" ADA_TARGET="gnat_2018" ALSA_CARDS="ali5451 als4000 atiixp atiixp-modem bt87x ca0106 cmipci emu10k1x ens1370 ens1371 es1938 es1968 fm801 hda-intel intel8x0 intel8x0m maestro3 trident usb-audio via82xx via82xx-modem ymfpci" APACHE2_MODULES="authn_core authz_core socache_shmcb unixd actions alias auth_basic authn_alias authn_anon authn_dbm authn_default authn_file authz_dbm authz_default authz_groupfile authz_host authz_owner authz_user autoindex cache cgi cgid dav dav_fs dav_lock deflate dir disk_cache env expires ext_filter file_cache filter headers include info log_config logio mem_cache mime mime_magic negotiation rewrite setenvif speling status unique_id userdir usertrack vhost_alias" CALLIGRA_FEATURES="karbon sheets words" COLLECTD_PLUGINS="df interface irq load memory rrdtool swap syslog" CPU_FLAGS_X86="mmx mmxext sse sse2" ELIBC="glibc" GPSD_PROTOCOLS="ashtech aivdm earthmate evermore fv18 garmin garmintxt gpsclock greis isync itrax mtk3301 nmea ntrip navcom oceanserver oldstyle oncore rtcm104v2 rtcm104v3 sirf skytraq superstar2 timing tsip tripmate tnt ublox ubx" INPUT_DEVICES="evdev" KERNEL="linux" L10N="de" LCD_DEVICES="bayrad cfontz cfontz633 glk hd44780 lb216 lcdm001 mtxorb ncurses text" LIBREOFFICE_EXTENSIONS="presenter-console presenter-minimizer" OFFICE_IMPLEMENTATION="libreoffice" PHP_TARGETS="php7-2" POSTGRES_TARGETS="postgres10 postgres11" PYTHON_SINGLE_TARGET="python3_6" PYTHON_TARGETS="python2_7 python3_6" RUBY_TARGETS="ruby24 ruby25" USERLAND="GNU" VIDEO_CARDS="nvidia" XTABLES_ADDONS="quota2 psd pknock lscan length2 ipv4options ipset ipp2p iface geoip fuzzy condition tee tarpit sysrq steal rawnat logmark ipmark dhcpmac delude chaos account"
Unset:  CC, CPPFLAGS, CTARGET, CXX, EMERGE_DEFAULT_OPTS, INSTALL_MASK, LC_ALL, PORTAGE_BINHOST, PORTAGE_BUNZIP2_COMMAND, PORTAGE_COMPRESS, PORTAGE_COMPRESS_FLAGS, PORTAGE_RSYNC_EXTRA_OPTS


Code:

ryzen ~ # emerge -pv x11-libs/cairo
!!! Repository 'x-portage' is missing masters attribute in '/usr/local/portage/metadata/layout.conf'
!!! Set 'masters = gentoo' in this file for future compatibility

These are the packages that would be merged, in order:

Calculating dependencies... done!
[ebuild  N     ] x11-libs/cairo-1.16.0-r3::gentoo  USE="X glib opengl svg (-aqua) -debug (-gles2-only) -static-libs -utils -valgrind" ABI_X86="32 (64) (-x32)" 0 KiB

Total: 1 package (1 new), Size of downloads: 0 KiB

_________________
Linux ryzen 4.19.97-gentoo #1 SMP Fri Mar 27 09:10:25 CET 2020 x86_64 AMD Ryzen 7 3700X 8-Core Processor AuthenticAMD GNU/Linux
Back to top
View user's profile Send private message
Josef.95
Advocate
Advocate


Joined: 03 Sep 2007
Posts: 3809
Location: Germany

PostPosted: Sun Mar 15, 2020 12:50 am    Post subject: Reply with quote

Schau mal ob die Info aus https://bugs.gentoo.org/buglist.cgi?quicksearch=ALL%20_glapi_tls_Current
weiterhilft.
Back to top
View user's profile Send private message
michael_w
Guru
Guru


Joined: 22 Feb 2006
Posts: 438
Location: 09xxx

PostPosted: Sun Mar 15, 2020 6:32 pm    Post subject: Reply with quote

Josef.95 wrote:
Schau mal ob die Info aus https://bugs.gentoo.org/buglist.cgi?quicksearch=ALL%20_glapi_tls_Current
weiterhilft.


Danke für den Tipp. Die Lösung scheint diese zu sein:
Code:

Simple steps that fixed that build order problem (with +libglvnd) for me:

1) emerge --nodeps -1 nvidia-drivers
2) emerge -1 mesa xorg-server


Da taucht das nächste Problem bei mir auf (schon beim 1. Punkt):

Code:

x86_64-pc-linux-gnu-gcc -O2 -march=znver1 -fno-strict-aliasing -fno-omit-frame-pointer -Wformat=2 -Wno-unused-parameter -Wno-format-zero-length -DNV_LINUX -DNV_X86_64 -DNV_ARCH_BITS=64  -DNVIDIA_VERSION=\"440.59\"   -I . -I image_data -I ../src/libXNVCtrl -I XF86Config-parser/.. -I libXNVCtrlAttributes -I xpm_data -I common-utils -I common-unix/virtual-resolutions -I . -I /usr/include -I/usr/include/dbus-1.0 -I/usr/lib64/dbus-1.0/include -DPROGRAM_NAME=\"nvidia-settings\"  -fPIC -I XF86Config-parser/.. -c gtk+-2.x/ctkscale.c -o gtk2/ctkscale.o && x86_64-pc-linux-gnu-gcc -MM -O2 -march=znver1 -fno-strict-aliasing -fno-omit-frame-pointer -Wformat=2 -Wno-unused-parameter -Wno-format-zero-length -DNV_LINUX -DNV_X86_64 -DNV_ARCH_BITS=64  -DNVIDIA_VERSION=\"440.59\"   -I . -I image_data -I ../src/libXNVCtrl -I XF86Config-parser/.. -I libXNVCtrlAttributes -I xpm_data -I common-utils -I common-unix/virtual-resolutions -I . -I /usr/include -I/usr/include/dbus-1.0 -I/usr/lib64/dbus-1.0/include -DPROGRAM_NAME=\"nvidia-settings\"  -fPIC -I XF86Config-parser/.. gtk+-2.x/ctkscale.c | sed -e "s,: ,: $\(wildcard ," -e "s,\([^\\]\)$,\1)," -e "s;^ctkscale.o: ; ./gtk2/ctkscale.o: ;" > gtk2/ctkscale.d
gtk+-2.x/ctkframelock.c:20:10: fatal error: gtk/gtk.h: No such file or directory
   20 | #include <gtk/gtk.h>
      |          ^~~~~~~~~~~
compilation terminated.
gtk+-2.x/ctkui.c:20:10: fatal error: gtk/gtk.h: No such file or directory
   20 | #include <gtk/gtk.h>
      |          ^~~~~~~~~~~
compilation terminated.
make: *** [Makefile:309: gtk2/ctkui.o] Error 1
make: *** Waiting for unfinished jobs....
make: *** [Makefile:309: gtk2/ctkframelock.o] Error 1
x86_64-pc-linux-gnu-gcc -O2 -march=znver1 -fno-strict-aliasing -fno-omit-frame-pointer -Wformat=2 -Wno-unused-parameter -Wno-format-zero-length -DNV_LINUX -DNV_X86_64 -DNV_ARCH_BITS=64  -DNVIDIA_VERSION=\"440.59\"   -I . -I image_data -I ../src/libXNVCtrl -I XF86Config-parser/.. -I libXNVCtrlAttributes -I xpm_data -I common-utils -I common-unix/virtual-resolutions -I . -I /usr/include -I/usr/include/dbus-1.0 -I/usr/lib64/dbus-1.0/include -DPROGRAM_NAME=\"nvidia-settings\"  -fPIC -I XF86Config-parser/.. -c gtk+-2.x/ctkmultisample.c -o gtk2/ctkmultisample.o && x86_64-pc-linux-gnu-gcc -MM -O2 -march=znver1 -fno-strict-aliasing -fno-omit-frame-pointer -Wformat=2 -Wno-unused-parameter -Wno-format-zero-length -DNV_LINUX -DNV_X86_64 -DNV_ARCH_BITS=64  -DNVIDIA_VERSION=\"440.59\"   -I . -I image_data -I ../src/libXNVCtrl -I XF86Config-parser/.. -I libXNVCtrlAttributes -I xpm_data -I common-utils -I common-unix/virtual-resolutions -I . -I /usr/include -I/usr/include/dbus-1.0 -I/usr/lib64/dbus-1.0/include -DPROGRAM_NAME=\"nvidia-settings\"  -fPIC -I XF86Config-parser/.. gtk+-2.x/ctkmultisample.c | sed -e "s,: ,: $\(wildcard ," -e "s,\([^\\]\)$,\1)," -e "s;^ctkmultisample.o: ; ./gtk2/ctkmultisample.o: ;" > gtk2/ctkmultisample.d
gtk+-2.x/ctkgauge.c:20:10: fatal error: gtk/gtk.h: No such file or directory
   20 | #include <gtk/gtk.h>
      |          ^~~~~~~~~~~
compilation terminated.
make: *** [Makefile:309: gtk2/ctkgauge.o] Error 1
gtk+-2.x/ctkcurve.c:20:10: fatal error: gtk/gtk.h: No such file or directory
   20 | #include <gtk/gtk.h>
      |          ^~~~~~~~~~~
compilation terminated.
make: *** [Makefile:309: gtk2/ctkcurve.o] Error 1
gtk+-2.x/ctkcolorcorrectionpage.c:20:10: fatal error: gtk/gtk.h: No such file or directory
   20 | #include <gtk/gtk.h>
      |          ^~~~~~~~~~~
compilation terminated.
gtk+-2.x/ctkcolorcorrection.c:20:10: fatal error: gtk/gtk.h: No such file or directory
   20 | #include <gtk/gtk.h>
      |          ^~~~~~~~~~~
compilation terminated.
make: *** [Makefile:309: gtk2/ctkcolorcorrectionpage.o] Error 1
make: *** [Makefile:309: gtk2/ctkcolorcorrection.o] Error 1
gtk+-2.x/ctkscale.c:20:10: fatal error: gtk/gtk.h: No such file or directory
   20 | #include <gtk/gtk.h>
      |          ^~~~~~~~~~~
compilation terminated.
make: *** [Makefile:309: gtk2/ctkscale.o] Error 1
gtk+-2.x/ctkxvideo.c:22:10: fatal error: gtk/gtk.h: No such file or directory
   22 | #include <gtk/gtk.h>
      |          ^~~~~~~~~~~
compilation terminated.
make: *** [Makefile:309: gtk2/ctkxvideo.o] Error 1
gtk+-2.x/ctkmultisample.c:20:10: fatal error: gtk/gtk.h: No such file or directory
   20 | #include <gtk/gtk.h>
      |          ^~~~~~~~~~~
compilation terminated.
make: *** [Makefile:309: gtk2/ctkmultisample.o] Error 1
make: Leaving directory '/var/tmp/portage/x11-drivers/nvidia-drivers-440.59/work/nvidia-settings-440.59/src'
 * ERROR: x11-drivers/nvidia-drivers-440.59::gentoo failed (compile phase):
 *   emake failed


Sind das fehlende gtk Header? Wenn ja, welches Paket fehlt denn da? Installiert ist dies hier:
Code:

[I] x11-libs/gtk+
     Verfügbare Versionen:   
     (2)    2.24.32-r1^t
     (3)    3.24.11^t 3.24.13^t ~3.24.14^t
       {+X aqua broadway cloudprint colord cups examples gtk-doc +introspection test vim-syntax wayland xinerama ABI_MIPS="n32 n64 o32" ABI_RISCV="lp64 lp64d" ABI_S390="32 64" ABI_X86="32 64 x32"}
     Installierte Versionen: 2.24.32-r1(2)^t(11:41:57 05.12.2018)(cups introspection -aqua -examples -test -vim-syntax -xinerama ABI_MIPS="-n32 -n64 -o32" ABI_PPC="-32 -64" ABI_S390="-32 -64" ABI_X86="64 -32 -x32") 3.24.13(3)^t(11:47:12 01.02.2020)(X cups introspection -aqua -broadway -cloudprint -colord -examples -gtk-doc -test -vim-syntax -wayland -xinerama ABI_MIPS="-n32 -n64 -o32" ABI_RISCV="-lp64 -lp64d" ABI_S390="-32 -64" ABI_X86="64 -32 -x32")
     Startseite:             https://www.gtk.org/
     Beschreibung:           Gimp ToolKit +

_________________
Linux ryzen 4.19.97-gentoo #1 SMP Fri Mar 27 09:10:25 CET 2020 x86_64 AMD Ryzen 7 3700X 8-Core Processor AuthenticAMD GNU/Linux
Back to top
View user's profile Send private message
Josef.95
Advocate
Advocate


Joined: 03 Sep 2007
Posts: 3809
Location: Germany

PostPosted: Sun Mar 15, 2020 9:55 pm    Post subject: Reply with quote

Huh ja, seltsam (könnte wild geraten an den vielen make Jobs liegen). Aber, aktuell scheitert es beim nvidia-drivers Paket beim bauen der nvidia-settings -- die könnte man erst mal temporär ausschließen. Aktuell ist es erst mal wichtig das nvidia-drivers mit USE=libglvnd gebaut und installiert wird.
Vorschlag: Versuche mal bitte ein rebuild via
Code:
MAKEOPTS="-j1" USE="-tools" emerge -av1O nvidia-drivers

Und danach dann ein normales
Code:
emerge -avuDN @world
Update. Das sollte dann (hoffentlich) in passender Reihenfolge fertig bauen.
Back to top
View user's profile Send private message
michael_w
Guru
Guru


Joined: 22 Feb 2006
Posts: 438
Location: 09xxx

PostPosted: Mon Mar 16, 2020 8:06 am    Post subject: Reply with quote

Josef.95 wrote:
Huh ja, seltsam (könnte wild geraten an den vielen make Jobs liegen). Aber, aktuell scheitert es beim nvidia-drivers Paket beim bauen der nvidia-settings -- die könnte man erst mal temporär ausschließen. Aktuell ist es erst mal wichtig das nvidia-drivers mit USE=libglvnd gebaut und installiert wird.
Vorschlag: Versuche mal bitte ein rebuild via
Code:
MAKEOPTS="-j1" USE="-tools" emerge -av1O nvidia-drivers

Und danach dann ein normales
Code:
emerge -avuDN @world
Update. Das sollte dann (hoffentlich) in passender Reihenfolge fertig bauen.


Danke Josef, hat geholfen.
_________________
Linux ryzen 4.19.97-gentoo #1 SMP Fri Mar 27 09:10:25 CET 2020 x86_64 AMD Ryzen 7 3700X 8-Core Processor AuthenticAMD GNU/Linux
Back to top
View user's profile Send private message
Display posts from previous:   
Reply to topic    Gentoo Forums Forum Index Deutsches Forum (German) All times are GMT
Page 1 of 1

 
Jump to:  
You cannot post new topics in this forum
You cannot reply to topics in this forum
You cannot edit your posts in this forum
You cannot delete your posts in this forum
You cannot vote in polls in this forum