Gentoo Forums
Gentoo Forums
Gentoo Forums
Quick Search: in
[Install]Error emerging hfsplusutils on iBook G4 933Mhz
View unanswered posts
View posts from last 24 hours

 
Reply to topic    Gentoo Forums Forum Index Gentoo on PPC
View previous topic :: View next topic  
Author Message
leonida
Tux's lil' helper
Tux's lil' helper


Joined: 23 Jun 2004
Posts: 103
Location: Milano-Italia

PostPosted: Fri Jul 02, 2004 9:31 am    Post subject: [Install]Error emerging hfsplusutils on iBook G4 933Mhz Reply with quote

I'm installing for the first time Gentoo from Live CD from stage 1 using network.
I read also this topics
hfsplusutils fail to build
error emerging hfsplusutils
hfsplusutils fails to compile
Autoconf Seg Fault When Merging hfsplusutils

But, after the bootstrap, from stage 2 to stage 3, while I run # emerge system, I get (same as tipics above) this error emerging hfsplusutils-1.0.4-r1

Code:
>>> Source unpacked.
aclocal
autoconf
autoheader
automake -a
automake-1.5: configure.in: installing `./install-sh'
automake-1.5: configure.in: installing `./mkinstalldirs'
automake-1.5: configure.in: installing `./missing'
configure.in: 224: required file `./ltmain.sh' not found
automake-1.5: configure.in: installing `./depcomp'
/usr/share/automake-1.5/am/depend2.am: AMDEP does not appear in AM_CONDITIONAL
/usr/share/automake-1.5/am/depend2.am: AMDEP does not appear in AM_CONDITIONAL
/usr/share/automake-1.5/am/depend2.am: AMDEP does not appear in AM_CONDITIONAL
/usr/share/automake-1.5/am/lang-compile.am: AMDEP does not appear in AM_CONDITIONAL
/usr/share/automake-1.5/am/depend2.am: AMDEP does not appear in AM_CONDITIONAL
/usr/share/automake-1.5/am/depend2.am: AMDEP does not appear in AM_CONDITIONAL
/usr/share/automake-1.5/am/depend2.am: AMDEP does not appear in AM_CONDITIONAL
/usr/share/automake-1.5/am/lang-compile.am: AMDEP does not appear in AM_CONDITIONAL
/usr/share/automake-1.5/am/depend2.am: AMDEP does not appear in AM_CONDITIONAL
/usr/share/automake-1.5/am/depend2.am: AMDEP does not appear in AM_CONDITIONAL
/usr/share/automake-1.5/am/depend2.am: AMDEP does not appear in AM_CONDITIONAL
/usr/share/automake-1.5/am/lang-compile.am: AMDEP does not appear in AM_CONDITIONAL
make: *** [all] Error 1

!!! ERROR: sys-fs/hfsplusutils-1.0.4-r1 failed.
!!! Function src_compile, Line 35, Exitcode 2
!!! (no error message)


As in this topic I redo # emerge rsync... but whit no success.
I also run:
# emerge sync + # emerge portage + # emerge system... same error.

As error was using Automake 1.5, with # export WANT_AUTOMAKE=1.8 I get this:
Code:
>>> Source unpacked.
aclocal
/usr/share/aclocal/glib.m4:8: warning: underquoted definition of AM_PATH_GLIB
  run info '(automake)Extending aclocal'
  or see http://sources.redhat.com/automake/automake.html#Extending%20aclocal
autoconf
autoheader
automake -a
configure.in: installing `./install-sh'
configure.in: installing `./missing'
configure.in:27: installing `./config.guess'
configure.in:27: installing `./config.sub'
configure.in:72: required file `./ltmain.sh' not found
libhfsp/src/Makefile.am: installing `./depcomp'
libhfsp/src/Makefile.am:30: `CFLAGS' is a user variable, you should not override it;
libhfsp/src/Makefile.am:30: use `AM_CFLAGS' instead.
libhfsp/src/Makefile.am:30: `CFLAGS' is a user variable, you should not override it;
libhfsp/src/Makefile.am:30: use `AM_CFLAGS' instead.
make: *** [all] Error 1

!!! ERROR: sys-fs/hfsplusutils-1.0.4-r1 failed.
!!! Function src_compile, Line 35, Exitcode 2
!!! (no error message)


So I edited /var/tmp/portage/hfsplusutils*/work/*/libhfsp/src/Makefile.am
changing CFLAGS with AM_CFLAGS.
I run: # ebuild /usr/portage/sys-fs/hfsplusutils/hfsplusutils-1.0.4-r1.ebuild merge
And now error is (well only one :) ):

Code:
aclocal
/usr/share/aclocal/glib.m4:8: warning: underquoted definition of AM_PATH_GLIB
  run info '(automake)Extending aclocal'
  or see http://sources.redhat.com/automake/automake.html#Extending%20aclocal
autoconf
autoheader
automake -a
configure.in:72: required file `./ltmain.sh' not found

make: *** [all] Error 1

!!! ERROR: sys-fs/hfsplusutils-1.0.4-r1 failed.
!!! Function src_compile, Line 36, Exitcode 2
!!! (no error message)


I strictly follow Gentoo Handbook PPC and all my steps are tracked here

Info:
iBook G4 933mhz with internet connection
CHOST="powerpc-unknown-linux-gnu"
CFLAGS="-mcpu=7450 -O2 -pipe -maltivec -mabi=altivec -mpowerpc-gfxopt"
CXXFLAGS="${CFLAGS}"
ACCEPT_KEYWORDS="~ppc"
VIDEO_CARDS=radeon
MAKEOPTS="-j2"


Thanks .L.
Back to top
View user's profile Send private message
Display posts from previous:   
Reply to topic    Gentoo Forums Forum Index Gentoo on PPC All times are GMT
Page 1 of 1

 
Jump to:  
You cannot post new topics in this forum
You cannot reply to topics in this forum
You cannot edit your posts in this forum
You cannot delete your posts in this forum
You cannot vote in polls in this forum