Gentoo Forums
Gentoo Forums
Gentoo Forums
Quick Search: in
PHP 4
View unanswered posts
View posts from last 24 hours

 
Reply to topic    Gentoo Forums Forum Index Duplicate Threads
View previous topic :: View next topic  
Author Message
Belliash
Advocate
Advocate


Joined: 24 Nov 2004
Posts: 2452
Location: Wroclaw, Poland

PostPosted: Sun Mar 27, 2005 8:38 am    Post subject: PHP 4 Reply with quote

Code:
gcc  -Iext/ctype/ -I/var/tmp/portage/php-4.3.10/work/php-4.3.10/ext/ctype/ -DPHP_ATOM_INC -I/var/tmp/portage/php-4.3.10/work/php-4.3.10/include -I/var/tmp/portage/php-4.3.10/work/php-4.3.10/main -I/var/tmp/portage/php-4.3.10/work/php-4.3.10 -I/var/tmp/portage/php-4.3.10/work/php-4.3.10/Zend -I/usr/include/libxml2 -I/var/tmp/portage/php-4.3.10/work/php-4.3.10/ext/mbstring/mbregex -I/var/tmp/portage/php-4.3.10/work/php-4.3.10/ext/mbstring/libmbfl -I/var/tmp/portage/php-4.3.10/work/php-4.3.10/ext/mbstring/libmbfl/mbfl -I/usr/include/mysql -I/usr/include/pspell -I/usr/qt/3/include -I/var/tmp/portage/php-4.3.10/work/php-4.3.10/ext/xml/expat  -I/var/tmp/portage/php-4.3.10/work/php-4.3.10/TSRM  -march=athlon-xp -O2 -s -pipe -fomit-frame-pointer -mfpmath=sse -msse -mmmx -m3dnow  -c /var/tmp/portage/php-4.3.10/work/php-4.3.10/ext/ctype/ctype.c -o ext/ctype/ctype.o  && echo > ext/ctype/ctype.lo
In file included from /var/tmp/portage/php-4.3.10/work/php-4.3.10/ext/crack/crack.c:30:
/usr/include/packer.h:28: error: parse error before "uint32_t"
/usr/include/packer.h:30: error: parse error before "pih_blocklen"
/usr/include/packer.h:31: error: parse error before "pih_pad"
/usr/include/packer.h:40: error: parse error before "uint32_t"
/usr/include/packer.h:50: error: conflicting types for 'data'
/var/tmp/portage/php-4.3.10/work/php-4.3.10/main/php.h:259: error: previous declaration of 'data' was here
/usr/include/packer.h:50: error: conflicting types for 'data'
/var/tmp/portage/php-4.3.10/work/php-4.3.10/main/php.h:259: error: previous declaration of 'data' was here
/usr/include/packer.h:51: error: parse error before '}' token
/usr/include/packer.h:56: error: parse error before '*' token
/var/tmp/portage/php-4.3.10/work/php-4.3.10/ext/crack/crack.c:32: error: parse error before '*' token
/var/tmp/portage/php-4.3.10/work/php-4.3.10/ext/crack/crack.c:33: error: parse error before '*' token
/var/tmp/portage/php-4.3.10/work/php-4.3.10/ext/crack/crack.c: In function `_crack_open_dict':
/var/tmp/portage/php-4.3.10/work/php-4.3.10/ext/crack/crack.c:71: error: `pwdict' undeclared (first use in this function)
/var/tmp/portage/php-4.3.10/work/php-4.3.10/ext/crack/crack.c:71: error: (Each undeclared identifier is reported only once
/var/tmp/portage/php-4.3.10/work/php-4.3.10/ext/crack/crack.c:71: error: for each function it appears in.)
/var/tmp/portage/php-4.3.10/work/php-4.3.10/ext/crack/crack.c: At top level:
/var/tmp/portage/php-4.3.10/work/php-4.3.10/ext/crack/crack.c:99: error: parse error before '*' token
/var/tmp/portage/php-4.3.10/work/php-4.3.10/ext/crack/crack.c: In function `_close_crack_dict':
/var/tmp/portage/php-4.3.10/work/php-4.3.10/ext/crack/crack.c:101: error: `pwdict' undeclared (first use in this function)
/var/tmp/portage/php-4.3.10/work/php-4.3.10/ext/crack/crack.c: In function `zif_crack_closedict':
/var/tmp/portage/php-4.3.10/work/php-4.3.10/ext/crack/crack.c:176: error: `pwdict' undeclared (first use in this function)
/var/tmp/portage/php-4.3.10/work/php-4.3.10/ext/crack/crack.c:199: error: parse error before ')' token
/var/tmp/portage/php-4.3.10/work/php-4.3.10/ext/crack/crack.c: In function `zif_crack_check':
/var/tmp/portage/php-4.3.10/work/php-4.3.10/ext/crack/crack.c:216: error: `pwdict' undeclared (first use in this function)
/var/tmp/portage/php-4.3.10/work/php-4.3.10/ext/crack/crack.c:239: error: parse error before ')' token
/var/tmp/portage/php-4.3.10/work/php-4.3.10/ext/crack/crack.c: At top level:
/usr/include/packer.h:47: error: storage size of `header' isn't known
make: *** [ext/crack/crack.lo] Error 1
make: *** Waiting for unfinished jobs....

!!! ERROR: dev-php/php-4.3.10 failed.
!!! Function php-sapi_src_compile, Line 544, Exitcode 2
!!! compile problem
!!! If you need support, post the topmost build error, NOT this status message.


How can I emerge it?
Back to top
View user's profile Send private message
Earthwings
Bodhisattva
Bodhisattva


Joined: 14 Apr 2003
Posts: 7753
Location: Karlsruhe, Germany

PostPosted: Sun Mar 27, 2005 9:22 am    Post subject: Reply with quote

Moved to dups, https://forums.gentoo.org/viewtopic-t-314647-highlight-.html
Back to top
View user's profile Send private message
Display posts from previous:   
Reply to topic    Gentoo Forums Forum Index Duplicate Threads All times are GMT
Page 1 of 1

 
Jump to:  
You cannot post new topics in this forum
You cannot reply to topics in this forum
You cannot edit your posts in this forum
You cannot delete your posts in this forum
You cannot vote in polls in this forum