Gentoo Forums
Gentoo Forums
Gentoo Forums
Quick Search: in
[OPGELOST] KDElibs wil niet compilen
View unanswered posts
View posts from last 24 hours

 
Reply to topic    Gentoo Forums Forum Index Dutch
View previous topic :: View next topic  
Author Message
superstoned
Guru
Guru


Joined: 17 Dec 2004
Posts: 432

PostPosted: Thu Mar 31, 2005 10:22 am    Post subject: [OPGELOST] KDElibs wil niet compilen Reply with quote

een test met de naam kurltest werkt niet. hierop blijft kdelibs hangen. dit was het geval bij KDE 3.3.2, kde 3.4 en kde 3.4 split ebuilds. er is een bugreport, maar dat hangt al een tijdje. heb ik iets niet goed staan wat betreft dcop ofzow? heeft iemand een tip hoe dit op te lossen?

Ik erger me een beetje, mn eerste gentoo ervaring is 4 dagen klooien en nog niet uit de commandline kunnen komen (gtk compiled niet, maar goed, dat hoef ik ook niet echt, en kdelibs compiled niet. beiden de x86 en ~x86 versies).

De foutmelding van kde-libs
(cut)
make[3]: Leaving directory `/var/tmp/portage/kdelibs-3.4.0/work/kdelibs-3.4.0/kdecore/tests'
make check-TESTS
make[3]: Entering directory `/var/tmp/portage/kdelibs-3.4.0/work/kdelibs-3.4.0/kdecore/tests'
There was an error setting up inter-process communications for KDE. The message returned by the system was:

Could not read network connection list.
/var/tmp/portage/kdelibs-3.4.0/temp/fakehome/.DCOPserver_wietbak_NODISPLAY

Please check that the "dcopserver" program is running!

* Empty URL

* URL is file:///home/dfaure/file.txt

* URL is file:///home/dfaure/

* URL is ftp://ftp.kde.org/

* URL is file:///home/dfaure/my%20tar%20file.tgz#gzip:/#tar:/README

* URL is print:/specials/Print%20To%20File%20(PDF%2FAcrobat)

* URL is file:///specials/Print

* URL is ftp://host/dir1/dir2/myfile.txt

* URL is ftp://ftp.de.kde.org
FAIL: kurltest
PASS: kstdacceltest
===================
1 of 2 tests failed
===================
make[3]: *** [check-TESTS] Error 1
make[3]: Leaving directory `/var/tmp/portage/kdelibs-3.4.0/work/kdelibs-3.4.0/kdecore/tests'
make[2]: *** [check-am] Error 2
make[2]: Leaving directory `/var/tmp/portage/kdelibs-3.4.0/work/kdelibs-3.4.0/kdecore/tests'
make[1]: *** [check-recursive] Error 1
make[1]: Leaving directory `/var/tmp/portage/kdelibs-3.4.0/work/kdelibs-3.4.0/kdecore'
make: *** [check-recursive] Error 1

== ik heb een paar dingetjes in make.conf veranderd (ik had de cflags al op -O2 staan, btw, heb de LDFLAGS verwijderd, en de useflags nog wat versimpeld). zien of dat werkt, zo niet, nou ja dan horen jullie het wel.
Back to top
View user's profile Send private message
Braempje
l33t
l33t


Joined: 31 Jan 2003
Posts: 748

PostPosted: Thu Mar 31, 2005 1:16 pm    Post subject: Reply with quote

Volgens mij is het iets heel raars, want hij verwacht dat er een KDE draait tijdens die test, dus tijdens de compilatie?
Misschien moet je eens horen bij de KDE developpers op hun bugzilla.
_________________
Dictionary of the Flemish Sign Language - Woordenboek Vlaamse Gebarentaal
Back to top
View user's profile Send private message
superstoned
Guru
Guru


Joined: 17 Dec 2004
Posts: 432

PostPosted: Thu Mar 31, 2005 2:12 pm    Post subject: Reply with quote

Braempje wrote:
Volgens mij is het iets heel raars, want hij verwacht dat er een KDE draait tijdens die test, dus tijdens de compilatie?
Misschien moet je eens horen bij de KDE developpers op hun bugzilla.


mja, het is inderdaad vreemd. maar wat ik niet snap is dat het kennelijk bij iedereen werkt...

ik doe niets bijzonders. heb gewoon een standaard cleane install, en probeer nu om kde erop te krijgen... geen rare cflags of wat dan ook.

maar ik zal bugs.kde.org eens bezoeken.
Back to top
View user's profile Send private message
superstoned
Guru
Guru


Joined: 17 Dec 2004
Posts: 432

PostPosted: Thu Mar 31, 2005 3:45 pm    Post subject: Reply with quote

op gentoo's bugzilla dacht men dat het gentoo's foutje is, dus ik hoop maar dat ze et kunnen fixen. ik heb het idee dat het probleem alleen speelt bij een verse install, vandaar dat het ff duurt voor het gefixed is.
Back to top
View user's profile Send private message
superstoned
Guru
Guru


Joined: 17 Dec 2004
Posts: 432

PostPosted: Fri Apr 01, 2005 1:01 pm    Post subject: Reply with quote

na nog wat gesnuffeld te hebben, viel het me op dat alles mis liep op een of andere test. nu stond er tussen mijn FEATURES in make.conf "maketests" ofzoiets. eruit geknikkerd - probleem opgelost. tja... misschien werkt alles niet perfect, gezien het feit dat die tests ook mislukken, maar liever iets dan niets. met een bug of wat kan ik wel leven, ik heb altijd instabiele software gebruikt. ik chroot suse wel in als ik stabiel wil.
Back to top
View user's profile Send private message
Display posts from previous:   
Reply to topic    Gentoo Forums Forum Index Dutch All times are GMT
Page 1 of 1

 
Jump to:  
You cannot post new topics in this forum
You cannot reply to topics in this forum
You cannot edit your posts in this forum
You cannot delete your posts in this forum
You cannot vote in polls in this forum