Gentoo Forums
Gentoo Forums
Gentoo Forums
Quick Search: in
libpython2.3.so.1.0 gone during 'emerge -uD world' SOLVED
View unanswered posts
View posts from last 24 hours

 
Reply to topic    Gentoo Forums Forum Index Duplicate Threads
View previous topic :: View next topic  
Author Message
andreas2000
Tux's lil' helper
Tux's lil' helper


Joined: 02 Nov 2004
Posts: 143
Location: Austria/Vienna

PostPosted: Sun May 01, 2005 9:48 am    Post subject: libpython2.3.so.1.0 gone during 'emerge -uD world' SOLVED Reply with quote

Hello everybody,

today I have a very very urgent thing to get cleared. I did today an 'emerge -uD world' and during upgrading of python the emerge crashed - it was during compilation - I don't have the error message any more...

But what has happened: the libpython2.3.so.1.0 file is gone - so no more emerge, env-update or something else possible...

Any idea how I can get it back? I've already tried to compile python2.3.5 manually - but no libpython2.3.so.0.1 is created.

Thanks for your answers and have a nice day!
_________________
Registered Linux User 371244


Last edited by andreas2000 on Sun May 01, 2005 4:45 pm; edited 1 time in total
Back to top
View user's profile Send private message
Briaj
n00b
n00b


Joined: 01 May 2005
Posts: 3

PostPosted: Sun May 01, 2005 10:08 am    Post subject: Reply with quote

Hi! I have seen the same error on my 'emerge -uDv system':

i686-pc-linux-gnu-gcc: glibc: No existe el fichero o el directorio
ln: accediendo a «libpython2.3.so.1.0»: No existe el fichero o el directorio
make: *** [libpython2.3.so] Error 1
make: *** Se espera a que terminen otras tareas....
ar cr libpython2.3.a Modules/config.o Modules/getpath.o Modules/main.o Modules/gcmodule.o
make: *** Se espera a que terminen otras tareas....
ar cr libpython2.3.a Modules/threadmodule.o Modules/signalmodule.o Modules/posixmodule.o Modules/errnomodule.o Modules/_sre.o Modules/_codecsmodule.o Modules/zipimport.o Modules/symtablemodule.o Modules/xxsubtype.o
make: *** Se espera a que terminen otras tareas....
i686-pc-linux-gnu-ranlib libpython2.3.a
make: *** Se espera a que terminen otras tareas....

!!! ERROR: dev-lang/python-2.3.5 failed.
!!! Function src_compile, Line 133, Exitcode 2
!!! Parallel make failed

I hope this doesn't break the emege utilities.... thank you all.
Back to top
View user's profile Send private message
Briaj
n00b
n00b


Joined: 01 May 2005
Posts: 3

PostPosted: Sun May 01, 2005 10:12 am    Post subject: Reply with quote

Hi again... I have seen the two libraries at /usr/lib, but during compilation it returns the same error:

ls -l /usr/lib/libpython2.3.so*
lrwxrwxrwx 1 root root 19 feb 13 11:37 /usr/lib/libpython2.3.so -> libpython2.3.so.1.0
-r-xr-xr-x 1 root root 1071968 feb 13 11:37 /usr/lib/libpython2.3.so.1.0

Thank you all again.
Back to top
View user's profile Send private message
andreas2000
Tux's lil' helper
Tux's lil' helper


Joined: 02 Nov 2004
Posts: 143
Location: Austria/Vienna

PostPosted: Sun May 01, 2005 11:34 am    Post subject: Reply with quote

hello again,

no chance - my libs are absolutely gone. They are not in /usr/lib or somewhere else on my harddisk... How can I get this fixed? Any ideas?
_________________
Registered Linux User 371244
Back to top
View user's profile Send private message
Fifre
n00b
n00b


Joined: 29 Jul 2003
Posts: 61

PostPosted: Sun May 01, 2005 11:36 am    Post subject: Reply with quote

help ... I've the same error....
Back to top
View user's profile Send private message
IvanYosifov
l33t
l33t


Joined: 15 Oct 2004
Posts: 778
Location: Bulgaria

PostPosted: Sun May 01, 2005 11:40 am    Post subject: Reply with quote

Get a python binary from http://dev.gentoo.org/~avenj/bins/i686/ and reemrge python.

Quote:

my libs are absolutely gone

Could you HDD be duying ?
Back to top
View user's profile Send private message
gurke
Apprentice
Apprentice


Joined: 10 Jul 2003
Posts: 260

PostPosted: Sun May 01, 2005 12:06 pm    Post subject: Reply with quote

https://bugs.gentoo.org/show_bug.cgi?id=91024

me too
Back to top
View user's profile Send private message
andreas2000
Tux's lil' helper
Tux's lil' helper


Joined: 02 Nov 2004
Posts: 143
Location: Austria/Vienna

PostPosted: Sun May 01, 2005 12:07 pm    Post subject: Reply with quote

ok - the files now are here, but emerge python is still failing with:

Code:

i686-pc-linux-gnu-gcc: glibc: No such file or directory
ln: accessing `libpython2.3.so.1.0': No such file or directory
make: *** [libpython2.3.so] Error 1
make: *** Waiting for unfinished jobs....
ar cr libpython2.3.a Objects/abstract.o Objects/boolobject.o Objects/bufferobject.o Objects/cellobject.o Objects/classobject.o Objects/cobject.o Objects/complexobject.o Objects/descrobject.o Objects/enumobject.o Objects/fileobject.o Objects/floatobject.o Objects/frameobject.o Objects/funcobject.o Objects/intobject.o Objects/iterobject.o Objects/listobject.o Objects/longobject.o Objects/dictobject.o Objects/methodobject.o Objects/moduleobject.o Objects/object.o Objects/obmalloc.o Objects/rangeobject.o Objects/sliceobject.o Objects/stringobject.o Objects/structseq.o Objects/tupleobject.o Objects/typeobject.o Objects/weakrefobject.o Objects/unicodeobject.o Objects/unicodectype.o
make: *** Waiting for unfinished jobs....
ar cr libpython2.3.a Python/bltinmodule.o Python/exceptions.o Python/ceval.o Python/compile.o Python/codecs.o Python/errors.o Python/frozen.o Python/frozenmain.o Python/future.o Python/getargs.o Python/getcompiler.o Python/getcopyright.o Python/getmtime.o Python/getplatform.o Python/getversion.o Python/graminit.o Python/import.o Python/importdl.o Python/marshal.o Python/modsupport.o Python/mystrtoul.o Python/mysnprintf.o Python/pyfpe.o Python/pystate.o Python/pythonrun.o Python/structmember.o Python/symtable.o Python/sysmodule.o Python/traceback.o Python/getopt.o Python/dynload_shlib.o  Python/thread.o
make: *** Waiting for unfinished jobs....
ar cr libpython2.3.a Modules/config.o Modules/getpath.o Modules/main.o Modules/gcmodule.o
make: *** Waiting for unfinished jobs....
ar cr libpython2.3.a Modules/threadmodule.o  Modules/signalmodule.o  Modules/posixmodule.o  Modules/errnomodule.o  Modules/_sre.o  Modules/_codecsmodule.o  Modules/zipimport.o  Modules/symtablemodule.o  Modules/xxsubtype.o
make: *** Waiting for unfinished jobs....
i686-pc-linux-gnu-ranlib libpython2.3.a
make: *** Waiting for unfinished jobs....

!!! ERROR: dev-lang/python-2.3.5 failed.
!!! Function src_compile, Line 133, Exitcode 2
!!! Parallel make failed
!!! If you need support, post the topmost build error, NOT this status message.

_________________
Registered Linux User 371244
Back to top
View user's profile Send private message
BlinkEye
Veteran
Veteran


Joined: 21 Oct 2003
Posts: 1046
Location: Gentoo Forums

PostPosted: Sun May 01, 2005 1:26 pm    Post subject: Reply with quote

i do have the same error while trying to set up a new box:
Code:
if test -f buildno; then \
        expr `cat buildno` + 1 >buildno1; \
        mv -f buildno1 buildno; \
else echo 1 >buildno; fi
gcc -pthread -c -fno-strict-aliasing -DNDEBUG -march=athlon-xp -Os -pipe -fomit-frame-pointer -I. -I./Include -fPIC -DPy_BUILD_CORE -DBUILD=`cat buildno` -o Modules/getbuildinfo.o ./Modules/getbuildinfo.c
rm -f libpython2.3.a
if test libpython2.3.so.1.0 != libpython2.3.so; then \
        gcc -pthread -shared -Wl,-hlibpython2.3.so.1.0 -o libpython2.3.so.1.0 Modules/getbuildinfo.o Parser/acceler.o Parser/grammar1.o Parser/listnode.o Parser/node.o Parser/parser.o Parser/parsetok.o Parser/bitset.o Parser/metagrammar.o Parser/firstsets.o Parser/grammar.o Parser/pgen.o Parser/myreadline.o Parser/tokenizer.o Objects/abstract.o Objects/boolobject.o Objects/bufferobject.o Objects/cellobject.o Objects/classobject.o Objects/cobject.o Objects/complexobject.o Objects/descrobject.o Objects/enumobject.o Objects/fileobject.o Objects/floatobject.o Objects/frameobject.o Objects/funcobject.o Objects/intobject.o Objects/iterobject.o Objects/listobject.o Objects/longobject.o Objects/dictobject.o Objects/methodobject.o Objects/moduleobject.o Objects/object.o Objects/obmalloc.o Objects/rangeobject.o Objects/sliceobject.o Objects/stringobject.o Objects/structseq.o Objects/tupleobject.o Objects/typeobject.o Objects/weakrefobject.o Objects/unicodeobject.o Objects/unicodectype.o Python/bltinmodule.o Python/exceptions.o Python/ceval.o Python/compile.o Python/codecs.o Python/errors.o Python/frozen.o Python/frozenmain.o Python/future.o Python/getargs.o Python/getcompiler.o Python/getcopyright.o Python/getmtime.o Python/getplatform.o Python/getversion.o Python/graminit.o Python/import.o Python/importdl.o Python/marshal.o Python/modsupport.o Python/mystrtoul.o Python/mysnprintf.o Python/pyfpe.o Python/pystate.o Python/pythonrun.o Python/structmember.o Python/symtable.o Python/sysmodule.o Python/traceback.o Python/getopt.o Python/dynload_shlib.o  Python/thread.o Modules/config.o Modules/getpath.o Modules/main.o Modules/gcmodule.o  Modules/threadmodule.o  Modules/signalmodule.o  Modules/posixmodule.o  Modules/errnomodule.o  Modules/_sre.o  Modules/_codecsmodule.o  Modules/zipimport.o  Modules/symtablemodule.o  Modules/xxsubtype.o -lpthread -ldl  -lutil glibc -lm; \
        ln -f libpython2.3.so.1.0 libpython2.3.so; \
else\
        gcc -pthread -shared -o libpython2.3.so Modules/getbuildinfo.o Parser/acceler.o Parser/grammar1.o Parser/listnode.o Parser/node.o Parser/parser.o Parser/parsetok.o Parser/bitset.o Parser/metagrammar.o Parser/firstsets.o Parser/grammar.o Parser/pgen.o Parser/myreadline.o Parser/tokenizer.o Objects/abstract.o Objects/boolobject.o Objects/bufferobject.o Objects/cellobject.o Objects/classobject.o Objects/cobject.o Objects/complexobject.o Objects/descrobject.o Objects/enumobject.o Objects/fileobject.o Objects/floatobject.o Objects/frameobject.o Objects/funcobject.o Objects/intobject.o Objects/iterobject.o Objects/listobject.o Objects/longobject.o Objects/dictobject.o Objects/methodobject.o Objects/moduleobject.o Objects/object.o Objects/obmalloc.o Objects/rangeobject.o Objects/sliceobject.o Objects/stringobject.o Objects/structseq.o Objects/tupleobject.o Objects/typeobject.o Objects/weakrefobject.o Objects/unicodeobject.o Objects/unicodectype.o Python/bltinmodule.o Python/exceptions.o Python/ceval.o Python/compile.o Python/codecs.o Python/errors.o Python/frozen.o Python/frozenmain.o Python/future.o Python/getargs.o Python/getcompiler.o Python/getcopyright.o Python/getmtime.o Python/getplatform.o Python/getversion.o Python/graminit.o Python/import.o Python/importdl.o Python/marshal.o Python/modsupport.o Python/mystrtoul.o Python/mysnprintf.o Python/pyfpe.o Python/pystate.o Python/pythonrun.o Python/structmember.o Python/symtable.o Python/sysmodule.o Python/traceback.o Python/getopt.o Python/dynload_shlib.o  Python/thread.o Modules/config.o Modules/getpath.o Modules/main.o Modules/gcmodule.o  Modules/threadmodule.o  Modules/signalmodule.o  Modules/posixmodule.o  Modules/errnomodule.o  Modules/_sre.o  Modules/_codecsmodule.o  Modules/zipimport.o  Modules/symtablemodule.o  Modules/xxsubtype.o -lpthread -ldl  -lutil glibc -lm; \
fi
ar cr libpython2.3.a Modules/getbuildinfo.o
ar cr libpython2.3.a Parser/acceler.o Parser/grammar1.o Parser/listnode.o Parser/node.o Parser/parser.o Parser/parsetok.o Parser/bitset.o Parser/metagrammar.o Parser/firstsets.o Parser/grammar.o Parser/pgen.o Parser/myreadline.o Parser/tokenizer.o
gcc: glibc: No such file or directory
ln: accessing `libpython2.3.so.1.0': No such file or directory
make: *** [libpython2.3.so] Error 1
make: *** Waiting for unfinished jobs....
ar cr libpython2.3.a Objects/abstract.o Objects/boolobject.o Objects/bufferobject.o Objects/cellobject.o Objects/classobject.o Objects/cobject.o Objects/complexobject.o Objects/descrobject.o Objects/enumobject.o Objects/fileobject.o Objects/floatobject.o Objects/frameobject.o Objects/funcobject.o Objects/intobject.o Objects/iterobject.o Objects/listobject.o Objects/longobject.o Objects/dictobject.o Objects/methodobject.o Objects/moduleobject.o Objects/object.o Objects/obmalloc.o Objects/rangeobject.o Objects/sliceobject.o Objects/stringobject.o Objects/structseq.o Objects/tupleobject.o Objects/typeobject.o Objects/weakrefobject.o Objects/unicodeobject.o Objects/unicodectype.o
make: *** Waiting for unfinished jobs....
ar cr libpython2.3.a Python/bltinmodule.o Python/exceptions.o Python/ceval.o Python/compile.o Python/codecs.o Python/errors.o Python/frozen.o Python/frozenmain.o Python/future.o Python/getargs.o Python/getcompiler.o Python/getcopyright.o Python/getmtime.o Python/getplatform.o Python/getversion.o Python/graminit.o Python/import.o Python/importdl.o Python/marshal.o Python/modsupport.o Python/mystrtoul.o Python/mysnprintf.o Python/pyfpe.o Python/pystate.o Python/pythonrun.o Python/structmember.o Python/symtable.o Python/sysmodule.o Python/traceback.o Python/getopt.o Python/dynload_shlib.o  Python/thread.o
make: *** Waiting for unfinished jobs....
ar cr libpython2.3.a Modules/config.o Modules/getpath.o Modules/main.o Modules/gcmodule.o
make: *** Waiting for unfinished jobs....
ar cr libpython2.3.a Modules/threadmodule.o  Modules/signalmodule.o  Modules/posixmodule.o  Modules/errnomodule.o  Modules/_sre.o  Modules/_codecsmodule.o  Modules/zipimport.o  Modules/symtablemodule.o  Modules/xxsubtype.o
make: *** Waiting for unfinished jobs....
i686-pc-linux-gnu-ranlib libpython2.3.a
make: *** Waiting for unfinished jobs....

!!! ERROR: dev-lang/python-2.3.5 failed.
!!! Function src_compile, Line 133, Exitcode 2
!!! Parallel make failed
!!! If you need support, post the topmost build error, NOT this status message.

i do have a /usr/lib/libpython2.3.so.1.0 so i don't get the error message:
Code:
ln: accessing `libpython2.3.so.1.0': No such file or directory

any ideas? merging python-2.3.4-r1 doesn't work neither:
Code:
if test -f buildno; then \
        expr `cat buildno` + 1 >buildno1; \
        mv -f buildno1 buildno; \
else echo 1 >buildno; fi
gcc -pthread -c -fno-strict-aliasing -DNDEBUG -march=athlon-xp -Os -pipe -fomit-frame-pointer -I. -I./Include -fPIC -DPy_BUILD_CORE -DBUILD=`cat buildno` -o Modules/getbuildinfo.o ./Modules/getbuildinfo.c
rm -f libpython2.3.a
if test libpython2.3.so.1.0 != libpython2.3.so; then \
        gcc -pthread -shared -Wl,-soname=libpython2.3.so.1.0 -o libpython2.3.so.1.0 Modules/getbuildinfo.o Parser/acceler.o Parser/grammar1.o Parser/listnode.o Parser/node.o Parser/parser.o Parser/parsetok.o Parser/bitset.o Parser/metagrammar.o Parser/firstsets.o Parser/grammar.o Parser/pgen.o Parser/myreadline.o Parser/tokenizer.o Objects/abstract.o Objects/boolobject.o Objects/bufferobject.o Objects/cellobject.o Objects/classobject.o Objects/cobject.o Objects/complexobject.o Objects/descrobject.o Objects/enumobject.o Objects/fileobject.o Objects/floatobject.o Objects/frameobject.o Objects/funcobject.o Objects/intobject.o Objects/iterobject.o Objects/listobject.o Objects/longobject.o Objects/dictobject.o Objects/methodobject.o Objects/moduleobject.o Objects/object.o Objects/obmalloc.o Objects/rangeobject.o Objects/sliceobject.o Objects/stringobject.o Objects/structseq.o Objects/tupleobject.o Objects/typeobject.o Objects/weakrefobject.o Objects/unicodeobject.o Objects/unicodectype.o Python/bltinmodule.o Python/exceptions.o Python/ceval.o Python/compile.o Python/codecs.o Python/errors.o Python/frozen.o Python/frozenmain.o Python/future.o Python/getargs.o Python/getcompiler.o Python/getcopyright.o Python/getmtime.o Python/getplatform.o Python/getversion.o Python/graminit.o Python/import.o Python/importdl.o Python/marshal.o Python/modsupport.o Python/mystrtoul.o Python/mysnprintf.o Python/pyfpe.o Python/pystate.o Python/pythonrun.o Python/structmember.o Python/symtable.o Python/sysmodule.o Python/traceback.o Python/getopt.o Python/dynload_shlib.o  Python/thread.o Modules/config.o Modules/getpath.o Modules/main.o Modules/gcmodule.o  Modules/threadmodule.o  Modules/signalmodule.o  Modules/posixmodule.o  Modules/errnomodule.o  Modules/_sre.o  Modules/_codecsmodule.o  Modules/zipimport.o  Modules/symtablemodule.o  Modules/xxsubtype.o -lpthread -ldl  -lutil glibc -lm; \
        ln -f libpython2.3.so.1.0 libpython2.3.so; \
else\
        gcc -pthread -shared -o libpython2.3.so Modules/getbuildinfo.o Parser/acceler.o Parser/grammar1.o Parser/listnode.o Parser/node.o Parser/parser.o Parser/parsetok.o Parser/bitset.o Parser/metagrammar.o Parser/firstsets.o Parser/grammar.o Parser/pgen.o Parser/myreadline.o Parser/tokenizer.o Objects/abstract.o Objects/boolobject.o Objects/bufferobject.o Objects/cellobject.o Objects/classobject.o Objects/cobject.o Objects/complexobject.o Objects/descrobject.o Objects/enumobject.o Objects/fileobject.o Objects/floatobject.o Objects/frameobject.o Objects/funcobject.o Objects/intobject.o Objects/iterobject.o Objects/listobject.o Objects/longobject.o Objects/dictobject.o Objects/methodobject.o Objects/moduleobject.o Objects/object.o Objects/obmalloc.o Objects/rangeobject.o Objects/sliceobject.o Objects/stringobject.o Objects/structseq.o Objects/tupleobject.o Objects/typeobject.o Objects/weakrefobject.o Objects/unicodeobject.o Objects/unicodectype.o Python/bltinmodule.o Python/exceptions.o Python/ceval.o Python/compile.o Python/codecs.o Python/errors.o Python/frozen.o Python/frozenmain.o Python/future.o Python/getargs.o Python/getcompiler.o Python/getcopyright.o Python/getmtime.o Python/getplatform.o Python/getversion.o Python/graminit.o Python/import.o Python/importdl.o Python/marshal.o Python/modsupport.o Python/mystrtoul.o Python/mysnprintf.o Python/pyfpe.o Python/pystate.o Python/pythonrun.o Python/structmember.o Python/symtable.o Python/sysmodule.o Python/traceback.o Python/getopt.o Python/dynload_shlib.o  Python/thread.o Modules/config.o Modules/getpath.o Modules/main.o Modules/gcmodule.o  Modules/threadmodule.o  Modules/signalmodule.o  Modules/posixmodule.o  Modules/errnomodule.o  Modules/_sre.o  Modules/_codecsmodule.o  Modules/zipimport.o  Modules/symtablemodule.o  Modules/xxsubtype.o -lpthread -ldl  -lutil glibc -lm; \
fi
ar cr libpython2.3.a Modules/getbuildinfo.o
gcc: glibc: No such file or directory
ar cr libpython2.3.a Parser/acceler.o Parser/grammar1.o Parser/listnode.o Parser/node.o Parser/parser.o Parser/parsetok.o Parser/bitset.o Parser/metagrammar.o Parser/firstsets.o Parser/grammar.o Parser/pgen.o Parser/myreadline.o Parser/tokenizer.o
ln: accessing `libpython2.3.so.1.0': No such file or directory
make: *** [libpython2.3.so] Error 1
make: *** Waiting for unfinished jobs....
ar cr libpython2.3.a Objects/abstract.o Objects/boolobject.o Objects/bufferobject.o Objects/cellobject.o Objects/classobject.o Objects/cobject.o Objects/complexobject.o Objects/descrobject.o Objects/enumobject.o Objects/fileobject.o Objects/floatobject.o Objects/frameobject.o Objects/funcobject.o Objects/intobject.o Objects/iterobject.o Objects/listobject.o Objects/longobject.o Objects/dictobject.o Objects/methodobject.o Objects/moduleobject.o Objects/object.o Objects/obmalloc.o Objects/rangeobject.o Objects/sliceobject.o Objects/stringobject.o Objects/structseq.o Objects/tupleobject.o Objects/typeobject.o Objects/weakrefobject.o Objects/unicodeobject.o Objects/unicodectype.o
make: *** Waiting for unfinished jobs....
ar cr libpython2.3.a Python/bltinmodule.o Python/exceptions.o Python/ceval.o Python/compile.o Python/codecs.o Python/errors.o Python/frozen.o Python/frozenmain.o Python/future.o Python/getargs.o Python/getcompiler.o Python/getcopyright.o Python/getmtime.o Python/getplatform.o Python/getversion.o Python/graminit.o Python/import.o Python/importdl.o Python/marshal.o Python/modsupport.o Python/mystrtoul.o Python/mysnprintf.o Python/pyfpe.o Python/pystate.o Python/pythonrun.o Python/structmember.o Python/symtable.o Python/sysmodule.o Python/traceback.o Python/getopt.o Python/dynload_shlib.o  Python/thread.o
make: *** Waiting for unfinished jobs....
ar cr libpython2.3.a Modules/config.o Modules/getpath.o Modules/main.o Modules/gcmodule.o
make: *** Waiting for unfinished jobs....
ar cr libpython2.3.a Modules/threadmodule.o  Modules/signalmodule.o  Modules/posixmodule.o  Modules/errnomodule.o  Modules/_sre.o  Modules/_codecsmodule.o  Modules/zipimport.o  Modules/symtablemodule.o  Modules/xxsubtype.o
make: *** Waiting for unfinished jobs....
i686-pc-linux-gnu-ranlib libpython2.3.a
make: *** Waiting for unfinished jobs....

!!! ERROR: dev-lang/python-2.3.4-r1 failed.
!!! Function src_compile, Line 126, Exitcode 2
!!! Parallel make failed
!!! If you need support, post the topmost build error, NOT this status message.

_________________
Easily backup up your system? klick
Get rid of SSH Brute Force Attempts / Script Kiddies klick
Back to top
View user's profile Send private message
d2207197
n00b
n00b


Joined: 29 Mar 2005
Posts: 6

PostPosted: Sun May 01, 2005 1:58 pm    Post subject: Reply with quote

I have emerged python-2.3.5 successfully before. but I also failed to remerge it today. The error messages is same to others above.



The gcc arguments are different between the unsuccessful and successful emerging of python-2.3.5
There's an addition glibc arguments in the unsuccessful emerging.
I supposed that the addition glibc arguments is the reason of failling emerging.
and the relevant error message would be
Code:
gcc: glibc: No such file or directory


successful arguments wrote:

i686-pc-linux-gnu-gcc -pthread -shared -o libpython2.3.so Modules/getbuildinfo.o Parser/acceler.o Parser/grammar1.o Parser/listnode.o Parser/node.o Parser/parser.o Parser/parsetok.o Parser/bitset.o Parser/metagrammar.o Parser/firstsets.o Parser/grammar.o Parser/pgen.o Parser/myreadline.o Parser/tokenizer.o Objects/abstract.o Objects/boolobject.o Objects/bufferobject.o Objects/cellobject.o Objects/classobject.o Objects/cobject.o Objects/complexobject.o Objects/descrobject.o Objects/enumobject.o Objects/fileobject.o Objects/floatobject.o Objects/frameobject.o Objects/funcobject.o Objects/intobject.o Objects/iterobject.o Objects/listobject.o Objects/longobject.o Objects/dictobject.o Objects/methodobject.o Objects/moduleobject.o Objects/object.o Objects/obmalloc.o Objects/rangeobject.o Objects/sliceobject.o Objects/stringobject.o Objects/structseq.o Objects/tupleobject.o Objects/typeobject.o Objects/weakrefobject.o Objects/unicodeobject.o Objects/unicodectype.o Python/bltinmodule.o Python/exceptions.o Python/ceval.o Python/compile.o Python/codecs.o Python/errors.o Python/frozen.o Python/frozenmain.o Python/future.o Python/getargs.o Python/getcompiler.o Python/getcopyright.o Python/getmtime.o Python/getplatform.o Python/getversion.o Python/graminit.o Python/import.o Python/importdl.o Python/marshal.o Python/modsupport.o Python/mystrtoul.o Python/mysnprintf.o Python/pyfpe.o Python/pystate.o Python/pythonrun.o Python/structmember.o Python/symtable.o Python/sysmodule.o Python/traceback.o Python/getopt.o Python/dynload_shlib.o Python/thread.o Modules/config.o Modules/getpath.o Modules/main.o Modules/gcmodule.o Modules/threadmodule.o Modules/signalmodule.o Modules/posixmodule.o Modules/errnomodule.o Modules/_sre.o Modules/_codecsmodule.o Modules/zipimport.o Modules/symtablemodule.o Modules/xxsubtype.o -lpthread -ldl -lutil -lm


unsuccessful arguments wrote:

i686-pc-linux-gnu-gcc -pthread -shared -o libpython2.3.so Modules/getbuildinfo.o Parser/acceler.o Parser/grammar1.o Parser/listnode.o Parser/node.o Parser/parser.o Parser/parsetok.o Parser/bitset.o Parser/metagrammar.o Parser/firstsets.o Parser/grammar.o Parser/pgen.o Parser/myreadline.o Parser/tokenizer.o Objects/abstract.o Objects/boolobject.o Objects/bufferobject.o Objects/cellobject.o Objects/classobject.o Objects/cobject.o Objects/complexobject.o Objects/descrobject.o Objects/enumobject.o Objects/fileobject.o Objects/floatobject.o Objects/frameobject.o Objects/funcobject.o Objects/intobject.o Objects/iterobject.o Objects/listobject.o Objects/longobject.o Objects/dictobject.o Objects/methodobject.o Objects/moduleobject.o Objects/object.o Objects/obmalloc.o Objects/rangeobject.o Objects/sliceobject.o Objects/stringobject.o Objects/structseq.o Objects/tupleobject.o Objects/typeobject.o Objects/weakrefobject.o Objects/unicodeobject.o Objects/unicodectype.o Python/bltinmodule.o Python/exceptions.o Python/ceval.o Python/compile.o Python/codecs.o Python/errors.o Python/frozen.o Python/frozenmain.o Python/future.o Python/getargs.o Python/getcompiler.o Python/getcopyright.o Python/getmtime.o Python/getplatform.o Python/getversion.o Python/graminit.o Python/import.o Python/importdl.o Python/marshal.o Python/modsupport.o Python/mystrtoul.o Python/mysnprintf.o Python/pyfpe.o Python/pystate.o Python/pythonrun.o Python/structmember.o Python/symtable.o Python/sysmodule.o Python/traceback.o Python/getopt.o Python/dynload_shlib.o Python/thread.o Modules/config.o Modules/getpath.o Modules/main.o Modules/gcmodule.o Modules/threadmodule.o Modules/signalmodule.o Modules/posixmodule.o Modules/errnomodule.o Modules/_sre.o Modules/_codecsmodule.o Modules/zipimport.o Modules/symtablemodule.o Modules/xxsubtype.o -lpthread -ldl -lutil glibc -lm


relational Makefile part wrote:

:150
LIBS= -lpthread -ldl -lutil
LIBM= -lm
LIBC= glibc
SYSLIBS= $(LIBM) $(LIBC)
SHLIBS= $(LIBS)

:365
libpython$(VERSION).so: $(LIBRARY_OBJS)
if test $(INSTSONAME) != $(LDLIBRARY); then \
$(LDSHARED) -Wl,-h$(INSTSONAME) -o $(INSTSONAME) $(LIBRARY_OBJS) $(SHLIBS) $(LIBC) $(LIBM); \
$(LN) -f $(INSTSONAME) $@; \
else\
$(LDSHARED) -o $@ $(LIBRARY_OBJS) $(SHLIBS) $(LIBC) $(LIBM); \
fi
Back to top
View user's profile Send private message
sourcez
Apprentice
Apprentice


Joined: 05 Feb 2004
Posts: 166
Location: Italy

PostPosted: Sun May 01, 2005 3:59 pm    Post subject: Reply with quote

Same error...with python 2.3.5 :x
_________________
"Tutti pensano a cambiare l’umanità ma nessuno pensa a cambiare se stesso."
Lev Tolstoj
Back to top
View user's profile Send private message
nixnut
Bodhisattva
Bodhisattva


Joined: 09 Apr 2004
Posts: 10974
Location: the dutch mountains

PostPosted: Sun May 01, 2005 4:02 pm    Post subject: Reply with quote

fix here: https://bugs.gentoo.org/show_bug.cgi?id=91024
_________________
Please add [solved] to the initial post's subject line if you feel your problem is resolved. Help answer the unanswered

talk is cheap. supply exceeds demand
Back to top
View user's profile Send private message
nbensa
l33t
l33t


Joined: 10 Jul 2002
Posts: 799
Location: Buenos Aires, Argentina

PostPosted: Sun May 01, 2005 4:04 pm    Post subject: Reply with quote

Code:
emerge --sync
Back to top
View user's profile Send private message
curtis119
Bodhisattva
Bodhisattva


Joined: 10 Mar 2003
Posts: 2160
Location: Phoenix, AZ USA, North America, Earth, SOL System, Milky Way, The Universe, The Cosmos, and Beyond.

PostPosted: Sun May 01, 2005 4:50 pm    Post subject: Reply with quote

Duplicate of this:
https://forums.gentoo.org/viewtopic-t-331566.html
_________________
Gentoo: it's like wiping your ass with silk.
Back to top
View user's profile Send private message
Display posts from previous:   
Reply to topic    Gentoo Forums Forum Index Duplicate Threads All times are GMT
Page 1 of 1

 
Jump to:  
You cannot post new topics in this forum
You cannot reply to topics in this forum
You cannot edit your posts in this forum
You cannot delete your posts in this forum
You cannot vote in polls in this forum