Gentoo Forums
Gentoo Forums
Gentoo Forums
Quick Search: in
can't emerge kdelibs (not preemptible kernel) [SOLVED]
View unanswered posts
View posts from last 24 hours

 
Reply to topic    Gentoo Forums Forum Index Gentoo on PPC
View previous topic :: View next topic  
Author Message
strogg
n00b
n00b


Joined: 19 Oct 2004
Posts: 10

PostPosted: Fri Jul 15, 2005 7:17 pm    Post subject: can't emerge kdelibs (not preemptible kernel) [SOLVED] Reply with quote

this is the output:

/bin/sh ../libtool --silent --mode=link --tag=CXX powerpc-unknown-linux-gnu-g++ -Wnon-virtual-dtor -Wno-long-long -Wundef -ansi -D_XOPEN_SOURCE=500 -D_BSD_SOURCE -Wcast-align -Wconversion -Wchar-subscripts -Wall -W -Wpointer-arith -Wwrite-strings -DNDEBUG -DNO_DEBUG -O2 -O2 -mtune=powerpc -fno-strict-aliasing -pipe -Wformat-security -Wmissing-format-attribute -fno-exceptions -fno-check-new -fno-common -DQT_CLEAN_NAMESPACE -DQT_NO_ASCII_CAST -DQT_NO_STL -DQT_NO_COMPAT -DQT_NO_TRANSLATION -o libkio.la -rpath /usr/kde/3.4/lib -version-info 6:0:2 -no-undefined -Wl,--no-undefined -Wl,--allow-shlib-undefined -L/usr/kde/3.4/lib -L/usr/qt/3/lib -L/usr/lib dummy.lo kssl/libkssl.la kio/libkiocore.la kio/libksycoca.la bookmarks/libkbookmarks.la kfile/libkfile.la ../kdeui/libkdeui.la ../kdesu/libkdesu.la ../kwallet/client/libkwalletclient.la -lz -lfam
grep: /usr/lib/gcc/powerpc-unknown-linux-gnu/3.4.1/libstdc++.la: No such file or directory
/bin/sed: can't read /usr/lib/gcc/powerpc-unknown-linux-gnu/3.4.1/libstdc++.la: No such file or directory
libtool: link: `/usr/lib/gcc/powerpc-unknown-linux-gnu/3.4.1/libstdc++.la' is not a valid libtool archive
make[3]: *** [libkio.la] Error 1
make[3]: Leaving directory `/var/tmp/portage/kdelibs-3.4.1-r1/work/kdelibs-3.4.1/kio'
make[2]: *** [all-recursive] Error 1
make[2]: Leaving directory `/var/tmp/portage/kdelibs-3.4.1-r1/work/kdelibs-3.4.1/kio'
make[1]: *** [all-recursive] Error 1
make[1]: Leaving directory `/var/tmp/portage/kdelibs-3.4.1-r1/work/kdelibs-3.4.1'
make: *** [all] Error 2

!!! ERROR: kde-base/kdelibs-3.4.1-r1 failed.
!!! Function kde_src_compile, Line 164, Exitcode 2
!!! died running emake, kde_src_compile:make
!!! If you need support, post the topmost build error, NOT this status message.


make.conf:

# These settings were set by the catalyst build script that automatically built this stage
# Please consult /etc/make.conf.example for a more detailed example
PORTDIR_OVERLAY="/usr/local/portage/"
CFLAGS="-O2 -mtune=powerpc -fno-strict-aliasing -pipe"
CHOST="powerpc-unknown-linux-gnu"
CXXFLAGS="${CFLAGS}"
ALSA_CARDS="usb-audio"
USE="-kde -qt alsa unicode oss gnome gtk gtk2 ppds xine flac dri drm insecure-drivers"

the computer overall is relatively unstable ONLY when there is some emerging going on. when doing anything else cpu intensive, the computer's fine, so i dont' think it's a hardware problem. like for example, when i emerged flac, it took it 2 tries before it got it, but kdelibs is a consistent error... apparently looking for gcc 3.4.1 when i don't have 3.4.1 (i have 3.4.4)

thanks in advance!


Last edited by strogg on Sat Jul 16, 2005 9:40 pm; edited 1 time in total
Back to top
View user's profile Send private message
nixnut
Bodhisattva
Bodhisattva


Joined: 09 Apr 2004
Posts: 10974
Location: the dutch mountains

PostPosted: Fri Jul 15, 2005 7:23 pm    Post subject: Reply with quote

execute fix_libtool_files 3.4.4 && env-update && source /etc/profile and try again
_________________
Please add [solved] to the initial post's subject line if you feel your problem is resolved. Help answer the unanswered

talk is cheap. supply exceeds demand
Back to top
View user's profile Send private message
strogg
n00b
n00b


Joined: 19 Oct 2004
Posts: 10

PostPosted: Fri Jul 15, 2005 8:48 pm    Post subject: Reply with quote

thanks, but nope; still didn't work...:( any other ideas?
Back to top
View user's profile Send private message
corsair
Retired Dev
Retired Dev


Joined: 06 Oct 2003
Posts: 451
Location: Aachen, Germany

PostPosted: Sat Jul 16, 2005 6:50 am    Post subject: Reply with quote

nixnut wrote:
execute fix_libtool_files 3.4.4 && env-update && source /etc/profile and try again


@strogg: please try this again with a slightly different command as fix_libtool_files.sh needs the old gcc version:

Code:

$ fix_libtool_files.sh 3.4.1
$ env-update
$ source /etc/profile
$ emerge kdelibs
Back to top
View user's profile Send private message
strogg
n00b
n00b


Joined: 19 Oct 2004
Posts: 10

PostPosted: Sat Jul 16, 2005 9:40 pm    Post subject: Reply with quote

it worked! Thanks guys!
Back to top
View user's profile Send private message
lyonsd
Apprentice
Apprentice


Joined: 02 Mar 2005
Posts: 153
Location: Flowery Branch, GA

PostPosted: Mon Jul 25, 2005 10:51 pm    Post subject: Reply with quote

corsair wrote:
nixnut wrote:
execute fix_libtool_files 3.4.4 && env-update && source /etc/profile and try again


@strogg: please try this again with a slightly different command as fix_libtool_files.sh needs the old gcc version:

Code:

$ fix_libtool_files.sh 3.4.1
$ env-update
$ source /etc/profile
$ emerge kdelibs


Didn't work for me. Any idea how to resolve this one...

Code:

# emerge kdelibs


libtool: link: warning: `/usr/lib/gcc-lib/i686-pc-linux-gnu/3.3.5/libstdc++.la' seems to be moved
libtool: link: warning: `/usr/lib/gcc-lib/i686-pc-linux-gnu/3.3.5/libstdc++.la' seems to be moved
libtool: link: warning: `/usr/lib/gcc-lib/i686-pc-linux-gnu/3.3.5/libstdc++.la' seems to be moved
libtool: link: warning: `/usr/lib/gcc-lib/i686-pc-linux-gnu/3.3.5/libstdc++.la' seems to be moved
libtool: link: warning: `/usr/lib/gcc-lib/i686-pc-linux-gnu/3.3.5/libstdc++.la' seems to be moved
libtool: link: warning: `/usr/lib/gcc-lib/i686-pc-linux-gnu/3.3.5/libstdc++.la' seems to be moved
libtool: link: warning: `/usr/lib/gcc-lib/i686-pc-linux-gnu/3.3.5/libstdc++.la' seems to be moved
libtool: link: warning: `/usr/lib/gcc-lib/i686-pc-linux-gnu/3.3.5/libstdc++.la' seems to be moved
libtool: link: warning: `//usr/lib/gcc-lib/i686-pc-linux-gnu/3.3.5/libstdc++.la' seems to be moved
libtool: link: warning: `//usr/lib/gcc-lib/i686-pc-linux-gnu/3.3.5/libstdc++.la' seems to be moved
libtool: link: warning: `/usr/lib/gcc-lib/i686-pc-linux-gnu/3.3.5/libstdc++.la' seems to be moved
libtool: link: warning: `/usr/lib/gcc-lib/i686-pc-linux-gnu/3.3.5/libstdc++.la' seems to be moved
libtool: link: warning: `//usr/lib/gcc-lib/i686-pc-linux-gnu/3.3.5/libstdc++.la' seems to be moved
libtool: link: warning: `//usr/lib/gcc-lib/i686-pc-linux-gnu/3.3.5/libstdc++.la' seems to be moved
libtool: link: warning: `//usr/lib/gcc-lib/i686-pc-linux-gnu/3.3.5/libstdc++.la' seems to be moved
libtool: link: warning: `//usr/lib/gcc-lib/i686-pc-linux-gnu/3.3.5/libstdc++.la' seems to be moved
libtool: link: warning: `//usr/lib/gcc-lib/i686-pc-linux-gnu/3.3.5/libstdc++.la' seems to be moved
libtool: link: warning: `//usr/lib/gcc-lib/i686-pc-linux-gnu/3.3.5/libstdc++.la' seems to be moved
libtool: link: warning: `//usr/lib/gcc-lib/i686-pc-linux-gnu/3.3.5/libstdc++.la' seems to be moved
libtool: link: warning: `//usr/lib/gcc-lib/i686-pc-linux-gnu/3.3.5/libstdc++.la' seems to be moved
libtool: link: warning: `//usr/lib/gcc-lib/i686-pc-linux-gnu/3.3.5/libstdc++.la' seems to be moved
.libs/libartskde_la.all_cc.o:(.gnu.linkonce.d._ZTCN4Arts19KIOInputStream_stubE52_NS_16SynthModule_stubE+0xa8): undefined reference to `virtual thunk to Arts::SynthModule_stub::autoSuspend()'
.libs/libartskde_la.all_cc.o:(.gnu.linkonce.d._ZTCN4Arts19KIOInputStream_stubE52_NS_16SynthModule_stubE+0xac): undefined reference to `virtual thunk to Arts::SynthModule_stub::start()'
.libs/libartskde_la.all_cc.o:(.gnu.linkonce.d._ZTCN4Arts19KIOInputStream_stubE52_NS_16SynthModule_stubE+0xb0): undefined reference to `virtual thunk to Arts::SynthModule_stub::stop()'
.libs/libartskde_la.all_cc.o:(.gnu.linkonce.d._ZTCN4Arts19KIOInputStream_stubE52_NS_16SynthModule_stubE+0xb4): undefined reference to `virtual thunk to Arts::SynthModule_stub::streamInit()'
.libs/libartskde_la.all_cc.o:(.gnu.linkonce.d._ZTCN4Arts19KIOInputStream_stubE52_NS_16SynthModule_stubE+0xb8): undefined reference to `virtual thunk to Arts::SynthModule_stub::streamStart()'
.libs/libartskde_la.all_cc.o:(.gnu.linkonce.d._ZTCN4Arts19KIOInputStream_stubE52_NS_16SynthModule_stubE+0xbc): undefined reference to `virtual thunk to Arts::SynthModule_stub::streamEnd()'
.libs/libartskde_la.all_cc.o:(.gnu.linkonce.d._ZTCN4Arts19KIOInputStream_stubE48_NS_16InputStream_stubE+0xe4): undefined reference to `virtual thunk to Arts::SynthModule_stub::autoSuspend()'
.libs/libartskde_la.all_cc.o:(.gnu.linkonce.d._ZTCN4Arts19KIOInputStream_stubE48_NS_16InputStream_stubE+0xe8): undefined reference to `virtual thunk to Arts::SynthModule_stub::start()'
.libs/libartskde_la.all_cc.o:(.gnu.linkonce.d._ZTCN4Arts19KIOInputStream_stubE48_NS_16InputStream_stubE+0xec): undefined reference to `virtual thunk to Arts::SynthModule_stub::stop()'
.libs/libartskde_la.all_cc.o:(.gnu.linkonce.d._ZTCN4Arts19KIOInputStream_stubE48_NS_16InputStream_stubE+0xf0): undefined reference to `virtual thunk to Arts::SynthModule_stub::streamInit()'
.libs/libartskde_la.all_cc.o:(.gnu.linkonce.d._ZTCN4Arts19KIOInputStream_stubE48_NS_16InputStream_stubE+0xf4): undefined reference to `virtual thunk to Arts::SynthModule_stub::streamStart()'
.libs/libartskde_la.all_cc.o:(.gnu.linkonce.d._ZTCN4Arts19KIOInputStream_stubE48_NS_16InputStream_stubE+0xf8): undefined reference to `virtual thunk to Arts::SynthModule_stub::streamEnd()'
.libs/libartskde_la.all_cc.o:(.gnu.linkonce.d._ZTVN4Arts19KIOInputStream_stubE+0x78): undefined reference to `virtual thunk to Arts::SynthModule_stub::autoSuspend()'
.libs/libartskde_la.all_cc.o:(.gnu.linkonce.d._ZTVN4Arts19KIOInputStream_stubE+0x7c): undefined reference to `virtual thunk to Arts::SynthModule_stub::start()'
.libs/libartskde_la.all_cc.o:(.gnu.linkonce.d._ZTVN4Arts19KIOInputStream_stubE+0x80): undefined reference to `virtual thunk to Arts::SynthModule_stub::stop()'
.libs/libartskde_la.all_cc.o:(.gnu.linkonce.d._ZTVN4Arts19KIOInputStream_stubE+0x84): undefined reference to `virtual thunk to Arts::SynthModule_stub::streamInit()'
.libs/libartskde_la.all_cc.o:(.gnu.linkonce.d._ZTVN4Arts19KIOInputStream_stubE+0x88): undefined reference to `virtual thunk to Arts::SynthModule_stub::streamStart()'
.libs/libartskde_la.all_cc.o:(.gnu.linkonce.d._ZTVN4Arts19KIOInputStream_stubE+0x8c): undefined reference to `virtual thunk to Arts::SynthModule_stub::streamEnd()'
.libs/libartskde_la.all_cc.o:(.gnu.linkonce.d._ZTCN4Arts17KDataRequest_stubE48_NS_16SynthModule_stubE+0xa8): undefined reference to `virtual thunk to Arts::SynthModule_stub::autoSuspend()'
.libs/libartskde_la.all_cc.o:(.gnu.linkonce.d._ZTCN4Arts17KDataRequest_stubE48_NS_16SynthModule_stubE+0xac): undefined reference to `virtual thunk to Arts::SynthModule_stub::start()'
.libs/libartskde_la.all_cc.o:(.gnu.linkonce.d._ZTCN4Arts17KDataRequest_stubE48_NS_16SynthModule_stubE+0xb0): undefined reference to `virtual thunk to Arts::SynthModule_stub::stop()'
.libs/libartskde_la.all_cc.o:(.gnu.linkonce.d._ZTCN4Arts17KDataRequest_stubE48_NS_16SynthModule_stubE+0xb4): undefined reference to `virtual thunk to Arts::SynthModule_stub::streamInit()'
.libs/libartskde_la.all_cc.o:(.gnu.linkonce.d._ZTCN4Arts17KDataRequest_stubE48_NS_16SynthModule_stubE+0xb8): undefined reference to `virtual thunk to Arts::SynthModule_stub::streamStart()'
.libs/libartskde_la.all_cc.o:(.gnu.linkonce.d._ZTCN4Arts17KDataRequest_stubE48_NS_16SynthModule_stubE+0xbc): undefined reference to `virtual thunk to Arts::SynthModule_stub::streamEnd()'
.libs/libartskde_la.all_cc.o:(.gnu.linkonce.d._ZTVN4Arts17KDataRequest_stubE+0x54): undefined reference to `virtual thunk to Arts::SynthModule_stub::autoSuspend()'
.libs/libartskde_la.all_cc.o:(.gnu.linkonce.d._ZTVN4Arts17KDataRequest_stubE+0x58): undefined reference to `virtual thunk to Arts::SynthModule_stub::start()'
.libs/libartskde_la.all_cc.o:(.gnu.linkonce.d._ZTVN4Arts17KDataRequest_stubE+0x5c): undefined reference to `virtual thunk to Arts::SynthModule_stub::stop()'
.libs/libartskde_la.all_cc.o:(.gnu.linkonce.d._ZTVN4Arts17KDataRequest_stubE+0x60): undefined reference to `virtual thunk to Arts::SynthModule_stub::streamInit()'
.libs/libartskde_la.all_cc.o:(.gnu.linkonce.d._ZTVN4Arts17KDataRequest_stubE+0x64): undefined reference to `virtual thunk to Arts::SynthModule_stub::streamStart()'
.libs/libartskde_la.all_cc.o:(.gnu.linkonce.d._ZTVN4Arts17KDataRequest_stubE+0x68): undefined reference to `virtual thunk to Arts::SynthModule_stub::streamEnd()'
.libs/libartskde_la.all_cc.o:(.gnu.linkonce.d._ZTCN4Arts16KIOTestSlow_stubE48_NS_16SynthModule_stubE+0xa8): undefined reference to `virtual thunk to Arts::SynthModule_stub::autoSuspend()'
.libs/libartskde_la.all_cc.o:(.gnu.linkonce.d._ZTCN4Arts16KIOTestSlow_stubE48_NS_16SynthModule_stubE+0xac): undefined reference to `virtual thunk to Arts::SynthModule_stub::start()'
.libs/libartskde_la.all_cc.o:(.gnu.linkonce.d._ZTCN4Arts16KIOTestSlow_stubE48_NS_16SynthModule_stubE+0xb0): undefined reference to `virtual thunk to Arts::SynthModule_stub::stop()'
.libs/libartskde_la.all_cc.o:(.gnu.linkonce.d._ZTCN4Arts16KIOTestSlow_stubE48_NS_16SynthModule_stubE+0xb4): undefined reference to `virtual thunk to Arts::SynthModule_stub::streamInit()'
.libs/libartskde_la.all_cc.o:(.gnu.linkonce.d._ZTCN4Arts16KIOTestSlow_stubE48_NS_16SynthModule_stubE+0xb8): undefined reference to `virtual thunk to Arts::SynthModule_stub::streamStart()'
.libs/libartskde_la.all_cc.o:(.gnu.linkonce.d._ZTCN4Arts16KIOTestSlow_stubE48_NS_16SynthModule_stubE+0xbc): undefined reference to `virtual thunk to Arts::SynthModule_stub::streamEnd()'
.libs/libartskde_la.all_cc.o:(.gnu.linkonce.d._ZTVN4Arts16KIOTestSlow_stubE+0x58): undefined reference to `virtual thunk to Arts::SynthModule_stub::autoSuspend()'
.libs/libartskde_la.all_cc.o:(.gnu.linkonce.d._ZTVN4Arts16KIOTestSlow_stubE+0x5c): undefined reference to `virtual thunk to Arts::SynthModule_stub::start()'
.libs/libartskde_la.all_cc.o:(.gnu.linkonce.d._ZTVN4Arts16KIOTestSlow_stubE+0x60): undefined reference to `virtual thunk to Arts::SynthModule_stub::stop()'
.libs/libartskde_la.all_cc.o:(.gnu.linkonce.d._ZTVN4Arts16KIOTestSlow_stubE+0x64): undefined reference to `virtual thunk to Arts::SynthModule_stub::streamInit()'
.libs/libartskde_la.all_cc.o:(.gnu.linkonce.d._ZTVN4Arts16KIOTestSlow_stubE+0x68): undefined reference to `virtual thunk to Arts::SynthModule_stub::streamStart()'
.libs/libartskde_la.all_cc.o:(.gnu.linkonce.d._ZTVN4Arts16KIOTestSlow_stubE+0x6c): undefined reference to `virtual thunk to Arts::SynthModule_stub::streamEnd()'
.libs/libartskde_la.all_cpp.o:(.gnu.linkonce.d._ZTCN4Arts19KIOInputStream_implE212_NS_14StdSynthModuleE+0xa4): undefined reference to `virtual thunk to Arts::StdSynthModule::autoSuspend()'
.libs/libartskde_la.all_cpp.o:(.gnu.linkonce.d._ZTCN4Arts19KIOInputStream_implE212_NS_14StdSynthModuleE+0xa8): undefined reference to `virtual thunk to Arts::StdSynthModule::start()'
.libs/libartskde_la.all_cpp.o:(.gnu.linkonce.d._ZTCN4Arts19KIOInputStream_implE212_NS_14StdSynthModuleE+0xac): undefined reference to `virtual thunk to Arts::StdSynthModule::stop()'
.libs/libartskde_la.all_cpp.o:(.gnu.linkonce.d._ZTCN4Arts19KIOInputStream_implE212_NS_14StdSynthModuleE+0xb0): undefined reference to `virtual thunk to Arts::StdSynthModule::streamInit()'
.libs/libartskde_la.all_cpp.o:(.gnu.linkonce.d._ZTCN4Arts19KIOInputStream_implE212_NS_14StdSynthModuleE+0xb4): undefined reference to `virtual thunk to Arts::StdSynthModule::streamStart()'
.libs/libartskde_la.all_cpp.o:(.gnu.linkonce.d._ZTCN4Arts19KIOInputStream_implE212_NS_14StdSynthModuleE+0xb8): undefined reference to `virtual thunk to Arts::StdSynthModule::streamEnd()'
.libs/libartskde_la.all_cpp.o:(.gnu.linkonce.d._ZTVN4Arts19KIOInputStream_implE+0x130): undefined reference to `virtual thunk to Arts::StdSynthModule::autoSuspend()'
.libs/libartskde_la.all_cpp.o:(.gnu.linkonce.d._ZTVN4Arts19KIOInputStream_implE+0x134): undefined reference to `virtual thunk to Arts::StdSynthModule::start()'
.libs/libartskde_la.all_cpp.o:(.gnu.linkonce.d._ZTVN4Arts19KIOInputStream_implE+0x138): undefined reference to `virtual thunk to Arts::StdSynthModule::stop()'
.libs/libartskde_la.all_cpp.o:(.gnu.linkonce.d._ZTVN4Arts19KIOInputStream_implE+0x13c): undefined reference to `virtual thunk to Arts::StdSynthModule::streamInit()'
.libs/libartskde_la.all_cpp.o:(.gnu.linkonce.d._ZTC18KByteSoundReceiver60_N4Arts14StdSynthModuleE+0xa4): undefined reference to `virtual thunk to Arts::StdSynthModule::autoSuspend()'
.libs/libartskde_la.all_cpp.o:(.gnu.linkonce.d._ZTC18KByteSoundReceiver60_N4Arts14StdSynthModuleE+0xa8): undefined reference to `virtual thunk to Arts::StdSynthModule::start()'
.libs/libartskde_la.all_cpp.o:(.gnu.linkonce.d._ZTC18KByteSoundReceiver60_N4Arts14StdSynthModuleE+0xac): undefined reference to `virtual thunk to Arts::StdSynthModule::stop()'
.libs/libartskde_la.all_cpp.o:(.gnu.linkonce.d._ZTC18KByteSoundReceiver60_N4Arts14StdSynthModuleE+0xb0): undefined reference to `virtual thunk to Arts::StdSynthModule::streamInit()'
.libs/libartskde_la.all_cpp.o:(.gnu.linkonce.d._ZTC18KByteSoundReceiver60_N4Arts14StdSynthModuleE+0xb4): undefined reference to `virtual thunk to Arts::StdSynthModule::streamStart()'
.libs/libartskde_la.all_cpp.o:(.gnu.linkonce.d._ZTC18KByteSoundReceiver60_N4Arts14StdSynthModuleE+0xb8): undefined reference to `virtual thunk to Arts::StdSynthModule::streamEnd()'
.libs/libartskde_la.all_cpp.o:(.gnu.linkonce.d._ZTV18KByteSoundReceiver+0xe4): undefined reference to `virtual thunk to Arts::StdSynthModule::autoSuspend()'
.libs/libartskde_la.all_cpp.o:(.gnu.linkonce.d._ZTV18KByteSoundReceiver+0xe8): undefined reference to `virtual thunk to Arts::StdSynthModule::start()'
.libs/libartskde_la.all_cpp.o:(.gnu.linkonce.d._ZTV18KByteSoundReceiver+0xec): undefined reference to `virtual thunk to Arts::StdSynthModule::stop()'
.libs/libartskde_la.all_cpp.o:(.gnu.linkonce.d._ZTV18KByteSoundReceiver+0xf0): undefined reference to `virtual thunk to Arts::StdSynthModule::streamInit()'
.libs/libartskde_la.all_cpp.o:(.gnu.linkonce.d._ZTV18KByteSoundReceiver+0xf4): undefined reference to `virtual thunk to Arts::StdSynthModule::streamStart()'
.libs/libartskde_la.all_cpp.o:(.gnu.linkonce.d._ZTV18KByteSoundReceiver+0xf8): undefined reference to `virtual thunk to Arts::StdSynthModule::streamEnd()'
.libs/libartskde_la.all_cpp.o:(.gnu.linkonce.d._ZTC18KByteSoundProducer120_N4Arts14StdSynthModuleE+0xa4): undefined reference to `virtual thunk to Arts::StdSynthModule::autoSuspend()'
.libs/libartskde_la.all_cpp.o:(.gnu.linkonce.d._ZTC18KByteSoundProducer120_N4Arts14StdSynthModuleE+0xa8): undefined reference to `virtual thunk to Arts::StdSynthModule::start()'
.libs/libartskde_la.all_cpp.o:(.gnu.linkonce.d._ZTC18KByteSoundProducer120_N4Arts14StdSynthModuleE+0xac): undefined reference to `virtual thunk to Arts::StdSynthModule::stop()'
.libs/libartskde_la.all_cpp.o:(.gnu.linkonce.d._ZTC18KByteSoundProducer120_N4Arts14StdSynthModuleE+0xb0): undefined reference to `virtual thunk to Arts::StdSynthModule::streamInit()'
.libs/libartskde_la.all_cpp.o:(.gnu.linkonce.d._ZTC18KByteSoundProducer120_N4Arts14StdSynthModuleE+0xb4): undefined reference to `virtual thunk to Arts::StdSynthModule::streamStart()'
.libs/libartskde_la.all_cpp.o:(.gnu.linkonce.d._ZTC18KByteSoundProducer120_N4Arts14StdSynthModuleE+0xb8): undefined reference to `virtual thunk to Arts::StdSynthModule::streamEnd()'
.libs/libartskde_la.all_cpp.o:(.gnu.linkonce.d._ZTV18KByteSoundProducer+0x7c): undefined reference to `virtual thunk to Arts::StdSynthModule::autoSuspend()'
.libs/libartskde_la.all_cpp.o:(.gnu.linkonce.d._ZTV18KByteSoundProducer+0x80): undefined reference to `virtual thunk to Arts::StdSynthModule::start()'
.libs/libartskde_la.all_cpp.o:(.gnu.linkonce.d._ZTV18KByteSoundProducer+0x84): undefined reference to `virtual thunk to Arts::StdSynthModule::stop()'
.libs/libartskde_la.all_cpp.o:(.gnu.linkonce.d._ZTV18KByteSoundProducer+0x88): undefined reference to `virtual thunk to Arts::StdSynthModule::streamInit()'
.libs/libartskde_la.all_cpp.o:(.gnu.linkonce.d._ZTCN4Arts17KDataRequest_implE132_NS_14StdSynthModuleE+0xa4): undefined reference to `virtual thunk to Arts::StdSynthModule::autoSuspend()'
.libs/libartskde_la.all_cpp.o:(.gnu.linkonce.d._ZTCN4Arts17KDataRequest_implE132_NS_14StdSynthModuleE+0xa8): undefined reference to `virtual thunk to Arts::StdSynthModule::start()'
.libs/libartskde_la.all_cpp.o:(.gnu.linkonce.d._ZTCN4Arts17KDataRequest_implE132_NS_14StdSynthModuleE+0xac): undefined reference to `virtual thunk to Arts::StdSynthModule::stop()'
.libs/libartskde_la.all_cpp.o:(.gnu.linkonce.d._ZTCN4Arts17KDataRequest_implE132_NS_14StdSynthModuleE+0xb0): undefined reference to `virtual thunk to Arts::StdSynthModule::streamInit()'
.libs/libartskde_la.all_cpp.o:(.gnu.linkonce.d._ZTCN4Arts17KDataRequest_implE132_NS_14StdSynthModuleE+0xb4): undefined reference to `virtual thunk to Arts::StdSynthModule::streamStart()'
.libs/libartskde_la.all_cpp.o:(.gnu.linkonce.d._ZTCN4Arts17KDataRequest_implE132_NS_14StdSynthModuleE+0xb8): undefined reference to `virtual thunk to Arts::StdSynthModule::streamEnd()'
.libs/libartskde_la.all_cpp.o:(.gnu.linkonce.d._ZTVN4Arts17KDataRequest_implE+0xe8): undefined reference to `virtual thunk to Arts::StdSynthModule::autoSuspend()'
.libs/libartskde_la.all_cpp.o:(.gnu.linkonce.d._ZTVN4Arts17KDataRequest_implE+0xec): undefined reference to `virtual thunk to Arts::StdSynthModule::start()'
.libs/libartskde_la.all_cpp.o:(.gnu.linkonce.d._ZTVN4Arts17KDataRequest_implE+0xf0): undefined reference to `virtual thunk to Arts::StdSynthModule::stop()'
.libs/libartskde_la.all_cpp.o:(.gnu.linkonce.d._ZTVN4Arts17KDataRequest_implE+0xf8): undefined reference to `virtual thunk to Arts::StdSynthModule::streamStart()'
collect2: ld returned 1 exit status
make[3]: *** [libartskde.la] Error 1
make[3]: Leaving directory `/var/tmp/portage/kdelibs-3.4.1-r2/work/kdelibs-3.4.1/arts/kde'
make[2]: *** [all-recursive] Error 1
make[2]: Leaving directory `/var/tmp/portage/kdelibs-3.4.1-r2/work/kdelibs-3.4.1/arts'
make[1]: *** [all-recursive] Error 1
make[1]: Leaving directory `/var/tmp/portage/kdelibs-3.4.1-r2/work/kdelibs-3.4.1'
make: *** [all] Error 2

_________________
Dave
Back to top
View user's profile Send private message
JoseJX
Retired Dev
Retired Dev


Joined: 28 Apr 2002
Posts: 2774

PostPosted: Mon Jul 25, 2005 11:17 pm    Post subject: Reply with quote

What did you try? You need to supply fix_libtool_files.sh with your old version of GCC, in this case 3.3.5.
_________________
Gentoo PPC FAQ: http://www.gentoo.org/doc/en/gentoo-ppc-faq.xml
Back to top
View user's profile Send private message
lyonsd
Apprentice
Apprentice


Joined: 02 Mar 2005
Posts: 153
Location: Flowery Branch, GA

PostPosted: Mon Jul 25, 2005 11:39 pm    Post subject: Still didn't work... Reply with quote

Code:

# fix_libtool_files.sh 3.3.5
# env-update && source /etc/profile && emerge kdelibs
...
...
...
collect2: ld returned 1 exit status
make[3]: *** [libartskde.la] Error 1
make[3]: Leaving directory `/var/tmp/portage/kdelibs-3.4.1-r2/work/kdelibs-3.4.1/arts/kde'
make[2]: *** [all-recursive] Error 1
make[2]: Leaving directory `/var/tmp/portage/kdelibs-3.4.1-r2/work/kdelibs-3.4.1/arts'
make[1]: *** [all-recursive] Error 1
make[1]: Leaving directory `/var/tmp/portage/kdelibs-3.4.1-r2/work/kdelibs-3.4.1'
make: *** [all] Error 2


Any ideas?
_________________
Dave
Back to top
View user's profile Send private message
lyonsd
Apprentice
Apprentice


Joined: 02 Mar 2005
Posts: 153
Location: Flowery Branch, GA

PostPosted: Tue Jul 26, 2005 12:19 am    Post subject: FIXED Reply with quote

I reemerged kde-base/arts then kdelibs again. It worked.
_________________
Dave
Back to top
View user's profile Send private message
lyonsd
Apprentice
Apprentice


Joined: 02 Mar 2005
Posts: 153
Location: Flowery Branch, GA

PostPosted: Thu Jul 28, 2005 2:59 pm    Post subject: Reply with quote

Unfortunately, now my sound daemon is crashing when I use KDE as a session. *sigh*
_________________
Dave
Back to top
View user's profile Send private message
Display posts from previous:   
Reply to topic    Gentoo Forums Forum Index Gentoo on PPC All times are GMT
Page 1 of 1

 
Jump to:  
You cannot post new topics in this forum
You cannot reply to topics in this forum
You cannot edit your posts in this forum
You cannot delete your posts in this forum
You cannot vote in polls in this forum