Gentoo Forums
Gentoo Forums
Gentoo Forums
Quick Search: in
Problem While Trying to emerge KDE
View unanswered posts
View posts from last 24 hours

 
Reply to topic    Gentoo Forums Forum Index Duplicate Threads
View previous topic :: View next topic  
Author Message
Naquada
n00b
n00b


Joined: 12 May 2005
Posts: 40

PostPosted: Sat Jul 23, 2005 3:30 pm    Post subject: Problem While Trying to emerge KDE Reply with quote

Can Some one help me emerge kde :-)

when im traing to emerge kde im getting the next errors

.........................
configure: configuring in saslauthd
configure: running /bin/sh './configure' --prefix=/usr '--prefix=/usr' '--host=x86_64-pc-linux-gnu' '--mandir=/usr/share/man' '--infodir=/usr/share/info' '--datadir=/usr/share' '--sysconfdir=/etc' '--localstatedir=/var/lib' '--libdir=/usr/lib64' '--build=x86_64-pc-linux-gnu' '--with-saslauthd=/var/lib/sasl2' '--with-pwcheck=/var/lib/sasl2' '--with-configdir=/etc/sasl2' '--with-plugindir=/usr/lib64/sasl2' '--with-dbpath=/etc/sasl2/sasldb2' '--enable-login' '--enable-ntlm' '--disable-krb4' '--disable-otp' '--disable-static' '--with-openssl' '--with-pam' '--with-ldap' '--enable-ldapdb' '--disable-sample' '--disable-gssapi' '--without-mysql' '--disable-mysql' '--without-pgsql' '--disable-postgres' '--disable-srp' '--disable-java' '--without-javahome' '--without-authdaemond' '--disable-sql' '--with-dblib=berkeley' 'CFLAGS=-march=athlon64 -mtune=k8 -pipe -O2' 'build_alias=x86_64-pc-linux-gnu' 'host_alias=x86_64-pc-linux-gnu' --cache-file=.././config.cache --srcdir=.
configure: loading cache .././config.cache
configure: error: `CFLAGS' has changed since the previous run:
configure: former value: -march=athlon64 -mtune=k8 -pipe -O2
configure: current value: -march=athlon64 -mtune=k8 -pipe -O2
configure: error: changes in the environment can compromise the build
configure: error: run `make distclean' and/or `rm .././config.cache' and start over
configure: error: /bin/sh './configure' failed for saslauthd

!!! Please attach the config.log to your bug report:
!!! /var/tmp/portage/cyrus-sasl-2.1.21-r1/work/cyrus-sasl-2.1.21/config.log

!!! ERROR: dev-libs/cyrus-sasl-2.1.21-r1 failed.
!!! Function econf, Line 485, Exitcode 0
!!! econf failed
!!! If you need support, post the topmost build error, NOT this status message.

And Here Is The Log File :

Naquada ~ # cat /var/tmp/portage/cyrus-sasl-2.1.21-r1/work/cyrus-sasl-2.1.21/con
fig.log
This file contains any messages produced by compilers while
running configure, to aid debugging if configure makes a mistake.

It was created by configure, which was
generated by GNU Autoconf 2.59. Invocation command line was

$ ./configure --prefix=/usr --host=x86_64-pc-linux-gnu --mandir=/usr/share/man --infodir=/usr/share/info --datadir=/usr/share --sysconfdir=/etc --localstatedir=/var/lib --libdir=/usr/lib64 --build=x86_64-pc-linux-gnu --with-saslauthd=/var/lib/sasl2 --with-pwcheck=/var/lib/sasl2 --with-configdir=/etc/sasl2 --with-plugindir=/usr/lib64/sasl2 --with-dbpath=/etc/sasl2/sasldb2 --enable-login --enable-ntlm --disable-krb4 --disable-otp --disable-static --with-openssl --with-pam --with-ldap --enable-ldapdb --disable-sample --disable-gssapi --without-mysql --disable-mysql --without-pgsql --disable-postgres --disable-srp --disable-java --without-javahome --without-authdaemond --disable-sql --with-dblib=berkeley

## --------- ##
## Platform. ##
## --------- ##

hostname = Naquada
uname -m = x86_64
uname -r = 2.6.12-gentoo-r5
uname -s = Linux
uname -v = #4 SMP Sat Jul 16 23:16:22 IDT 2005

/usr/bin/uname -p = AMD Athlon(tm) 64 Processor 3000+
/bin/uname -X = unknown

/bin/arch = x86_64
/usr/bin/arch -k = unknown
/usr/convex/getsysinfo = unknown
hostinfo = unknown
/bin/machine = unknown
/usr/bin/oslevel = unknown
/bin/universe = unknown

PATH: /sbin
PATH: /usr/sbin
PATH: /usr/lib/portage/bin
PATH: /bin
PATH: /usr/bin
PATH: /opt/bin
PATH: /usr/x86_64-pc-linux-gnu/gcc-bin/3.4.4


## ----------- ##
## Core tests. ##
## ----------- ##

configure:1383: creating cache ./config.cache
configure:1421: checking build system type
configure:1439: result: x86_64-pc-linux-gnu
configure:1447: checking host system type
configure:1461: result: x86_64-pc-linux-gnu
configure:1469: checking target system type
configure:1483: result: x86_64-pc-linux-gnu
configure:1512: checking for a BSD-compatible install
configure:1567: result: /bin/install -c
configure:1578: checking whether build environment is sane
configure:1621: result: yes
configure:1654: checking for gawk
configure:1670: found /bin/gawk
configure:1680: result: gawk
configure:1690: checking whether make sets $(MAKE)
configure:1710: result: yes
configure:1908: checking for x86_64-pc-linux-gnu-gcc
configure:1924: found /usr/bin/x86_64-pc-linux-gnu-gcc
configure:1934: result: x86_64-pc-linux-gnu-gcc
configure:2216: checking for C compiler version
configure:2219: x86_64-pc-linux-gnu-gcc --version </dev/null >&5
x86_64-pc-linux-gnu-gcc (GCC) 3.4.4 (Gentoo 3.4.4, ssp-3.4.4-1.0, pie-8.7.8)
Copyright (C) 2004 Free Software Foundation, Inc.
This is free software; see the source for copying conditions. There is NO
warranty; not even for MERCHANTABILITY or FITNESS FOR A PARTICULAR PURPOSE.

configure:2222: $? = 0
configure:2224: x86_64-pc-linux-gnu-gcc -v </dev/null >&5
Reading specs from /usr/lib/gcc/x86_64-pc-linux-gnu/3.4.4/specs
Configured with: /var/tmp/portage/gcc-3.4.4/work/gcc-3.4.4/configure --enable-version-specific-runtime-libs --prefix=/usr --bindir=/usr/x86_64-pc-linux-gnu/gcc-bin/3.4.4 --includedir=/usr/lib/gcc/x86_64-pc-linux-gnu/3.4.4/include --datadir=/usr/share/gcc-data/x86_64-pc-linux-gnu/3.4.4 --mandir=/usr/share/gcc-data/x86_64-pc-linux-gnu/3.4.4/man --infodir=/usr/share/gcc-data/x86_64-pc-linux-gnu/3.4.4/info --with-gxx-include-dir=/usr/lib/gcc/x86_64-pc-linux-gnu/3.4.4/include/g++-v3 --host=x86_64-pc-linux-gnu --build=x86_64-pc-linux-gnu --disable-altivec --enable-nls --without-included-gettext --with-system-zlib --disable-checking --disable-werror --disable-libunwind-exceptions --enable-multilib --disable-libgcj --enable-languages=c,c++,f77 --enable-shared --enable-threads=posix --enable-__cxa_atexit --enable-clocale=gnu
Thread model: posix
gcc version 3.4.4 (Gentoo 3.4.4, ssp-3.4.4-1.0, pie-8.7.8)
configure:2227: $? = 0
configure:2229: x86_64-pc-linux-gnu-gcc -V </dev/null >&5
x86_64-pc-linux-gnu-gcc: `-V' must come at the start of the command line
configure:2232: $? = 1
configure:2255: checking for C compiler default output file name
configure:2258: x86_64-pc-linux-gnu-gcc -march=athlon64 -mtune=k8 -pipe -O2 conftest.c >&5
configure:2261: $? = 0
configure:2307: result: a.out
configure:2312: checking whether the C compiler works
configure:2318: ./a.out
configure:2321: $? = 0
configure:2338: result: yes
configure:2345: checking whether we are cross compiling
configure:2347: result: no
configure:2350: checking for suffix of executables
configure:2352: x86_64-pc-linux-gnu-gcc -o conftest -march=athlon64 -mtune=k8 -pipe -O2 conftest.c >&5
configure:2355: $? = 0
configure:2380: result:
configure:2386: checking for suffix of object files
configure:2407: x86_64-pc-linux-gnu-gcc -c -march=athlon64 -mtune=k8 -pipe -O2 conftest.c >&5
configure:2410: $? = 0
configure:2432: result: o
configure:2436: checking whether we are using the GNU C compiler
configure:2460: x86_64-pc-linux-gnu-gcc -c -march=athlon64 -mtune=k8 -pipe -O2 conftest.c >&5
configure:2466: $? = 0
configure:2470: test -z
|| test ! -s conftest.err
configure:2473: $? = 0
configure:2476: test -s conftest.o
configure:2479: $? = 0
configure:2492: result: yes
configure:2498: checking whether x86_64-pc-linux-gnu-gcc accepts -g
configure:2519: x86_64-pc-linux-gnu-gcc -c -g conftest.c >&5
configure:2525: $? = 0
configure:2529: test -z
|| test ! -s conftest.err
configure:2532: $? = 0
configure:2535: test -s conftest.o
configure:2538: $? = 0
configure:2549: result: yes
configure:2566: checking for x86_64-pc-linux-gnu-gcc option to accept ANSI C
configure:2636: x86_64-pc-linux-gnu-gcc -c -march=athlon64 -mtune=k8 -pipe -O2 conftest.c >&5
configure:2642: $? = 0
configure:2646: test -z
|| test ! -s conftest.err
configure:2649: $? = 0
configure:2652: test -s conftest.o
configure:2655: $? = 0
configure:2673: result: none needed
configure:2691: x86_64-pc-linux-gnu-gcc -c -march=athlon64 -mtune=k8 -pipe -O2 conftest.c >&5
conftest.c:2: error: parse error before "me"
configure:2697: $? = 1
configure: failed program was:
| #ifndef __cplusplus
| choke me
| #endif
configure:2841: checking for style of include used by make
configure:2869: result: GNU
configure:2897: checking dependency style of x86_64-pc-linux-gnu-gcc
configure:2980: result: gcc3
configure:3002: checking how to run the C preprocessor
configure:3037: x86_64-pc-linux-gnu-gcc -E conftest.c
configure:3043: $? = 0
configure:3075: x86_64-pc-linux-gnu-gcc -E conftest.c
conftest.c:11:28: ac_nonexistent.h: No such file or directory
configure:3081: $? = 1
configure: failed program was:
| /* confdefs.h. */
|
| #define PACKAGE_NAME ""
| #define PACKAGE_TARNAME ""
| #define PACKAGE_VERSION ""
| #define PACKAGE_STRING ""
| #define PACKAGE_BUGREPORT ""
| #define PACKAGE "cyrus-sasl"
| #define VERSION "2.1.21"
| /* end confdefs.h. */
| #include <ac_nonexistent.h>
configure:3120: result: x86_64-pc-linux-gnu-gcc -E
configure:3144: x86_64-pc-linux-gnu-gcc -E conftest.c
configure:3150: $? = 0
configure:3182: x86_64-pc-linux-gnu-gcc -E conftest.c
conftest.c:11:28: ac_nonexistent.h: No such file or directory
configure:3188: $? = 1
configure: failed program was:
| /* confdefs.h. */
|
| #define PACKAGE_NAME ""
| #define PACKAGE_TARNAME ""
| #define PACKAGE_VERSION ""
| #define PACKAGE_STRING ""
| #define PACKAGE_BUGREPORT ""
| #define PACKAGE "cyrus-sasl"
| #define VERSION "2.1.21"
| /* end confdefs.h. */
| #include <ac_nonexistent.h>
configure:3235: checking for gawk
configure:3261: result: gawk
configure:3271: checking whether ln -s works
configure:3275: result: yes
configure:3282: checking whether make sets $(MAKE)
configure:3302: result: yes
configure:3324: checking for a BSD-compatible install
configure:3379: result: /bin/install -c
configure:3392: checking for __attribute__
configure:3424: x86_64-pc-linux-gnu-gcc -c -march=athlon64 -mtune=k8 -pipe -O2 conftest.c >&5
configure:3430: $? = 0
configure:3434: test -z
|| test ! -s conftest.err
configure:3437: $? = 0
configure:3440: test -s conftest.o
configure:3443: $? = 0
configure:3462: result: yes
configure:3468: checking for runpath switch
configure:3493: x86_64-pc-linux-gnu-gcc -o conftest -march=athlon64 -mtune=k8 -pipe -O2 -R /usr/lib conftest.c >&5
x86_64-pc-linux-gnu-gcc: unrecognized option `-R'
/usr/lib/gcc/x86_64-pc-linux-gnu/3.4.4/../../../../x86_64-pc-linux-gnu/bin/ld: /usr/lib: No such file: File format not recognized
collect2: ld returned 1 exit status
configure:3499: $? = 1
configure: failed program was:
| /* confdefs.h. */
|
| #define PACKAGE_NAME ""
| #define PACKAGE_TARNAME ""
| #define PACKAGE_VERSION ""
| #define PACKAGE_STRING ""
| #define PACKAGE_BUGREPORT ""
| #define PACKAGE "cyrus-sasl"
| #define VERSION "2.1.21"
| #define HAVE___ATTRIBUTE__ 1
| /* end confdefs.h. */
|
| int
| main ()
| {
|
| ;
| return 0;
| }
configure:3537: x86_64-pc-linux-gnu-gcc -o conftest -march=athlon64 -mtune=k8 -pipe -O2 -Wl,-rpath,/usr/lib conftest.c >&5
configure:3543: $? = 0
configure:3547: test -z
|| test ! -s conftest.err
configure:3550: $? = 0
configure:3553: test -s conftest
configure:3556: $? = 0
configure:3574: result: -Wl,-rpath,
configure:3663: checking for x86_64-pc-linux-gnu-ranlib
configure:3679: found /usr/bin/x86_64-pc-linux-gnu-ranlib
configure:3689: result: x86_64-pc-linux-gnu-ranlib
configure:3751: checking for ld used by GCC
configure:3808: result: /usr/x86_64-pc-linux-gnu/bin/ld
configure:3817: checking if the linker (/usr/x86_64-pc-linux-gnu/bin/ld) is GNU ld
GNU ld version 2.16.1
configure:3829: result: yes
configure:3833: checking for BSD-compatible nm
configure:3867: result: /usr/bin/nm -B
configure:4059: loading cache ./config.cache
nfig:604: x86_64-pc-linux-gnu-gcc -c -march=athlon64 -mtune=k8 -pipe -O2 conftest.c 1>&5
ltconfig:781: checking if x86_64-pc-linux-gnu-gcc PIC flag -fPIC works
ltconfig:782: x86_64-pc-linux-gnu-gcc -c -march=athlon64 -mtune=k8 -pipe -O2 -fPIC -DPIC conftest.c 1>&5
ltconfig:834: checking if x86_64-pc-linux-gnu-gcc supports -c -o file.o
ltconfig:835: x86_64-pc-linux-gnu-gcc -c -march=athlon64 -mtune=k8 -pipe -O2 -o out/conftest2.o conftest.c 1>&5
ltconfig:867: checking if x86_64-pc-linux-gnu-gcc supports -c -o file.lo
ltconfig:868: x86_64-pc-linux-gnu-gcc -c -march=athlon64 -mtune=k8 -pipe -O2 -c -o conftest.lo conftest.c 1>&5
ltconfig:919: checking if x86_64-pc-linux-gnu-gcc supports -fno-rtti -fno-exceptions
ltconfig:920: x86_64-pc-linux-gnu-gcc -c -march=athlon64 -mtune=k8 -pipe -O2 -fno-rtti -fno-exceptions -c conftest.c conftest.c 1>&5
ltconfig:963: checking if x86_64-pc-linux-gnu-gcc static flag -static works
ltconfig:964: x86_64-pc-linux-gnu-gcc -o conftest -march=athlon64 -mtune=k8 -pipe -O2 -static conftest.c 1>&5
GNU ld version 2.16.1
ltconfig:1662: checking if global_symbol_pipe works
ltconfig:1663: x86_64-pc-linux-gnu-gcc -c -march=athlon64 -mtune=k8 -pipe -O2 conftest.c 1>&5
ltconfig:1666: eval "/usr/bin/nm -B conftest.o | sed -n -e 's/^.*[ ]\([ABCDGISTW]\)[ ][ ]*\(\)\([_A-Za-z][_A-Za-z0-9]*\)$/\1 \2\3 \3/p' > conftest.nm"
ltconfig:1718: x86_64-pc-linux-gnu-gcc -o conftest -march=athlon64 -mtune=k8 -pipe -O2 -fno-builtin conftest.c conftstm.o 1>&5
configure:4420: checking for connect
configure:4477: x86_64-pc-linux-gnu-gcc -o conftest -Wall -W -march=athlon64 -mtune=k8 -pipe -O2 conftest.c >&5
configure:4483: $? = 0
configure:4487: test -z
|| test ! -s conftest.err
configure:4490: $? = 0
configure:4493: test -s conftest
configure:4496: $? = 0
configure:4508: result: yes
configure:4653: checking for res_search
configure:4710: x86_64-pc-linux-gnu-gcc -o conftest -Wall -W -march=athlon64 -mtune=k8 -pipe -O2 conftest.c >&5
/var/tmp/portage/cyrus-sasl-2.1.21-r1/temp/cc6SHDTA.o: In function `main':
conftest.c:(.text+0x9): undefined reference to `res_search'
/var/tmp/portage/cyrus-sasl-2.1.21-r1/temp/cc6SHDTA.o:(.data+0x0): undefined reference to `res_search'
collect2: ld returned 1 exit status
configure:4716: $? = 1
configure: failed program was:
| /* confdefs.h. */
|
| #define PACKAGE_NAME ""
| #define PACKAGE_TARNAME ""
| #define PACKAGE_VERSION ""
| #define PACKAGE_STRING ""
| #define PACKAGE_BUGREPORT ""
| #define PACKAGE "cyrus-sasl"
| #define VERSION "2.1.21"
| #define HAVE___ATTRIBUTE__ 1
| /* end confdefs.h. */
| /* Define res_search to an innocuous variant, in case <limits.h> declares res_search.
| For example, HP-UX 11i <limits.h> declares gettimeofday. */
| #define res_search innocuous_res_search
|
| /* System header to define __stub macros and hopefully few prototypes,
| which can conflict with char res_search (); below.
| Prefer <limits.h> to <assert.h> if __STDC__ is defined, since
| <limits.h> exists even on freestanding compilers. */
|
| #ifdef __STDC__
| # include <limits.h>
| #else
| # include <assert.h>
| #endif
|
| #undef res_search
|
| /* Override any gcc2 internal prototype to avoid an error. */
| #ifdef __cplusplus
| extern "C"
| {
| #endif
| /* We use char because int might match the return type of a gcc2
| builtin and then its argument prototype would still apply. */
| char res_search ();
| /* The GNU C library defines this for functions which it implements
| to always fail with ENOSYS. Some functions are actually named
| something starting with __ and the normal name is an alias. */
| #if defined (__stub_res_search) || defined (__stub___res_search)
| choke me
| #else
| char (*f) () = res_search;
| #endif
| #ifdef __cplusplus
| }
| #endif
|
| int
| main ()
| {
| return f != res_search;
| ;
| return 0;
| }
configure:4741: result: no
configure:4775: x86_64-pc-linux-gnu-gcc -o conftest -Wall -W -march=athlon64 -mtune=k8 -pipe -O2 conftest.c -lresolv >&5
configure:4781: $? = 0
configure:4785: test -z
|| test ! -s conftest.err
configure:4788: $? = 0
configure:4791: test -s conftest
configure:4794: $? = 0
configure:4813: checking for dn_expand
configure:4870: x86_64-pc-linux-gnu-gcc -o conftest -Wall -W -march=athlon64 -mtune=k8 -pipe -O2 conftest.c -lresolv >&5
/var/tmp/portage/cyrus-sasl-2.1.21-r1/temp/ccV6EJCR.o: In function `main':
conftest.c:(.text+0x9): undefined reference to `dn_expand'
/var/tmp/portage/cyrus-sasl-2.1.21-r1/temp/ccV6EJCR.o:(.data+0x0): undefined reference to `dn_expand'
collect2: ld returned 1 exit status
configure:4876: $? = 1
configure: failed program was:
| /* confdefs.h. */
|
| #define PACKAGE_NAME ""
| #define PACKAGE_TARNAME ""
| #define PACKAGE_VERSION ""
| #define PACKAGE_STRING ""
| #define PACKAGE_BUGREPORT ""
| #define PACKAGE "cyrus-sasl"
| #define VERSION "2.1.21"
| #define HAVE___ATTRIBUTE__ 1
| /* end confdefs.h. */
| /* Define dn_expand to an innocuous variant, in case <limits.h> declares dn_expand.
| For example, HP-UX 11i <limits.h> declares gettimeofday. */
| #define dn_expand innocuous_dn_expand
|
| /* System header to define __stub macros and hopefully few prototypes,
| which can conflict with char dn_expand (); below.
| Prefer <limits.h> to <assert.h> if __STDC__ is defined, since
| <limits.h> exists even on freestanding compilers. */
|
| #ifdef __STDC__
| # include <limits.h>
| #else
| # include <assert.h>
| #endif
|
| #undef dn_expand
|
| /* Override any gcc2 internal prototype to avoid an error. */
| #ifdef __cplusplus
| extern "C"
| {
| #endif
| /* We use char because int might match the return type of a gcc2
| builtin and then its argument prototype would still apply. */
| char dn_expand ();
| /* The GNU C library defines this for functions which it implements
| to always fail with ENOSYS. Some functions are actually named
| something starting with __ and the normal name is an alias. */
| #if defined (__stub_dn_expand) || defined (__stub___dn_expand)
| choke me
| #else
| char (*f) () = dn_expand;
| #endif
| #ifdef __cplusplus
| }
| #endif
|
| int
| main ()
| {
| return f != dn_expand;
| ;
| return 0;
| }
configure:4901: result: no
configure:4813: checking for dns_lookup
configure:4870: x86_64-pc-linux-gnu-gcc -o conftest -Wall -W -march=athlon64 -mtune=k8 -pipe -O2 conftest.c -lresolv >&5
/var/tmp/portage/cyrus-sasl-2.1.21-r1/temp/ccV6AS2V.o: In function `main':
conftest.c:(.text+0x9): undefined reference to `dns_lookup'
/var/tmp/portage/cyrus-sasl-2.1.21-r1/temp/ccV6AS2V.o:(.data+0x0): undefined reference to `dns_lookup'
collect2: ld returned 1 exit status
configure:4876: $? = 1
configure: failed program was:
| /* confdefs.h. */
|
| #define PACKAGE_NAME ""
| #define PACKAGE_TARNAME ""
| #define PACKAGE_VERSION ""
| #define PACKAGE_STRING ""
| #define PACKAGE_BUGREPORT ""
| #define PACKAGE "cyrus-sasl"
| #define VERSION "2.1.21"
| #define HAVE___ATTRIBUTE__ 1
| /* end confdefs.h. */
| /* Define dns_lookup to an innocuous variant, in case <limits.h> declares dns_lookup.
| For example, HP-UX 11i <limits.h> declares gettimeofday. */
| #define dns_lookup innocuous_dns_lookup
|
| /* System header to define __stub macros and hopefully few prototypes,
| which can conflict with char dns_lookup (); below.
| Prefer <limits.h> to <assert.h> if __STDC__ is defined, since
| <limits.h> exists even on freestanding compilers. */
|
| #ifdef __STDC__
| # include <limits.h>
| #else
| # include <assert.h>
| #endif
|
| #undef dns_lookup
|
| /* Override any gcc2 internal prototype to avoid an error. */
| #ifdef __cplusplus
| extern "C"
| {
| #endif
| /* We use char because int might match the return type of a gcc2
| builtin and then its argument prototype would still apply. */
| char dns_lookup ();
| /* The GNU C library defines this for functions which it implements
| to always fail with ENOSYS. Some functions are actually named
| something starting with __ and the normal name is an alias. */
| #if defined (__stub_dns_lookup) || defined (__stub___dns_lookup)
| choke me
| #else
| char (*f) () = dns_lookup;
| #endif
| #ifdef __cplusplus
| }
| #endif
|
| int
| main ()
| {
| return f != dns_lookup;
| ;
| return 0;
| }
configure:4901: result: no
configure:4924: checking DB path to use
configure:4926: result: /etc/sasl2/sasldb2
configure:4934: checking for egrep
configure:4944: result: grep -E
configure:4949: checking for ANSI C header files
configure:4974: x86_64-pc-linux-gnu-gcc -c -Wall -W -march=athlon64 -mtune=k8 -pipe -O2 conftest.c >&5
configure:4980: $? = 0
configure:4984: test -z
|| test ! -s conftest.err
configure:4987: $? = 0
configure:4990: test -s conftest.o
configure:4993: $? = 0
configure:5082: x86_64-pc-linux-gnu-gcc -o conftest -Wall -W -march=athlon64 -mtune=k8 -pipe -O2 conftest.c >&5
conftest.c: In function `main':
conftest.c:30: warning: implicit declaration of function `exit'
configure:5085: $? = 0
configure:5087: ./conftest
configure:5090: $? = 0
configure:5105: result: yes
configure:5129: checking for sys/types.h
configure:5145: x86_64-pc-linux-gnu-gcc -c -Wall -W -march=athlon64 -mtune=k8 -pipe -O2 conftest.c >&5
configure:5151: $? = 0
configure:5155: test -z
|| test ! -s conftest.err
configure:5158: $? = 0
configure:5161: test -s conftest.o
configure:5164: $? = 0
configure:5175: result: yes
configure:5129: checking for sys/stat.h
configure:5145: x86_64-pc-linux-gnu-gcc -c -Wall -W -march=athlon64 -mtune=k8 -pipe -O2 conftest.c >&5
configure:5151: $? = 0
configure:5155: test -z
|| test ! -s conftest.err
configure:5158: $? = 0
configure:5161: test -s conftest.o
configure:5164: $? = 0
configure:5175: result: yes
configure:5129: checking for stdlib.h
configure:5145: x86_64-pc-linux-gnu-gcc -c -Wall -W -march=athlon64 -mtune=k8 -pipe -O2 conftest.c >&5
configure:5151: $? = 0
configure:5155: test -z
|| test ! -s conftest.err
configure:5158: $? = 0
configure:5161: test -s conftest.o
configure:5164: $? = 0
configure:5175: result: yes
configure:5129: checking for string.h
configure:5145: x86_64-pc-linux-gnu-gcc -c -Wall -W -march=athlon64 -mtune=k8 -pipe -O2 conftest.c >&5
configure:5151: $? = 0
configure:5155: test -z
|| test ! -s conftest.err
configure:5158: $? = 0
configure:5161: test -s conftest.o
configure:5164: $? = 0
configure:5175: result: yes
configure:5129: checking for memory.h
configure:5145: x86_64-pc-linux-gnu-gcc -c -Wall -W -march=athlon64 -mtune=k8 -pipe -O2 conftest.c >&5
configure:5151: $? = 0
configure:5155: test -z
|| test ! -s conftest.err
configure:5158: $? = 0
configure:5161: test -s conftest.o
configure:5164: $? = 0
configure:5175: result: yes
configure:5129: checking for strings.h
configure:5145: x86_64-pc-linux-gnu-gcc -c -Wall -W -march=athlon64 -mtune=k8 -pipe -O2 conftest.c >&5
configure:5151: $? = 0
configure:5155: test -z
|| test ! -s conftest.err
configure:5158: $? = 0
configure:5161: test -s conftest.o
configure:5164: $? = 0
configure:5175: result: yes
configure:5129: checking for inttypes.h
configure:5145: x86_64-pc-linux-gnu-gcc -c -Wall -W -march=athlon64 -mtune=k8 -pipe -O2 conftest.c >&5
configure:5151: $? = 0
configure:5155: test -z
|| test ! -s conftest.err
configure:5158: $? = 0
configure:5161: test -s conftest.o
configure:5164: $? = 0
configure:5175: result: yes
configure:5129: checking for stdint.h
configure:5145: x86_64-pc-linux-gnu-gcc -c -Wall -W -march=athlon64 -mtune=k8 -pipe -O2 conftest.c >&5
configure:5151: $? = 0
configure:5155: test -z
|| test ! -s conftest.err
configure:5158: $? = 0
configure:5161: test -s conftest.o
configure:5164: $? = 0
configure:5175: result: yes
configure:5129: checking for unistd.h
configure:5145: x86_64-pc-linux-gnu-gcc -c -Wall -W -march=athlon64 -mtune=k8 -pipe -O2 conftest.c >&5
configure:5151: $? = 0
configure:5155: test -z
|| test ! -s conftest.err
configure:5158: $? = 0
configure:5161: test -s conftest.o
configure:5164: $? = 0
configure:5175: result: yes
configure:5243: checking db.h usability
configure:5255: x86_64-pc-linux-gnu-gcc -c -Wall -W -march=athlon64 -mtune=k8 -pipe -O2 conftest.c >&5
configure:5261: $? = 0
configure:5265: test -z
|| test ! -s conftest.err
configure:5268: $? = 0
configure:5271: test -s conftest.o
configure:5274: $? = 0
configure:5284: result: yes
configure:5288: checking db.h presence
configure:5298: x86_64-pc-linux-gnu-gcc -E conftest.c
configure:5304: $? = 0
configure:5324: result: yes
configure:5359: checking for db.h
configure:5366: result: yes
configure:5415: x86_64-pc-linux-gnu-gcc -o conftest -Wall -W -march=athlon64 -mtune=k8 -pipe -O2 conftest.c -ldb-4.4 >&5
/usr/lib/gcc/x86_64-pc-linux-gnu/3.4.4/../../../../x86_64-pc-linux-gnu/bin/ld: cannot find -ldb-4.4
collect2: ld returned 1 exit status
configure:5421: $? = 1
configure: failed program was:
| /* confdefs.h. */
|
| #define PACKAGE_NAME ""
| #define PACKAGE_TARNAME ""
| #define PACKAGE_VERSION ""
| #define PACKAGE_STRING ""
| #define PACKAGE_BUGREPORT ""
| #define PACKAGE "cyrus-sasl"
| #define VERSION "2.1.21"
| #define HAVE___ATTRIBUTE__ 1
| #define SASL_DB_PATH "/etc/sasl2/sasldb2"
| #define STDC_HEADERS 1
| #define HAVE_SYS_TYPES_H 1
| #define HAVE_SYS_STAT_H 1
| #define HAVE_STDLIB_H 1
| #define HAVE_STRING_H 1
| #define HAVE_MEMORY_H 1
| #define HAVE_STRINGS_H 1
| #define HAVE_INTTYPES_H 1
| #define HAVE_STDINT_H 1
| #define HAVE_UNISTD_H 1
| /* end confdefs.h. */
| #include <db.h>
| int
| main ()
| {
| db_create(NULL, NULL, 0);
| ;
| return 0;
| }
configure:5415: x86_64-pc-linux-gnu-gcc -o conftest -Wall -W -march=athlon64 -mtune=k8 -pipe -O2 conftest.c -ldb4.4 >&5
/usr/lib/gcc/x86_64-pc-linux-gnu/3.4.4/../../../../x86_64-pc-linux-gnu/bin/ld: cannot find -ldb4.4
collect2: ld returned 1 exit status
configure:5421: $? = 1
configure: failed program was:
| /* confdefs.h. */
|
| #define PACKAGE_NAME ""
| #define PACKAGE_TARNAME ""
| #define PACKAGE_VERSION ""
| #define PACKAGE_STRING ""
| #define PACKAGE_BUGREPORT ""
| #define PACKAGE "cyrus-sasl"
| #define VERSION "2.1.21"
| #define HAVE___ATTRIBUTE__ 1
| #define SASL_DB_PATH "/etc/sasl2/sasldb2"
| #define STDC_HEADERS 1
| #define HAVE_SYS_TYPES_H 1
| #define HAVE_SYS_STAT_H 1
| #define HAVE_STDLIB_H 1
| #define HAVE_STRING_H 1
| #define HAVE_MEMORY_H 1
| #define HAVE_STRINGS_H 1
| #define HAVE_INTTYPES_H 1
| #define HAVE_STDINT_H 1
| #define HAVE_UNISTD_H 1
| /* end confdefs.h. */
| #include <db.h>
| int
| main ()
| {
| db_create(NULL, NULL, 0);
| ;
| return 0;
| }
configure:5415: x86_64-pc-linux-gnu-gcc -o conftest -Wall -W -march=athlon64 -mtune=k8 -pipe -O2 conftest.c -ldb44 >&5
/usr/lib/gcc/x86_64-pc-linux-gnu/3.4.4/../../../../x86_64-pc-linux-gnu/bin/ld: cannot find -ldb44
collect2: ld returned 1 exit status
configure:5421: $? = 1
configure: failed program was:
| /* confdefs.h. */
|
| #define PACKAGE_NAME ""
| #define PACKAGE_TARNAME ""
| #define PACKAGE_VERSION ""
| #define PACKAGE_STRING ""
| #define PACKAGE_BUGREPORT ""
| #define PACKAGE "cyrus-sasl"
| #define VERSION "2.1.21"
| #define HAVE___ATTRIBUTE__ 1
| #define SASL_DB_PATH "/etc/sasl2/sasldb2"
| #define STDC_HEADERS 1
| #define HAVE_SYS_TYPES_H 1
| #define HAVE_SYS_STAT_H 1
| #define HAVE_STDLIB_H 1
| #define HAVE_STRING_H 1
| #define HAVE_MEMORY_H 1
| #define HAVE_STRINGS_H 1
| #define HAVE_INTTYPES_H 1
| #define HAVE_STDINT_H 1
| #define HAVE_UNISTD_H 1
| /* end confdefs.h. */
| #include <db.h>
| int
| main ()
| {
| db_create(NULL, NULL, 0);
| ;
| return 0;
| }
configure:5415: x86_64-pc-linux-gnu-gcc -o conftest -Wall -W -march=athlon64 -mtune=k8 -pipe -O2 conftest.c -ldb-4.3 >&5
/usr/lib/gcc/x86_64-pc-linux-gnu/3.4.4/../../../../x86_64-pc-linux-gnu/bin/ld: cannot find -ldb-4.3
collect2: ld returned 1 exit status
configure:5421: $? = 1
configure: failed program was:
| /* confdefs.h. */
|
| #define PACKAGE_NAME ""
| #define PACKAGE_TARNAME ""
| #define PACKAGE_VERSION ""
| #define PACKAGE_STRING ""
| #define PACKAGE_BUGREPORT ""
| #define PACKAGE "cyrus-sasl"
| #define VERSION "2.1.21"
| #define HAVE___ATTRIBUTE__ 1
| #define SASL_DB_PATH "/etc/sasl2/sasldb2"
| #define STDC_HEADERS 1
| #define HAVE_SYS_TYPES_H 1
| #define HAVE_SYS_STAT_H 1
| #define HAVE_STDLIB_H 1
| #define HAVE_STRING_H 1
| #define HAVE_MEMORY_H 1
| #define HAVE_STRINGS_H 1
| #define HAVE_INTTYPES_H 1
| #define HAVE_STDINT_H 1
| #define HAVE_UNISTD_H 1
| /* end confdefs.h. */
| #include <db.h>
| int
| main ()
| {
| db_create(NULL, NULL, 0);
| ;
| return 0;
| }
configure:5415: x86_64-pc-linux-gnu-gcc -o conftest -Wall -W -march=athlon64 -mtune=k8 -pipe -O2 conftest.c -ldb4.3 >&5
/usr/lib/gcc/x86_64-pc-linux-gnu/3.4.4/../../../../x86_64-pc-linux-gnu/bin/ld: cannot find -ldb4.3
collect2: ld returned 1 exit status
configure:5421: $? = 1
configure: failed program was:
| /* confdefs.h. */
|
| #define PACKAGE_NAME ""
| #define PACKAGE_TARNAME ""
| #define PACKAGE_VERSION ""
| #define PACKAGE_STRING ""
| #define PACKAGE_BUGREPORT ""
| #define PACKAGE "cyrus-sasl"
| #define VERSION "2.1.21"
| #define HAVE___ATTRIBUTE__ 1
| #define SASL_DB_PATH "/etc/sasl2/sasldb2"
| #define STDC_HEADERS 1
| #define HAVE_SYS_TYPES_H 1
| #define HAVE_SYS_STAT_H 1
| #define HAVE_STDLIB_H 1
| #define HAVE_STRING_H 1
| #define HAVE_MEMORY_H 1
| #define HAVE_STRINGS_H 1
| #define HAVE_INTTYPES_H 1
| #define HAVE_STDINT_H 1
| #define HAVE_UNISTD_H 1
| /* end confdefs.h. */
| #include <db.h>
| int
| main ()
| {
| db_create(NULL, NULL, 0);
| ;
| return 0;
| }
configure:5415: x86_64-pc-linux-gnu-gcc -o conftest -Wall -W -march=athlon64 -mtune=k8 -pipe -O2 conftest.c -ldb43 >&5
/usr/lib/gcc/x86_64-pc-linux-gnu/3.4.4/../../../../x86_64-pc-linux-gnu/bin/ld: cannot find -ldb43
collect2: ld returned 1 exit status
configure:5421: $? = 1
configure: failed program was:
| /* confdefs.h. */
|
| #define PACKAGE_NAME ""
| #define PACKAGE_TARNAME ""
| #define PACKAGE_VERSION ""
| #define PACKAGE_STRING ""
| #define PACKAGE_BUGREPORT ""
| #define PACKAGE "cyrus-sasl"
| #define VERSION "2.1.21"
| #define HAVE___ATTRIBUTE__ 1
| #define SASL_DB_PATH "/etc/sasl2/sasldb2"
| #define STDC_HEADERS 1
| #define HAVE_SYS_TYPES_H 1
| #define HAVE_SYS_STAT_H 1
| #define HAVE_STDLIB_H 1
| #define HAVE_STRING_H 1
| #define HAVE_MEMORY_H 1
| #define HAVE_STRINGS_H 1
| #define HAVE_INTTYPES_H 1
| #define HAVE_STDINT_H 1
| #define HAVE_UNISTD_H 1
| /* end confdefs.h. */
| #include <db.h>
| int
| main ()
| {
| db_create(NULL, NULL, 0);
| ;
| return 0;
| }
configure:5415: x86_64-pc-linux-gnu-gcc -o conftest -Wall -W -march=athlon64 -mtune=k8 -pipe -O2 conftest.c -ldb-4.2 >&5
configure:5421: $? = 0
configure:5425: test -z
|| test ! -s conftest.err
configure:5428: $? = 0
configure:5431: test -s conftest
configure:5434: $? = 0
configure:6899: checking DB library to use
configure:6901: result: berkeley
configure:6982: checking for dlopen in -ldl
configure:7012: x86_64-pc-linux-gnu-gcc -o conftest -Wall -W -march=athlon64 -mtune=k8 -pipe -O2 conftest.c -ldl >&5
configure:7018: $? = 0
configure:7022: test -z
|| test ! -s conftest.err
configure:7025: $? = 0
configure:7028: test -s conftest
configure:7031: $? = 0
configure:7044: result: yes
configure:7063: checking /dev/random to use
configure:7065: result: /dev/random
configure:7078: checking for nm
configure:7104: result: /usr/bin/nm -B
configure:7115: checking for underscore before symbols
configure:7131: result: no
configure:7202: checking for syslog
configure:7259: x86_64-pc-linux-gnu-gcc -o conftest -Wall -W -march=athlon64 -mtune=k8 -pipe -O2 conftest.c >&5
configure:7265: $? = 0
configure:7269: test -z
|| test ! -s conftest.err
configure:7272: $? = 0
configure:7275: test -s conftest
configure:7278: $? = 0
configure:7290: result: yes
configure:7329: checking security/pam_appl.h usability
configure:7341: x86_64-pc-linux-gnu-gcc -c -Wall -W -march=athlon64 -mtune=k8 -pipe -O2 conftest.c >&5
configure:7347: $? = 0
configure:7351: test -z
|| test ! -s conftest.err
configure:7354: $? = 0
configure:7357: test -s conftest.o
configure:7360: $? = 0
configure:7370: result: yes
configure:7374: checking security/pam_appl.h presence
configure:7384: x86_64-pc-linux-gnu-gcc -E conftest.c
configure:7390: $? = 0
configure:7410: result: yes
configure:7445: checking for security/pam_appl.h
configure:7452: result: yes
configure:7329: checking pam/pam_appl.h usability
configure:7341: x86_64-pc-linux-gnu-gcc -c -Wall -W -march=athlon64 -mtune=k8 -pipe -O2 conftest.c >&5
conftest.c:61:26: pam/pam_appl.h: No such file or directory
configure:7347: $? = 1
configure: failed program was:
| /* confdefs.h. */
|
| #define PACKAGE_NAME ""
| #define PACKAGE_TARNAME ""
| #define PACKAGE_VERSION ""
| #define PACKAGE_STRING ""
| #define PACKAGE_BUGREPORT ""
| #define PACKAGE "cyrus-sasl"
| #define VERSION "2.1.21"
| #define HAVE___ATTRIBUTE__ 1
| #define SASL_DB_PATH "/etc/sasl2/sasldb2"
| #define STDC_HEADERS 1
| #define HAVE_SYS_TYPES_H 1
| #define HAVE_SYS_STAT_H 1
| #define HAVE_STDLIB_H 1
| #define HAVE_STRING_H 1
| #define HAVE_MEMORY_H 1
| #define HAVE_STRINGS_H 1
| #define HAVE_INTTYPES_H 1
| #define HAVE_STDINT_H 1
| #define HAVE_UNISTD_H 1
| #define SASL_BERKELEYDB
| #define SASL_DEV_RANDOM "/dev/random"
| #define HAVE_SYSLOG 1
| #define HAVE_SECURITY_PAM_APPL_H 1
| /* end confdefs.h. */
| #include <stdio.h>
| #if HAVE_SYS_TYPES_H
| # include <sys/types.h>
| #endif
| #if HAVE_SYS_STAT_H
| # include <sys/stat.h>
| #endif
| #if STDC_HEADERS
| # include <stdlib.h>
| # include <stddef.h>
| #else
| # if HAVE_STDLIB_H
| # include <stdlib.h>
| # endif
| #endif
| #if HAVE_STRING_H
| # if !STDC_HEADERS && HAVE_MEMORY_H
| # include <memory.h>
| # endif
| # include <string.h>
| #endif
| #if HAVE_STRINGS_H
| # include <strings.h>
| #endif
| #if HAVE_INTTYPES_H
| # include <inttypes.h>
| #else
| # if HAVE_STDINT_H
| # include <stdint.h>
| # endif
| #endif
| #if HAVE_UNISTD_H
| # include <unistd.h>
| #endif
| #include <pam/pam_appl.h>
configure:7370: result: no
configure:7374: checking pam/pam_appl.h presence
configure:7384: x86_64-pc-linux-gnu-gcc -E conftest.c
conftest.c:27:26: pam/pam_appl.h: No such file or directory
configure:7390: $? = 1
configure: failed program was:
| /* confdefs.h. */
|
| #define PACKAGE_NAME ""
| #define PACKAGE_TARNAME ""
| #define PACKAGE_VERSION ""
| #define PACKAGE_STRING ""
| #define PACKAGE_BUGREPORT ""
| #define PACKAGE "cyrus-sasl"
| #define VERSION "2.1.21"
| #define HAVE___ATTRIBUTE__ 1
| #define SASL_DB_PATH "/etc/sasl2/sasldb2"
| #define STDC_HEADERS 1
| #define HAVE_SYS_TYPES_H 1
| #define HAVE_SYS_STAT_H 1
| #define HAVE_STDLIB_H 1
| #define HAVE_STRING_H 1
| #define HAVE_MEMORY_H 1
| #define HAVE_STRINGS_H 1
| #define HAVE_INTTYPES_H 1
| #define HAVE_STDINT_H 1
| #define HAVE_UNISTD_H 1
| #define SASL_BERKELEYDB
| #define SASL_DEV_RANDOM "/dev/random"
| #define HAVE_SYSLOG 1
| #define HAVE_SECURITY_PAM_APPL_H 1
| /* end confdefs.h. */
| #include <pam/pam_appl.h>
configure:7410: result: no
configure:7445: checking for pam/pam_appl.h
configure:7452: result: no
configure:7466: checking for pam_start
configure:7523: x86_64-pc-linux-gnu-gcc -o conftest -Wall -W -march=athlon64 -mtune=k8 -pipe -O2 conftest.c >&5
/var/tmp/portage/cyrus-sasl-2.1.21-r1/temp/cc3ttwKu.o: In function `main':
conftest.c:(.text+0x9): undefined reference to `pam_start'
/var/tmp/portage/cyrus-sasl-2.1.21-r1/temp/cc3ttwKu.o:(.data+0x0): undefined reference to `pam_start'
collect2: ld returned 1 exit status
configure:7529: $? = 1
configure: failed program was:
| /* confdefs.h. */
|
| #define PACKAGE_NAME ""
| #define PACKAGE_TARNAME ""
| #define PACKAGE_VERSION ""
| #define PACKAGE_STRING ""
| #define PACKAGE_BUGREPORT ""
| #define PACKAGE "cyrus-sasl"
| #define VERSION "2.1.21"
| #define HAVE___ATTRIBUTE__ 1
| #define SASL_DB_PATH "/etc/sasl2/sasldb2"
| #define STDC_HEADERS 1
| #define HAVE_SYS_TYPES_H 1
| #define HAVE_SYS_STAT_H 1
| #define HAVE_STDLIB_H 1
| #define HAVE_STRING_H 1
| #define HAVE_MEMORY_H 1
| #define HAVE_STRINGS_H 1
| #define HAVE_INTTYPES_H 1
| #define HAVE_STDINT_H 1
| #define HAVE_UNISTD_H 1
| #define SASL_BERKELEYDB
| #define SASL_DEV_RANDOM "/dev/random"
| #define HAVE_SYSLOG 1
| #define HAVE_SECURITY_PAM_APPL_H 1
| /* end confdefs.h. */
| /* Define pam_start to an innocuous variant, in case <limits.h> declares pam_start.
| For example, HP-UX 11i <limits.h> declares gettimeofday. */
| #define pam_start innocuous_pam_start
|
| /* System header to define __stub macros and hopefully few prototypes,
| which can conflict with char pam_start (); below.
| Prefer <limits.h> to <assert.h> if __STDC__ is defined, since
| <limits.h> exists even on freestanding compilers. */
|
| #ifdef __STDC__
| # include <limits.h>
| #else
| # include <assert.h>
| #endif
|
| #undef pam_start
|
| /* Override any gcc2 internal prototype to avoid an error. */
| #ifdef __cplusplus
| extern "C"
| {
| #endif
| /* We use char because int might match the return type of a gcc2
| builtin and then its argument prototype would still apply. */
| char pam_start ();
| /* The GNU C library defines this for functions which it implements
| to always fail with ENOSYS. Some functions are actually named
| something starting with __ and the normal name is an alias. */
| #if defined (__stub_pam_start) || defined (__stub___pam_start)
| choke me
| #else
| char (*f) () = pam_start;
| #endif
| #ifdef __cplusplus
| }
| #endif
|
| int
| main ()
| {
| return f != pam_start;
| ;
| return 0;
| }
configure:7554: result: no
configure:7591: x86_64-pc-linux-gnu-gcc -o conftest -Wall -W -march=athlon64 -mtune=k8 -pipe -O2 conftest.c -lpam >&5
conftest.c: In function `main':
conftest.c:41: error: `pam_handle_t' undeclared (first use in this function)
conftest.c:41: error: (Each undeclared identifier is reported only once
conftest.c:41: error: for each function it appears in.)
conftest.c:41: error: `pamh' undeclared (first use in this function)
conftest.c:44: warning: implicit declaration of function `pam_start'
configure:7597: $? = 1
configure: failed program was:
| /* confdefs.h. */
|
| #define PACKAGE_NAME ""
| #define PACKAGE_TARNAME ""
| #define PACKAGE_VERSION ""
| #define PACKAGE_STRING ""
| #define PACKAGE_BUGREPORT ""
| #define PACKAGE "cyrus-sasl"
| #define VERSION "2.1.21"
| #define HAVE___ATTRIBUTE__ 1
| #define SASL_DB_PATH "/etc/sasl2/sasldb2"
| #define STDC_HEADERS 1
| #define HAVE_SYS_TYPES_H 1
| #define HAVE_SYS_STAT_H 1
| #define HAVE_STDLIB_H 1
| #define HAVE_STRING_H 1
| #define HAVE_MEMORY_H 1
| #define HAVE_STRINGS_H 1
| #define HAVE_INTTYPES_H 1
| #define HAVE_STDINT_H 1
| #define HAVE_UNISTD_H 1
| #define SASL_BERKELEYDB
| #define SASL_DEV_RANDOM "/dev/random"
| #define HAVE_SYSLOG 1
| #define HAVE_SECURITY_PAM_APPL_H 1
| /* end confdefs.h. */
|
| #include <sys/types.h>
| #ifdef HAVE_PAM_PAM_APPL_H
| #include <pam/pam_appl.h>
| #endif
| #ifdef HAVE_SECURITY_PAM_H
| #include <security/pam_appl.h>
| #endif
| int
| main ()
| {
|
| const char *service="foo";
| const char *user="bar";
| pam_handle_t *pamh;
| struct pam_conv *conv;
| int baz;
| baz = pam_start(service, user, conv, &pamh);
| return 0;
|
| ;
| return 0;
| }
configure:7659: checking if I should include saslauthd
configure:7661: result: /var/lib/sasl2
configure:7687: checking to include Courier authdaemond support
configure:7689: result: no
configure:7714: checking for getspnam
configure:7771: x86_64-pc-linux-gnu-gcc -o conftest -Wall -W -march=athlon64 -mtune=k8 -pipe -O2 conftest.c >&5
configure:7777: $? = 0
configure:7781: test -z
|| test ! -s conftest.err
configure:7784: $? = 0
configure:7787: test -s conftest
configure:7790: $? = 0
configure:7802: result: yes
configure:7822: checking if I should include pwcheck
configure:7824: result: /var/lib/sasl2
configure:7862: checking if I should include the alwaystrue verifier
configure:7864: result: no
configure:7875: checking if we should enable sasl_checkapop
configure:7878: result: enabled
configure:7898: checking CRAM-MD5
configure:7901: result: enabled
configure:7924: checking for long
configure:7948: x86_64-pc-linux-gnu-gcc -c -Wall -W -march=athlon64 -mtune=k8 -pipe -O2 conftest.c >&5
configure:7954: $? = 0
configure:7958: test -z
|| test ! -s conftest.err
configure:7961: $? = 0
configure:7964: test -s conftest.o
configure:7967: $? = 0
configure:7978: result: yes
configure:7981: checking size of long
configure:8300: x86_64-pc-linux-gnu-gcc -o conftest -Wall -W -march=athlon64 -mtune=k8 -pipe -O2 conftest.c >&5
configure:8303: $? = 0
configure:8305: ./conftest
configure:8308: $? = 0
configure:8331: result: 8
configure:8338: checking what directory libraries are found in
configure:8357: result: lib64
configure:8393: checking for RSAPublicEncrypt in -lrsaref
configure:8423: x86_64-pc-linux-gnu-gcc -o conftest -Wall -W -march=athlon64 -mtune=k8 -pipe -O2 conftest.c -lrsaref >&5
/usr/lib/gcc/x86_64-pc-linux-gnu/3.4.4/../../../../x86_64-pc-linux-gnu/bin/ld: cannot find -lrsaref
collect2: ld returned 1 exit status
configure:8429: $? = 1
configure: failed program was:
| /* confdefs.h. */
|
| #define PACKAGE_NAME ""
| #define PACKAGE_TARNAME ""
| #define PACKAGE_VERSION ""
| #define PACKAGE_STRING ""
| #define PACKAGE_BUGREPORT ""
| #define PACKAGE "cyrus-sasl"
| #define VERSION "2.1.21"
| #define HAVE___ATTRIBUTE__ 1
| #define SASL_DB_PATH "/etc/sasl2/sasldb2"
| #define STDC_HEADERS 1
| #define HAVE_SYS_TYPES_H 1
| #define HAVE_SYS_STAT_H 1
| #define HAVE_STDLIB_H 1
| #define HAVE_STRING_H 1
| #define HAVE_MEMORY_H 1
| #define HAVE_STRINGS_H 1
| #define HAVE_INTTYPES_H 1
| #define HAVE_STDINT_H 1
| #define HAVE_UNISTD_H 1
| #define SASL_BERKELEYDB
| #define SASL_DEV_RANDOM "/dev/random"
| #define HAVE_SYSLOG 1
| #define HAVE_SECURITY_PAM_APPL_H 1
| #define HAVE_SASLAUTHD
| #define PATH_SASLAUTHD_RUNDIR "/var/lib/sasl2"
| #define HAVE_PWCHECK
| #define PWCHECKDIR "/var/lib/sasl2"
| #define DO_SASL_CHECKAPOP
| #define SIZEOF_LONG 8
| /* end confdefs.h. */
|
| /* Override any gcc2 internal prototype to avoid an error. */
| #ifdef __cplusplus
| extern "C"
| #endif
| /* We use char because int might match the return type of a gcc2
| builtin and then its argument prototype would still apply. */
| char RSAPublicEncrypt ();
| int
| main ()
| {
| RSAPublicEncrypt ();
| ;
| return 0;
| }
configure:8455: result: no
configure:8474: checking openssl/evp.h usability
configure:8486: x86_64-pc-linux-gnu-gcc -c -Wall -W -march=athlon64 -mtune=k8 -pipe -O2 conftest.c >&5
configure:8492: $? = 0
configure:8496: test -z
|| test ! -s conftest.err
configure:8499: $? = 0
configure:8502: test -s conftest.o
configure:8505: $? = 0
configure:8515: result: yes
configure:8519: checking openssl/evp.h presence
configure:8529: x86_64-pc-linux-gnu-gcc -E conftest.c
configure:8535: $? = 0
configure:8555: result: yes
configure:8590: checking for openssl/evp.h
configure:8597: result: yes
configure:8603: checking for EVP_DigestInit in -lcrypto
configure:8633: x86_64-pc-linux-gnu-gcc -o conftest -Wall -W -march=athlon64 -mtune=k8 -pipe -O2 conftest.c -lcrypto >&5
configure:8639: $? = 0
configure:8643: test -z
|| test ! -s conftest.err
configure:8646: $? = 0
configure:8649: test -s conftest
configure:8652: $? = 0
configure:8665: result: yes
configure:8692: checking for OpenSSL
configure:8694: result: yes
configure:8715: checking for des_cbc_encrypt in -lcrypto
configure:8745: x86_64-pc-linux-gnu-gcc -o conftest -Wall -W -march=athlon64 -mtune=k8 -pipe -O2 conftest.c -lcrypto >&5
/var/tmp/portage/cyrus-sasl-2.1.21-r1/temp/ccYyYCnj.o: In function `main':
conftest.c:(.text+0x7): undefined reference to `des_cbc_encrypt'
collect2: ld returned 1 exit status
configure:8751: $? = 1
configure: failed program was:
| /* confdefs.h. */
|
| #define PACKAGE_NAME ""
| #define PACKAGE_TARNAME ""
| #define PACKAGE_VERSION ""
| #define PACKAGE_STRING ""
| #define PACKAGE_BUGREPORT ""
| #define PACKAGE "cyrus-sasl"
| #define VERSION "2.1.21"
| #define HAVE___ATTRIBUTE__ 1
| #define SASL_DB_PATH "/etc/sasl2/sasldb2"
| #define STDC_HEADERS 1
| #define HAVE_SYS_TYPES_H 1
| #define HAVE_SYS_STAT_H 1
| #define HAVE_STDLIB_H 1
| #define HAVE_STRING_H 1
| #define HAVE_MEMORY_H 1
| #define HAVE_STRINGS_H 1
| #define HAVE_INTTYPES_H 1
| #define HAVE_STDINT_H 1
| #define HAVE_UNISTD_H 1
| #define SASL_BERKELEYDB
| #define SASL_DEV_RANDOM "/dev/random"
| #define HAVE_SYSLOG 1
| #define HAVE_SECURITY_PAM_APPL_H 1
| #define HAVE_SASLAUTHD
| #define PATH_SASLAUTHD_RUNDIR "/var/lib/sasl2"
| #define HAVE_PWCHECK
| #define PWCHECKDIR "/var/lib/sasl2"
| #define DO_SASL_CHECKAPOP
| #define SIZEOF_LONG 8
| #define HAVE_OPENSSL
| /* end confdefs.h. */
|
| /* Override any gcc2 internal prototype to avoid an error. */
| #ifdef __cplusplus
| extern "C"
| #endif
| /* We use char because int might match the return type of a gcc2
| builtin and then its argument prototype would still apply. */
| char des_cbc_encrypt ();
| int
| main ()
| {
| des_cbc_encrypt ();
| ;
| return 0;
| }
configure:8777: result: no
configure:8937: checking for DES_cbc_encrypt in -lcrypto
configure:8967: x86_64-pc-linux-gnu-gcc -o conftest -Wall -W -march=athlon64 -mtune=k8 -pipe -O2 conftest.c -lcrypto >&5
configure:8973: $? = 0
configure:8977: test -z
|| test ! -s conftest.err
configure:8980: $? = 0
configure:8983: test -s conftest
configure:8986: $? = 0
configure:8999: result: yes
configure:9013: checking openssl/des.h usability
configure:9025: x86_64-pc-linux-gnu-gcc -c -Wall -W -march=athlon64 -mtune=k8 -pipe -O2 conftest.c >&5
configure:9031: $? = 0
configure:9035: test -z
|| test ! -s conftest.err
configure:9038: $? = 0
configure:9041: test -s conftest.o
configure:9044: $? = 0
configure:9054: result: yes
configure:9058: checking openssl/des.h presence
configure:9068: x86_64-pc-linux-gnu-gcc -E conftest.c
configure:9074: $? = 0
configure:9094: result: yes
configure:9129: checking for openssl/des.h
configure:9136: result: yes
configure:9709: checking DIGEST-MD5
configure:9712: result: enabled
configure:9743: checking OTP
configure:10012: result: disabled
configure:10030: checking SRP
configure:10073: result: disabled
configure:10736: checking KERBEROS_V4
configure:10756: result: disabled
configure:10761: checking for crypt
configure:10818: x86_64-pc-linux-gnu-gcc -o conftest -Wall -W -march=athlon64 -mtune=k8 -pipe -O2 conftest.c >&5
/var/tmp/portage/cyrus-sasl-2.1.21-r1/temp/cc7LmCbI.o: In function `main':
conftest.c:(.text+0x9): undefined reference to `crypt'
/var/tmp/portage/cyrus-sasl-2.1.21-r1/temp/cc7LmCbI.o:(.data+0x0): undefined reference to `crypt'
collect2: ld returned 1 exit status
configure:10824: $? = 1
configure: failed program was:
| /* confdefs.h. */
|
| #define PACKAGE_NAME ""
| #define PACKAGE_TARNAME ""
| #define PACKAGE_VERSION ""
| #define PACKAGE_STRING ""
| #define PACKAGE_BUGREPORT ""
| #define PACKAGE "cyrus-sasl"
| #define VERSION "2.1.21"
| #define HAVE___ATTRIBUTE__ 1
| #define SASL_DB_PATH "/etc/sasl2/sasldb2"
| #define STDC_HEADERS 1
| #define HAVE_SYS_TYPES_H 1
| #define HAVE_SYS_STAT_H 1
| #define HAVE_STDLIB_H 1
| #define HAVE_STRING_H 1
| #define HAVE_MEMORY_H 1
| #define HAVE_STRINGS_H 1
| #define HAVE_INTTYPES_H 1
| #define HAVE_STDINT_H 1
| #define HAVE_UNISTD_H 1
| #define SASL_BERKELEYDB
| #define SASL_DEV_RANDOM "/dev/random"
| #define HAVE_SYSLOG 1
| #define HAVE_SECURITY_PAM_APPL_H 1
| #define HAVE_SASLAUTHD
| #define PATH_SASLAUTHD_RUNDIR "/var/lib/sasl2"
| #define HAVE_PWCHECK
| #define PWCHECKDIR "/var/lib/sasl2"
| #define DO_SASL_CHECKAPOP
| #define SIZEOF_LONG 8
| #define HAVE_OPENSSL
| #define WITH_SSL_DES
| #define WITH_DES
| /* end confdefs.h. */
| /* Define crypt to an innocuous variant, in case <limits.h> declares crypt.
| For example, HP-UX 11i <limits.h> declares gettimeofday. */
| #define crypt innocuous_crypt
|
| /* System header to define __stub macros and hopefully few prototypes,
| which can conflict with char crypt (); below.
| Prefer <limits.h> to <assert.h> if __STDC__ is defined, since
| <limits.h> exists even on freestanding compilers. */
|
| #ifdef __STDC__
| # include <limits.h>
| #else
| # include <assert.h>
| #endif
|
| #undef crypt
|
| /* Override any gcc2 internal prototype to avoid an error. */
| #ifdef __cplusplus
| extern "C"
| {
| #endif
| /* We use char because int might match the return type of a gcc2
| builtin and then its argument prototype would still apply. */
| char crypt ();
| /* The GNU C library defines this for functions which it implements
| to always fail with ENOSYS. Some functions are actually named
| something starting with __ and the normal name is an alias. */
| #if defined (__stub_crypt) || defined (__stub___crypt)
| choke me
| #else
| char (*f) () = crypt;
| #endif
| #ifdef __cplusplus
| }
| #endif
|
| int
| main ()
| {
| return f != crypt;
| ;
| return 0;
| }
configure:10849: result: no
configure:10854: checking for crypt in -lcrypt
configure:10884: x86_64-pc-linux-gnu-gcc -o conftest -Wall -W -march=athlon64 -mtune=k8 -pipe -O2 conftest.c -lcrypt >&5
configure:10890: $? = 0
configure:10894: test -z
|| test ! -s conftest.err
configure:10897: $? = 0
configure:10900: test -s conftest
configure:10903: $? = 0
configure:10916: result: yes
configure:11970: checking GSSAPI
configure:12153: result: disabled
configure:12209: checking PLAIN
configure:12212: result: enabled
configure:12238: checking ANONYMOUS
configure:12241: result: enabled
configure:12266: checking LOGIN
configure:12269: result: enabled
configure:12300: checking NTLM
configure:12303: result: enabled
configure:12337: checking PASSDSS
configure:12356: result: disabled
configure:12382: checking SQL
configure:12398: result: disabled
configure:12893: checking LDAPDB
configure:12896: result: enabled
configure:12935: checking ldap.h usability
configure:12947: x86_64-pc-linux-gnu-gcc -c -Wall -W -march=athlon64 -mtune=k8 -pipe -O2 conftest.c >&5
configure:12953: $? = 0
configure:12957: test -z
|| test ! -s conftest.err
configure:12960: $? = 0
configure:12963: test -s conftest.o
configure:12966: $? = 0
configure:12976: result: yes
configure:12980: checking ldap.h presence
configure:12990: x86_64-pc-linux-gnu-gcc -E conftest.c
configure:12996: $? = 0
configure:13016: result: yes
configure:13051: checking for ldap.h
configure:13058: result: yes
configure:12935: checking lber.h usability
configure:12947: x86_64-pc-linux-gnu-gcc -c -Wall -W -march=athlon64 -mtune=k8 -pipe -O2 conftest.c >&5
configure:12953: $? = 0
configure:12957: test -z
|| test ! -s conftest.err
configure:12960: $? = 0
configure:12963: test -s conftest.o
configure:12966: $? = 0
configure:12976: result: yes
configure:12980: checking lber.h presence
configure:12990: x86_64-pc-linux-gnu-gcc -E conftest.c
configure:12996: $? = 0
configure:13016: result: yes
configure:13051: checking for lber.h
configure:13058: result: yes
configure:13073: checking OpenLDAP api
configure:13102: result: yes
configure:13107: checking for ldap_initialize in -lldap
configure:13137: x86_64-pc-linux-gnu-gcc -o conftest -Wall -W -march=athlon64 -mtune=k8 -pipe -O2 conftest.c -lldap -llber >&5
configure:13143: $? = 0
configure:13147: test -z
|| test ! -s conftest.err
configure:13150: $? = 0
configure:13153: test -s conftest
configure:13156: $? = 0
configure:13169: result: yes
configure:13185: checking OpenLDAP version
configure:13217: result: yes
configure:13326: checking for dmalloc library
configure:13368: result: no
configure:13374: checking for sfio library
configure:13442: result: no
configure:13458: checking for getsubopt
configure:13515: x86_64-pc-linux-gnu-gcc -o conftest -Wall -W -march=athlon64 -mtune=k8 -pipe -O2 conftest.c >&5
configure:13521: $? = 0
configure:13525: test -z
|| test ! -s conftest.err
configure:13528: $? = 0
configure:13531: test -s conftest
configure:13534: $? = 0
configure:13546: result: yes
configure:13573: checking for snprintf
configure:13630: x86_64-pc-linux-gnu-gcc -o conftest -Wall -W -march=athlon64 -mtune=k8 -pipe -O2 conftest.c >&5
conftest.c:67: warning: conflicting types for built-in function 'snprintf'
configure:13636: $? = 0
configure:13640: test -z
|| test ! -s conftest.err
configure:13643: $? = 0
configure:13646: test -s conftest
configure:13649: $? = 0
configure:13661: result: yes
configure:13673: checking for vsnprintf
configure:13730: x86_64-pc-linux-gnu-gcc -o conftest -Wall -W -march=athlon64 -mtune=k8 -pipe -O2 conftest.c >&5
conftest.c:68: warning: conflicting types for built-in function 'vsnprintf'
configure:13736: $? = 0
configure:13740: test -z
|| test ! -s conftest.err
configure:13743: $? = 0
configure:13746: test -s conftest
configure:13749: $? = 0
configure:13761: result: yes
configure:13789: checking for inet_aton in -lresolv
configure:13819: x86_64-pc-linux-gnu-gcc -o conftest -Wall -W -march=athlon64 -mtune=k8 -pipe -O2 conftest.c -lresolv >&5
configure:13825: $? = 0
configure:13829: test -z
|| test ! -s conftest.err
configure:13832: $? = 0
configure:13835: test -s conftest
configure:13838: $? = 0
configure:13851: result: yes
configure:13866: checking for getaddrinfo
configure:13923: x86_64-pc-linux-gnu-gcc -o conftest -Wall -W -march=athlon64 -mtune=k8 -pipe -O2 conftest.c -lresolv >&5
configure:13929: $? = 0
configure:13933: test -z
|| test ! -s conftest.err
configure:13936: $? = 0
configure:13939: test -s conftest
configure:13942: $? = 0
configure:13954: result: yes
configure:14257: checking for gai_strerror
configure:14314: x86_64-pc-linux-gnu-gcc -o conftest -Wall -W -march=athlon64 -mtune=k8 -pipe -O2 conftest.c -lresolv >&5
configure:14320: $? = 0
configure:14324: test -z
|| test ! -s conftest.err
configure:14327: $? = 0
configure:14330: test -s conftest
configure:14333: $? = 0
configure:14345: result: yes
configure:14677: checking for getnameinfo
configure:14734: x86_64-pc-linux-gnu-gcc -o conftest -Wall -W -march=athlon64 -mtune=k8 -pipe -O2 conftest.c -lresolv >&5
configure:14740: $? = 0
configure:14744: test -z
|| test ! -s conftest.err
configure:14747: $? = 0
configure:14750: test -s conftest
configure:14753: $? = 0
configure:14765: result: yes
configure:15093: checking for an ANSI C-conforming const
configure:15160: x86_64-pc-linux-gnu-gcc -c -Wall -W -march=athlon64 -mtune=k8 -pipe -O2 conftest.c >&5
conftest.c: In function `main':
conftest.c:75: warning: unused variable `s'
conftest.c:95: warning: unused variable `foo'
conftest.c:56: warning: unused variable `x'
conftest.c:62: warning: unused variable `zero'
conftest.c:92: warning: 'b' might be used uninitialized in this function
conftest.c:74: warning: 't' might be used uninitialized in this function
configure:15166: $? = 0
configure:15170: test -z
|| test ! -s conftest.err
configure:15173: $? = 0
configure:15176: test -s conftest.o
configure:15179: $? = 0
configure:15190: result: yes
configure:15200: checking for inline
configure:15221: x86_64-pc-linux-gnu-gcc -c -Wall -W -march=athlon64 -mtune=k8 -pipe -O2 conftest.c >&5
configure:15227: $? = 0
configure:15231: test -z
|| test ! -s conftest.err
configure:15234: $? = 0
configure:15237: test -s conftest.o
configure:15240: $? = 0
configure:15252: result: inline
configure:15271: checking for mode_t
configure:15295: x86_64-pc-linux-gnu-gcc -c -Wall -W -march=athlon64 -mtune=k8 -pipe -O2 conftest.c >&5
configure:15301: $? = 0
configure:15305: test -z
|| test ! -s conftest.err
configure:15308: $? = 0
configure:15311: test -s conftest.o
configure:15314: $? = 0
configure:15325: result: yes
configure:15337: checking for pid_t
configure:15361: x86_64-pc-linux-gnu-gcc -c -Wall -W -march=athlon64 -mtune=k8 -pipe -O2 conftest.c >&5
configure:15367: $? = 0
configure:15371: test -z
|| test ! -s conftest.err
configure:15374: $? = 0
configure:15377: test -s conftest.o
configure:15380: $? = 0
configure:15391: result: yes
configure:15403: checking return type of signal handlers
configure:15434: x86_64-pc-linux-gnu-gcc -c -Wall -W -march=athlon64 -mtune=k8 -pipe -O2 conftest.c >&5
conftest.c: In function `main':
conftest.c:62: warning: unused variable `i'
configure:15440: $? = 0
configure:15444: test -z
|| test ! -s conftest.err
configure:15447: $? = 0
configure:15450: test -s conftest.o
configure:15453: $? = 0
configure:15464: result: void
configure:15473: checking whether time.h and sys/time.h may both be included
configure:15498: x86_64-pc-linux-gnu-gcc -c -Wall -W -march=athlon64 -mtune=k8 -pipe -O2 conftest.c >&5
configure:15504: $? = 0
configure:15508: test -z
|| test ! -s conftest.err
configure:15511: $? = 0
configure:15514: test -s conftest.o
configure:15517: $? = 0
configure:15528: result: yes
configure:15538: checking for ANSI C header files
configure:15694: result: yes
configure:15712: checking for dirent.h that defines DIR
configure:15736: x86_64-pc-linux-gnu-gcc -c -Wall -W -march=athlon64 -mtune=k8 -pipe -O2 conftest.c >&5
configure:15742: $? = 0
configure:15746: test -z
|| test ! -s conftest.err
configure:15749: $? = 0
configure:15752: test -s conftest.o
configure:15755: $? = 0
configure:15766: result: yes
configure:15779: checking for library containing opendir
configure:15809: x86_64-pc-linux-gnu-gcc -o conftest -Wall -W -march=athlon64 -mtune=k8 -pipe -O2 conftest.c -lresolv >&5
configure:15815: $? = 0
configure:15819: test -z
|| test ! -s conftest.err
configure:15822: $? = 0
configure:15825: test -s conftest
configure:15828: $? = 0
configure:15898: result: none required
configure:16034: checking for sys/wait.h that is POSIX.1 compatible
configure:16065: x86_64-pc-linux-gnu-gcc -c -Wall -W -march=athlon64 -mtune=k8 -pipe -O2 conftest.c >&5
configure:16071: $? = 0
configure:16075: test -z
|| test ! -s conftest.err
configure:16078: $? = 0
configure:16081: test -s conftest.o
configure:16084: $? = 0
configure:16095: result: yes
configure:16135: checking des.h usability
configure:16147: x86_64-pc-linux-gnu-gcc -c -Wall -W -march=athlon64 -mtune=k8 -pipe -O2 conftest.c >&5
conftest.c:87:17: des.h: No such file or directory
configure:16153: $? = 1
configure: failed program was:
| /* confdefs.h. */
|
| #define PACKAGE_NAME ""
| #define PACKAGE_TARNAME ""
| #define PACKAGE_VERSION ""
| #define PACKAGE_STRING ""
| #define PACKAGE_BUGREPORT ""
| #define PACKAGE "cyrus-sasl"
| #define VERSION "2.1.21"
| #define HAVE___ATTRIBUTE__ 1
| #define SASL_DB_PATH "/etc/sasl2/sasldb2"
| #define STDC_HEADERS 1
| #define HAVE_SYS_TYPES_H 1
| #define HAVE_SYS_STAT_H 1
| #define HAVE_STDLIB_H 1
| #define HAVE_STRING_H 1
| #define HAVE_MEMORY_H 1
| #define HAVE_STRINGS_H 1
| #define HAVE_INTTYPES_H 1
| #define HAVE_STDINT_H 1
| #define HAVE_UNISTD_H 1
| #define SASL_BERKELEYDB
| #define SASL_DEV_RANDOM "/dev/random"
| #define HAVE_SYSLOG 1
| #define HAVE_SECURITY_PAM_APPL_H 1
| #define HAVE_SASLAUTHD
| #define PATH_SASLAUTHD_RUNDIR "/var/lib/sasl2"
| #define HAVE_PWCHECK
| #define PWCHECKDIR "/var/lib/sasl2"
| #define DO_SASL_CHECKAPOP
| #define SIZEOF_LONG 8
| #define HAVE_OPENSSL
| #define WITH_SSL_DES
| #define WITH_DES
| #define DO_DLOPEN
| #define HAVE_LDAP_H 1
| #define HAVE_LBER_H 1
| #define PLUGINDIR "/usr/lib64/sasl2"
| #define CONFIGDIR "/etc/sasl2"
| #define WITH_RC4
| #define HAVE_GETSUBOPT
| #define HAVE_SNPRINTF
| #define HAVE_VSNPRINTF
| #define HAVE_LIBRESOLV 1
| #define HAVE_GETADDRINFO
| #define HAVE_GETNAMEINFO
| #define RETSIGTYPE void
| #define TIME_WITH_SYS_TIME 1
| #define STDC_HEADERS 1
| #define HAVE_DIRENT_H 1
| #define HAVE_SYS_WAIT_H 1
| /* end confdefs.h. */
| #include <stdio.h>
| #if HAVE_SYS_TYPES_H
| # include <sys/types.h>
| #endif
| #if HAVE_SYS_STAT_H
| # include <sys/stat.h>
| #endif
| #if STDC_HEADERS
| # include <stdlib.h>
| # include <stddef.h>
| #else
| # if HAVE_STDLIB_H
| # include <stdlib.h>
| # endif
| #endif
| #if HAVE_STRING_H
| # if !STDC_HEADERS && HAVE_MEMORY_H
| # include <memory.h>
| # endif
| # include <string.h>
| #endif
| #if HAVE_STRINGS_H
| # include <strings.h>
| #endif
| #if HAVE_INTTYPES_H
| # include <inttypes.h>
| #else
| # if HAVE_STDINT_H
| # include <stdint.h>
| # endif
| #endif
| #if HAVE_UNISTD_H
| # include <unistd.h>
| #endif
| #include <des.h>
configure:16176: result: no
configure:16180: checking des.h presence
configure:16190: x86_64-pc-linux-gnu-gcc -E conftest.c
conftest.c:53:17: des.h: No such file or directory
configure:16196: $? = 1
configure: failed program was:
| /* confdefs.h. */
|
| #define PACKAGE_NAME ""
| #define PACKAGE_TARNAME ""
| #define PACKAGE_VERSION ""
| #define PACKAGE_STRING ""
| #define PACKAGE_BUGREPORT ""
| #define PACKAGE "cyrus-sasl"
| #define VERSION "2.1.21"
| #define HAVE___ATTRIBUTE__ 1
| #define SASL_DB_PATH "/etc/sasl2/sasldb2"
| #define STDC_HEADERS 1
| #define HAVE_SYS_TYPES_H 1
| #define HAVE_SYS_STAT_H 1
| #define HAVE_STDLIB_H 1
| #define HAVE_STRING_H 1
| #define HAVE_MEMORY_H 1
| #define HAVE_STRINGS_H 1
| #define HAVE_INTTYPES_H 1
| #define HAVE_STDINT_H 1
| #define HAVE_UNISTD_H 1
| #define SASL_BERKELEYDB
| #define SASL_DEV_RANDOM "/dev/random"
| #define HAVE_SYSLOG 1
| #define HAVE_SECURITY_PAM_APPL_H 1
| #define HAVE_SASLAUTHD
| #define PATH_SASLAUTHD_RUNDIR "/var/lib/sasl2"
| #define HAVE_PWCHECK
| #define PWCHECKDIR "/var/lib/sasl2"
| #define DO_SASL_CHECKAPOP
| #define SIZEOF_LONG 8
| #define HAVE_OPENSSL
| #define WITH_SSL_DES
| #define WITH_DES
| #define DO_DLOPEN
| #define HAVE_LDAP_H 1
| #define HAVE_LBER_H 1
| #define PLUGINDIR "/usr/lib64/sasl2"
| #define CONFIGDIR "/etc/sasl2"
| #define WITH_RC4
| #define HAVE_GETSUBOPT
| #define HAVE_SNPRINTF
| #define HAVE_VSNPRINTF
| #define HAVE_LIBRESOLV 1
| #define HAVE_GETADDRINFO
| #define HAVE_GETNAMEINFO
| #define RETSIGTYPE void
| #define TIME_WITH_SYS_TIME 1
| #define STDC_HEADERS 1
| #define HAVE_DIRENT_H 1
| #define HAVE_SYS_WAIT_H 1
| /* end confdefs.h. */
| #include <des.h>
configure:16216: result: no
configure:16251: checking for des.h
configure:16258: result: no
configure:16135: checking dlfcn.h usability
configure:16147: x86_64-pc-linux-gnu-gcc -c -Wall -W -march=athlon64 -mtune=k8 -pipe -O2 conftest.c >&5
configure:16153: $? = 0
configure:16157: test -z
|| test ! -s conftest.err
configure:16160: $? = 0
configure:16163: test -s conftest.o
configure:16166: $? = 0
configure:16176: result: yes
configure:16180: checking dlfcn.h presence
configure:16190: x86_64-pc-linux-gnu-gcc -E conftest.c
configure:16196: $? = 0
configure:16216: result: yes
configure:16251: checking for dlfcn.h
configure:16258: result: yes
configure:16135: checking fcntl.h usability
configure:16147: x86_64-pc-linux-gnu-gcc -c -Wall -W -march=athlon64 -mtune=k8 -pipe -O2 conftest.c >&5
configure:16153: $? = 0
confi
Back to top
View user's profile Send private message
Naquada
n00b
n00b


Joined: 12 May 2005
Posts: 40

PostPosted: Sat Jul 23, 2005 5:03 pm    Post subject: Reply with quote

is there any way to make portage agnore the CFLAGE change ?
Back to top
View user's profile Send private message
Earthwings
Bodhisattva
Bodhisattva


Joined: 14 Apr 2003
Posts: 7753
Location: Karlsruhe, Germany

PostPosted: Sat Aug 20, 2005 7:43 pm    Post subject: Reply with quote

Moved from Desktop Environments to Duplicate Threads. Please don't crosspost.
Back to top
View user's profile Send private message
Display posts from previous:   
Reply to topic    Gentoo Forums Forum Index Duplicate Threads All times are GMT
Page 1 of 1

 
Jump to:  
You cannot post new topics in this forum
You cannot reply to topics in this forum
You cannot edit your posts in this forum
You cannot delete your posts in this forum
You cannot vote in polls in this forum