Gentoo Forums
Gentoo Forums
Gentoo Forums
Quick Search: in
error emerging evolution
View unanswered posts
View posts from last 24 hours

 
Reply to topic    Gentoo Forums Forum Index Duplicate Threads
View previous topic :: View next topic  
Author Message
jgaffney
Apprentice
Apprentice


Joined: 22 Dec 2004
Posts: 165

PostPosted: Thu Aug 11, 2005 2:10 pm    Post subject: error emerging evolution Reply with quote

Attempting to emerge evolution and I recieve the following. Any ideas?



Code:

make[3]: *** [create-account] Error 1
make[3]: Leaving directory `/var/tmp/portage/evolution-data-server-1.2.1-r1/work
/evolution-data-server-1.2.1/servers/groupwise'
make[2]: *** [all-recursive] Error 1
make[2]: Leaving directory `/var/tmp/portage/evolution-data-server-1.2.1-r1/work
/evolution-data-server-1.2.1/servers'
make[1]: *** [all-recursive] Error 1
make[1]: Leaving directory `/var/tmp/portage/evolution-data-server-1.2.1-r1/work
/evolution-data-server-1.2.1'
make: *** [all] Error 2

!!! ERROR: gnome-extra/evolution-data-server-1.2.1-r1 failed.
!!! Function src_compile, Line 91, Exitcode 2
!!! compile failed
!!! If you need support, post the topmost build error, NOT this status message.


[code]
# These settings were set by the catalyst build script that automatically built this stage
# Please consult /etc/make.conf.example for a more detailed example
CFLAGS="-O3 -march=pentium-m -fomit-frame-pointer -pipe"
#CFLAG="-01 -march=pentium-m "


CHOST="i686-pc-linux-gnu"
CXXFLAGS="${CFLAGS}"
MAKEOPTS="-j2"
USE="xine -gnome samba acpi arts apm audiofile avi bzlib cdr crypt dba dga dio directfb ftp gd fig gpm gstrea java jpeg aim ldap libwww mime mmx motif mozilla mpeg openal oss pam png shared snmp spell ssl tcpd tiff trut 3dnow gtk2 visualization mysql mad"


ALSA_CARDS="intel8x0"

Edit ---

OK, emerge --sync and then emerge evolution again, now this

[code]
testgtkhtml.o htmlurl.o ./.libs/libgtkhtml-3.6.so /usr/lib/libsoup-2.2.so /usr/lib/libgnutls.so /usr/lib/libgcrypt.so /usr/lib/libgpg-error.so /usr/lib/libxml2.so -lpthread -lz -lm /usr/lib/libglib-2.0.so
i686-pc-linux-gnu-gcc: unrecognized option `-02'
/usr/lib/gcc/i686-pc-linux-gnu/3.4.4/../../../../i686-pc-linux-gnu/bin/ld: warning: libgnutls.so.11, needed by /usr/lib/libsoup-2.2.so, not found (try using -rpath or -rpath-link)
/usr/lib/libsoup-2.2.so: undefined reference to `gnutls_certificate_set_x509_key_file@GNUTLS_REL_1_0_9'
/usr/lib/libsoup-2.2.so: undefined reference to `gnutls_set_default_priority@GNUTLS_REL_1_0_9'
/usr/lib/libsoup-2.2.so: undefined reference to `gnutls_deinit@GNUTLS_REL_1_0_9'
/usr/lib/libsoup-2.2.so: undefined reference to `gnutls_transport_set_ptr@GNUTLS_REL_1_0_9'
/usr/lib/libsoup-2.2.so: undefined reference to `gnutls_global_init@GNUTLS_REL_1_0_9'
/usr/lib/libsoup-2.2.so: undefined reference to `gnutls_dh_params_deinit@GNUTLS_REL_1_0_9'
/usr/lib/libsoup-2.2.so: undefined reference to `gnutls_certificate_verify_peers@GNUTLS_REL_1_0_9'
/usr/lib/libsoup-2.2.so: undefined reference to `gnutls_handshake@GNUTLS_REL_1_0_9'
/usr/lib/libsoup-2.2.so: undefined reference to `gnutls_dh_params_generate2@GNUTLS_REL_1_0_9'
/usr/lib/libsoup-2.2.so: undefined reference to `gnutls_x509_crt_import@GNUTLS_REL_1_0_9'
/usr/lib/libsoup-2.2.so: undefined reference to `gnutls_x509_crt_init@GNUTLS_REL_1_0_9'
/usr/lib/libsoup-2.2.so: undefined reference to `gnutls_certificate_expiration_time_peers@GNUTLS_REL_1_0_9'
/usr/lib/libsoup-2.2.so: undefined reference to `gnutls_credentials_set@GNUTLS_REL_1_0_9'
/usr/lib/libsoup-2.2.so: undefined reference to `gnutls_bye@GNUTLS_REL_1_0_9'
/usr/lib/libsoup-2.2.so: undefined reference to `gnutls_dh_set_prime_bits@GNUTLS_REL_1_0_9'
/usr/lib/libsoup-2.2.so: undefined reference to `gnutls_init@GNUTLS_REL_1_0_9'
/usr/lib/libsoup-2.2.so: undefined reference to `gnutls_dh_params_init@GNUTLS_REL_1_0_9'
/usr/lib/libsoup-2.2.so: undefined reference to `gnutls_certificate_allocate_credentials@GNUTLS_REL_1_0_9'
/usr/lib/libsoup-2.2.so: undefined reference to `gnutls_certificate_set_dh_params@GNUTLS_REL_1_0_9'
/usr/lib/libsoup-2.2.so: undefined reference to `gnutls_record_get_direction@GNUTLS_REL_1_0_9'
/usr/lib/libsoup-2.2.so: undefined reference to `gnutls_x509_crt_check_hostname@GNUTLS_REL_1_0_9'
/usr/lib/libsoup-2.2.so: undefined reference to `gnutls_record_recv@GNUTLS_REL_1_0_9'
/usr/lib/libsoup-2.2.so: undefined reference to `gnutls_certificate_activation_time_peers@GNUTLS_REL_1_0_9'
/usr/lib/libsoup-2.2.so: undefined reference to `gnutls_record_send@GNUTLS_REL_1_0_9'
/usr/lib/libsoup-2.2.so: undefined reference to `gnutls_certificate_type_get@GNUTLS_REL_1_0_9'
/usr/lib/libsoup-2.2.so: undefined reference to `gnutls_certificate_get_peers@GNUTLS_REL_1_0_9'
/usr/lib/libsoup-2.2.so: undefined reference to `gnutls_certificate_free_credentials@GNUTLS_REL_1_0_9'
/usr/lib/libsoup-2.2.so: undefined reference to `gnutls_certificate_set_x509_trust_file@GNUTLS_REL_1_0_9'
collect2: ld returned 1 exit status
make[2]: *** [testgtkhtml] Error 1
make[2]: *** Waiting for unfinished jobs....
i686-pc-linux-gnu-gcc -DICONDIR=\"/usr/share/gtkhtml-3.6/icons\" -DGDK_DISABLE_DEPRECATED=1 -DG_DISABLE_DEPRECATED=1 -DGNOME_DISABLE_DEPRECATED=1 -02 -march=pentium-m -pipe -Wall -Wmissing-prototypes -o .libs/test-stress test-stress.o ./.libs/libgtkhtml-3.6.so
i686-pc-linux-gnu-gcc: unrecognized option `-02'
creating test-stress
make[2]: Leaving directory `/var/tmp/portage/libgtkhtml-3.6.2/work/gtkhtml-3.6.2/src'
make[1]: *** [all-recursive] Error 1
make[1]: Leaving directory `/var/tmp/portage/libgtkhtml-3.6.2/work/gtkhtml-3.6.2'
make: *** [all] Error 2

!!! ERROR: gnome-extra/libgtkhtml-3.6.2 failed.
!!! Function gnome2_src_compile, Line 48, Exitcode 2
!!! compile failure
!!! If you need support, post the topmost build error, NOT this status message.

tbird-lnx ~ #
[/code]
Back to top
View user's profile Send private message
fctk
Veteran
Veteran


Joined: 28 Jan 2004
Posts: 1424
Location: Milan, Italy, EU

PostPosted: Sat Aug 13, 2005 8:43 am    Post subject: Reply with quote

https://bugs.gentoo.org/show_bug.cgi?id=99434
Back to top
View user's profile Send private message
Display posts from previous:   
Reply to topic    Gentoo Forums Forum Index Duplicate Threads All times are GMT
Page 1 of 1

 
Jump to:  
You cannot post new topics in this forum
You cannot reply to topics in this forum
You cannot edit your posts in this forum
You cannot delete your posts in this forum
You cannot vote in polls in this forum