Gentoo Forums
Gentoo Forums
Gentoo Forums
Quick Search: in
Lots of ebuilds failing...
View unanswered posts
View posts from last 24 hours

 
Reply to topic    Gentoo Forums Forum Index Duplicate Threads
View previous topic :: View next topic  
Author Message
kung.foo
Tux's lil' helper
Tux's lil' helper


Joined: 16 Dec 2003
Posts: 99

PostPosted: Sun Aug 14, 2005 5:13 pm    Post subject: Lots of ebuilds failing... Reply with quote

I tried to emerge several packages today, and most of them failed during compile time. Wha't going on here?

kde 3.4.2
Code:

grep: /usr/lib/gcc-lib/i686-pc-linux-gnu/3.3.4/libstdc++.la: No such file or directory
/bin/sed: can't read /usr/lib/gcc-lib/i686-pc-linux-gnu/3.3.4/libstdc++.la: No such file or directory
libtool: link: `/usr/lib/gcc-lib/i686-pc-linux-gnu/3.3.4/libstdc++.la' is not a valid libtool archive
make[4]: *** [kspell_aspell.la] Error 1
make[4]: Leaving directory `/var/tmp/portage/kdelibs-3.4.2/work/kdelibs-3.4.2/kspell2/plugins/aspell'
make[3]: *** [all-recursive] Error 1
make[3]: Leaving directory `/var/tmp/portage/kdelibs-3.4.2/work/kdelibs-3.4.2/kspell2/plugins'
make[2]: *** [all-recursive] Error 1
make[2]: Leaving directory `/var/tmp/portage/kdelibs-3.4.2/work/kdelibs-3.4.2/kspell2'
make[1]: *** [all-recursive] Error 1
make[1]: Leaving directory `/var/tmp/portage/kdelibs-3.4.2/work/kdelibs-3.4.2'
make: *** [all] Error 2

!!! ERROR: kde-base/kdelibs-3.4.2 failed.
!!! Function kde_src_compile, Line 169, Exitcode 2
!!! died running emake, kde_src_compile:make
!!! If you need support, post the topmost build error, NOT this status message.


amarok beta3 (yes i know it's beta but works fine with other people)
Code:

arok/src/engine/libengine.la ../../../../amarok/src/plugin/libplugin.la -lkdecore
grep: /usr/lib/gcc-lib/i686-pc-linux-gnu/3.3.4/libstdc++.la: No such file or directory
/bin/sed: can't read /usr/lib/gcc-lib/i686-pc-linux-gnu/3.3.4/libstdc++.la: No such file or directory
libtool: link: `/usr/lib/gcc-lib/i686-pc-linux-gnu/3.3.4/libstdc++.la' is not a valid libtool archive
make[5]: *** [libamarok_void-engine_plugin.la] Error 1
make[5]: Leaving directory `/var/tmp/portage/amarok-1.3_beta3/work/amarok-1.3-beta3/amarok/src/engine/void'
make[4]: *** [all-recursive] Error 1
make[4]: Leaving directory `/var/tmp/portage/amarok-1.3_beta3/work/amarok-1.3-beta3/amarok/src/engine'
make[3]: *** [all-recursive] Error 1
make[3]: Leaving directory `/var/tmp/portage/amarok-1.3_beta3/work/amarok-1.3-beta3/amarok/src'
make[2]: *** [all-recursive] Error 1
make[2]: Leaving directory `/var/tmp/portage/amarok-1.3_beta3/work/amarok-1.3-beta3/amarok'
make[1]: *** [all-recursive] Error 1
make[1]: Leaving directory `/var/tmp/portage/amarok-1.3_beta3/work/amarok-1.3-beta3'
make: *** [all] Error 2

!!! ERROR: media-sound/amarok-1.3_beta3 failed.
!!! Function kde_src_compile, Line 169, Exitcode 2
!!! died running emake, kde_src_compile:make
!!! If you need support, post the topmost build error, NOT this status message.


I the thought this might have some relation to libstdc++
But i emerged libstc++-v3 (whoch works fine) and the error still occurs in both packages...
Any ideas?
Back to top
View user's profile Send private message
plate
Bodhisattva
Bodhisattva


Joined: 25 Jul 2002
Posts: 1663
Location: Berlin

PostPosted: Sun Aug 14, 2005 5:17 pm    Post subject: Reply with quote

Please see Emerge fails after upgrading gcc. libstdc++.la missing.
Back to top
View user's profile Send private message
Display posts from previous:   
Reply to topic    Gentoo Forums Forum Index Duplicate Threads All times are GMT
Page 1 of 1

 
Jump to:  
You cannot post new topics in this forum
You cannot reply to topics in this forum
You cannot edit your posts in this forum
You cannot delete your posts in this forum
You cannot vote in polls in this forum