Gentoo Forums
Gentoo Forums
Gentoo Forums
Quick Search: in
k3b compile error, is this a bug
View unanswered posts
View posts from last 24 hours

 
Reply to topic    Gentoo Forums Forum Index Duplicate Threads
View previous topic :: View next topic  
Author Message
StaraDama
Apprentice
Apprentice


Joined: 01 Sep 2004
Posts: 253

PostPosted: Tue Nov 15, 2005 8:37 am    Post subject: k3b compile error, is this a bug Reply with quote

Code:

XPath error : Undefined variable
$chunk.separate.lots != '0'
                     ^
compilation error: file /usr/kde/3.4/share/apps/ksgmltools2/docbook/xsl/html/chunk-code.xsl line 609 element when
xsl:when : could not compile test expression '$chunk.separate.lots != '0''
XPath error : Undefined variable
compilation error: file /usr/kde/3.4/share/apps/ksgmltools2/docbook/xsl/html/chunk-code.xsl line 744 element copy-of
xsl:copy-of : could not compile select expression '$lots'
XPath error : Undefined variable
$type='example'
     ^
compilation error: file /usr/kde/3.4/share/apps/ksgmltools2/docbook/xsl/html/chunk-code.xsl line 812 element when
xsl:when : could not compile test expression '$type='example''
XPath error : Undefined variable
compilation error: file /usr/kde/3.4/share/apps/ksgmltools2/docbook/xsl/html/chunk-code.xsl line 854 element with-param
xsl:param : could not compile select expression '$chunk'
XPath error : Undefined variable
contains($stringIn,$charsIn)
                  ^
compilation error: file /usr/kde/3.4/share/apps/ksgmltools2/customization/kde-navig.xsl line 22 element when
xsl:when : could not compile test expression 'contains($stringIn,$charsIn)'
XPath error : Undefined variable
substring-after($stringIn,$charsIn)
                         ^
compilation error: file /usr/kde/3.4/share/apps/ksgmltools2/customization/kde-navig.xsl line 25 element with-param
xsl:param : could not compile select expression 'substring-after($stringIn,$charsIn)'
XPath error : Undefined variable
compilation error: file /usr/kde/3.4/share/apps/ksgmltools2/customization/kde-navig.xsl line 27 element with-param
xsl:param : could not compile select expression '$charsOut'
XPath error : Undefined variable
compilation error: file /usr/kde/3.4/share/apps/ksgmltools2/customization/kde-navig.xsl line 31 element value-of
xsl:value-of : could not compile select expression '$stringIn'
XPath error : Undefined variable
compilation error: file /usr/kde/3.4/share/apps/ksgmltools2/customization/kde-navig.xsl line 43 element div
Attribute template style: failed to compile $kde.common
XPath error : Undefined variable
compilation error: file /usr/kde/3.4/share/apps/ksgmltools2/customization/kde-navig.xsl line 47 element img
Attribute template src: failed to compile $kde.common
XPath error : Undefined variable
compilation error: file /usr/kde/3.4/share/apps/ksgmltools2/customization/kde-navig.xsl line 50 element img
Attribute template src: failed to compile $kde.common
XPath error : Undefined variable
compilation error: file /usr/kde/3.4/share/apps/ksgmltools2/customization/kde-navig.xsl line 198 element div
Attribute template style: failed to compile $kde.common
unable to parse ./index.docbook
make[2]: *** [index.cache.bz2] Error 1
make[2]: Leaving directory `/var/tmp/portage/k3b-0.12.7/work/k3b-0.12.7/doc'
make[1]: *** [all-recursive] Error 1
make[1]: Leaving directory `/var/tmp/portage/k3b-0.12.7/work/k3b-0.12.7'
make: *** [all] Error 2

!!! ERROR: app-cdr/k3b-0.12.7 failed.
!!! Function kde_src_compile, Line 168, Exitcode 2
!!! died running emake, kde_src_compile:make
!!! If you need support, post the topmost build error, NOT this status message.




Is this a bug or compile error_
Back to top
View user's profile Send private message
kallamej
Administrator
Administrator


Joined: 27 Jun 2003
Posts: 4920
Location: Gothenburg, Sweden

PostPosted: Tue Nov 15, 2005 11:22 am    Post subject: Reply with quote

Please see [Solved] "XPath error : Undefined variable" ;kaffeine etc.

Moved from Portage & Programming to Duplicate Threads.
_________________
Please read our FAQ Forum, it answers many of your questions.
irc: #gentoo-forums on irc.freenode.net
Back to top
View user's profile Send private message
Display posts from previous:   
Reply to topic    Gentoo Forums Forum Index Duplicate Threads All times are GMT
Page 1 of 1

 
Jump to:  
You cannot post new topics in this forum
You cannot reply to topics in this forum
You cannot edit your posts in this forum
You cannot delete your posts in this forum
You cannot vote in polls in this forum