Gentoo Forums
Gentoo Forums
Gentoo Forums
Quick Search: in
kiso-0.8.2c emerge fails
View unanswered posts
View posts from last 24 hours

 
Reply to topic    Gentoo Forums Forum Index Duplicate Threads
View previous topic :: View next topic  
Author Message
LeSid
n00b
n00b


Joined: 09 Feb 2005
Posts: 15
Location: Switzerland

PostPosted: Thu Nov 17, 2005 10:32 pm    Post subject: kiso-0.8.2c emerge fails Reply with quote

Hi!

Doing a world upgrade fails me here: app-cdr/kiso-0.8.2c [0.8.1] with the following message. Can anyone help me?
Thanks a lot!
LeSid

[code]
Good - your configure finished. Start make now

/bin/sh ./config.status
fast creating Makefile
fast creating doc/Makefile
fast creating doc/de/Makefile
fast creating doc/en/Makefile
fast creating po/Makefile
fast creating src/Makefile
config.pl: fast created 6 file(s).
config.status: creating config.h
config.status: config.h is unchanged
config.status: executing depfiles commands
Makefile:846: warning: overriding commands for target `clean-bcheck'
Makefile:809: warning: ignoring old commands for target `clean-bcheck'
Makefile:851: warning: overriding commands for target `bcheck-am'
Makefile:814: warning: ignoring old commands for target `bcheck-am'
cd . && /bin/sh /var/tmp/portage/kiso-0.8.2c/work/kiso-0.8.2/admin/missing --run autoheader
rm -f stamp-h1
touch config.h.in
cd . && /bin/sh ./config.status config.h
config.status: creating config.h
config.status: config.h is unchanged
make all-recursive
make[1]: Entering directory `/var/tmp/portage/kiso-0.8.2c/work/kiso-0.8.2'
Makefile:846: warning: overriding commands for target `clean-bcheck'
Makefile:809: warning: ignoring old commands for target `clean-bcheck'
Makefile:851: warning: overriding commands for target `bcheck-am'
Makefile:814: warning: ignoring old commands for target `bcheck-am'
Making all in doc
make[2]: Entering directory `/var/tmp/portage/kiso-0.8.2c/work/kiso-0.8.2/doc'
Making all in .
make[3]: Entering directory `/var/tmp/portage/kiso-0.8.2c/work/kiso-0.8.2/doc'
make[3]: Nothing to be done for `all-am'.
make[3]: Leaving directory `/var/tmp/portage/kiso-0.8.2c/work/kiso-0.8.2/doc'
Making all in de
make[3]: Entering directory `/var/tmp/portage/kiso-0.8.2c/work/kiso-0.8.2/doc/de'
/usr/kde/3.4/bin/meinproc --check --cache index.cache.bz2 ./index.docbook
XPath error : Undefined variable
compilation error: file /usr/kde/3.4/share/apps/ksgmltools2/docbook/xsl/html/autotoc.xsl line 544 element div
Attribute template class: failed to compile $titles
XPath error : Undefined variable
compilation error: file /usr/kde/3.4/share/apps/ksgmltools2/docbook/xsl/html/lists.xsl line 735 element ol
Attribute template type: failed to compile $numeration
XPath error : Undefined variable
compilation error: file /usr/kde/3.4/share/apps/ksgmltools2/docbook/xsl/html/callout.xsl line 158 element img
Attribute template src: failed to compile $callout.graphics.path
XPath error : Undefined variable
compilation error: file /usr/kde/3.4/share/apps/ksgmltools2/docbook/xsl/html/callout.xsl line 158 element img
Attribute template alt: failed to compile $conum
XPath error : Undefined variable
compilation error: file /usr/kde/3.4/share/apps/ksgmltools2/docbook/xsl/html/formal.xsl line 19 element div
Attribute template class: failed to compile $class
XPath error : Undefined variable
compilation error: file /usr/kde/3.4/share/apps/ksgmltools2/docbook/xsl/html/formal.xsl line 71 element div
Attribute template class: failed to compile $class
XPath error : Undefined variable
compilation error: file /usr/kde/3.4/share/apps/ksgmltools2/docbook/xsl/html/inline.xsl line 856 element a
Attribute template href: failed to compile $chunkbase
XPath error : Undefined variable
compilation error: file /usr/kde/3.4/share/apps/ksgmltools2/docbook/xsl/html/inline.xsl line 934 element code
Attribute template class: failed to compile $class
XPath error : Undefined variable
compilation error: file /usr/kde/3.4/share/apps/ksgmltools2/docbook/xsl/html/html.xsl line 24 element a
Attribute template name: failed to compile $id
XPath error : Undefined variable
compilation error: file /usr/kde/3.4/share/apps/ksgmltools2/docbook/xsl/html/index.xsl line 115 element a
Attribute template name: failed to compile $id
XPath error : Undefined variable
concat('ln-',$id,$html.ext)
^
compilation error: file /usr/kde/3.4/share/apps/ksgmltools2/docbook/xsl/html/titlepage.xsl line 475 element a
Attribute template href: failed to compile concat('ln-',$id,$html.ext)
XPath error : Undefined variable
compilation error: file /usr/kde/3.4/share/apps/ksgmltools2/docbook/xsl/html/titlepage.xsl line 502 element a
Attribute template name: failed to compile $id
XPath error : Undefined variable
compilation error: file /usr/kde/3.4/share/apps/ksgmltools2/docbook/xsl/html/titlepage.xsl line 780 element a
Attribute template name: failed to compile $id
XPath error : Undefined variable
compilation error: file /usr/kde/3.4/share/apps/ksgmltools2/docbook/xsl/html/docbook.xsl line 137 element base
Attribute template href: failed to compile $html.base
XPath error : Undefined variable
substring-before($stylesheets, ' ')
^
compilation error: file /usr/kde/3.4/share/apps/ksgmltools2/docbook/xsl/html/docbook.xsl line 197 element link
Attribute template href: failed to compile substring-before($stylesheets, ' ')
XPath error : Undefined variable
compilation error: file /usr/kde/3.4/share/apps/ksgmltools2/customization/kde-navig.xsl line 43 element div
Attribute template style: failed to compile $kde.common
XPath error : Undefined variable
compilation error: file /usr/kde/3.4/share/apps/ksgmltools2/customization/kde-navig.xsl line 47 element img
Attribute template src: failed to compile $kde.common
XPath error : Undefined variable
compilation error: file /usr/kde/3.4/share/apps/ksgmltools2/customization/kde-navig.xsl line 50 element img
Attribute template src: failed to compile $kde.common
XPath error : Undefined variable
compilation error: file /usr/kde/3.4/share/apps/ksgmltools2/customization/kde-navig.xsl line 198 element div
Attribute template style: failed to compile $kde.common
XPath error : Undefined variable
compilation error: file /usr/kde/3.4/share/apps/ksgmltools2/customization/kde-navig.xsl line 200 element img
Attribute template src: failed to compile $kde.common
XPath error : Undefined variable
compilation error: file /usr/kde/3.4/share/apps/ksgmltools2/customization/kde-navig.xsl line 203 element img
Attribute template src: failed to compile $kde.common
unable to parse ./index.docbook
make[3]: *** [index.cache.bz2] Error 1
make[3]: Leaving directory `/var/tmp/portage/kiso-0.8.2c/work/kiso-0.8.2/doc/de'
make[2]: *** [all-recursive] Error 1
make[2]: Leaving directory `/var/tmp/portage/kiso-0.8.2c/work/kiso-0.8.2/doc'
make[1]: *** [all-recursive] Error 1
make[1]: Leaving directory `/var/tmp/portage/kiso-0.8.2c/work/kiso-0.8.2'
make: *** [all] Error 2

!!! ERROR: app-cdr/kiso-0.8.2c failed.
!!! Function kde_src_compile, Line 173, Exitcode 2
!!! died running emake, kde_src_compile:make
!!! If you need support, post the topmost build error, NOT this status message.
[/code]
Back to top
View user's profile Send private message
kallamej
Administrator
Administrator


Joined: 27 Jun 2003
Posts: 4920
Location: Gothenburg, Sweden

PostPosted: Sun Dec 25, 2005 8:04 pm    Post subject: Reply with quote

Moved from Portage & Programming to Duplicate Threads in favour of [Solved] "XPath error : Undefined variable" ;kaffeine etc.
_________________
Please read our FAQ Forum, it answers many of your questions.
irc: #gentoo-forums on irc.freenode.net
Back to top
View user's profile Send private message
Display posts from previous:   
Reply to topic    Gentoo Forums Forum Index Duplicate Threads All times are GMT
Page 1 of 1

 
Jump to:  
You cannot post new topics in this forum
You cannot reply to topics in this forum
You cannot edit your posts in this forum
You cannot delete your posts in this forum
You cannot vote in polls in this forum