Gentoo Forums
Gentoo Forums
Gentoo Forums
Quick Search: in
update and remerge of k3b fails cause of XPath errors
View unanswered posts
View posts from last 24 hours

 
Reply to topic    Gentoo Forums Forum Index Duplicate Threads
View previous topic :: View next topic  
Author Message
format_c
n00b
n00b


Joined: 16 Jul 2004
Posts: 45
Location: Germany/Hessen/Bad Koenig

PostPosted: Mon Nov 28, 2005 9:21 pm    Post subject: update and remerge of k3b fails cause of XPath errors Reply with quote

Hi all,
I got some trouble with updating k3b.
While compiling it causes masses of xml XPath errors. I don't know understand why. Maybe you??
Here some lines from my last output.
Code:

XPath error : Undefined variable
compilation error: file /usr/kde/3.4/share/apps/ksgmltools2/docbook/xsl/html/chunk-common.xsl line 850 element with-param
xsl:param : could not compile select expression '$next'
XPath error : Undefined variable
compilation error: file /usr/kde/3.4/share/apps/ksgmltools2/docbook/xsl/html/chunk-common.xsl line 866 element apply-templates
xsl:apply-templates : could not compile select expression '$prev'
XPath error : Undefined variable
compilation error: file /usr/kde/3.4/share/apps/ksgmltools2/docbook/xsl/html/chunk-common.xsl line 876 element with-param
xsl:param : could not compile select expression '$home'
XPath error : Undefined variable
compilation error: file /usr/kde/3.4/share/apps/ksgmltools2/docbook/xsl/html/chunk-common.xsl line 907 element apply-templates
xsl:apply-templates : could not compile select expression '$next'
XPath error : Undefined variable
key('id',$rootid)
                ^
compilation error: file /usr/kde/3.4/share/apps/ksgmltools2/docbook/xsl/html/chunk-code.xsl line 512 element apply-templates
xsl:apply-templates : could not compile select expression 'key('id',$rootid)'
XPath error : Undefined variable
key('id',$rootid)
                ^
compilation error: file /usr/kde/3.4/share/apps/ksgmltools2/docbook/xsl/html/chunk-code.xsl line 515 element apply-templates
xsl:apply-templates : could not compile select expression 'key('id',$rootid)'
XPath error : Undefined variable
$footnotes[1]
          ^
compilation error: file /usr/kde/3.4/share/apps/ksgmltools2/docbook/xsl/html/chunk-code.xsl line 954 element apply-templates
xsl:apply-templates : could not compile select expression '$footnotes[1]'
XPath error : Undefined variable
compilation error: file /usr/kde/3.4/share/apps/ksgmltools2/customization/kde-navig.xsl line 74 element with-param
xsl:param : could not compile select expression '$prev'
XPath error : Undefined variable
compilation error: file /usr/kde/3.4/share/apps/ksgmltools2/customization/kde-navig.xsl line 87 element with-param
xsl:param : could not compile select expression '$next'
XPath error : Undefined variable
compilation error: file /usr/kde/3.4/share/apps/ksgmltools2/customization/kde-navig.xsl line 97 element apply-templates
xsl:apply-templates : could not compile select expression '$up'
XPath error : Undefined variable
compilation error: file /usr/kde/3.4/share/apps/ksgmltools2/customization/kde-navig.xsl line 125 element with-param
xsl:param : could not compile select expression '$prev'
XPath error : Undefined variable
compilation error: file /usr/kde/3.4/share/apps/ksgmltools2/customization/kde-navig.xsl line 137 element with-param
xsl:param : could not compile select expression '$next'
XPath error : Undefined variable
compilation error: file /usr/kde/3.4/share/apps/ksgmltools2/customization/kde-navig.xsl line 150 element with-param
xsl:param : could not compile select expression '$home'
XPath error : Undefined variable
compilation error: file /usr/kde/3.4/share/apps/ksgmltools2/customization/kde-navig.xsl line 165 element apply-templates
xsl:apply-templates : could not compile select expression '$prev'
XPath error : Undefined variable
compilation error: file /usr/kde/3.4/share/apps/ksgmltools2/customization/kde-navig.xsl line 170 element apply-templates
xsl:apply-templates : could not compile select expression '$next'
XPath error : Undefined variable
compilation error: file /usr/kde/3.4/share/apps/ksgmltools2/customization/kde-navig.xsl line 178 element with-param
xsl:param : could not compile select expression '$up'
XPath error : Undefined variable
compilation error: file /usr/kde/3.4/share/apps/ksgmltools2/customization/kde-navig.xsl line 43 element div
Attribute template style: failed to compile $kde.common
XPath error : Undefined variable
compilation error: file /usr/kde/3.4/share/apps/ksgmltools2/customization/kde-navig.xsl line 47 element img
Attribute template src: failed to compile $kde.common
XPath error : Undefined variable
compilation error: file /usr/kde/3.4/share/apps/ksgmltools2/customization/kde-navig.xsl line 50 element img
Attribute template src: failed to compile $kde.common
XPath error : Undefined variable
compilation error: file /usr/kde/3.4/share/apps/ksgmltools2/customization/kde-navig.xsl line 198 element div
Attribute template style: failed to compile $kde.common
unable to parse ./index.docbook
make[2]: *** [index.cache.bz2] Error 1
make[2]: Leaving directory `/var/tmp/portage/k3b-0.12.4a/work/k3b-0.12.4a/doc'
make[1]: *** [all-recursive] Error 1
make[1]: Leaving directory `/var/tmp/portage/k3b-0.12.4a/work/k3b-0.12.4a'
make: *** [all] Error 2



Hope you can help me and sorry for spamming with code.

Greets Alex
_________________
Board - PerlCommunity.de
Links - PerlCommunity.de
Wiki - PerlCommunity.de
Back to top
View user's profile Send private message
kallamej
Administrator
Administrator


Joined: 27 Jun 2003
Posts: 4920
Location: Gothenburg, Sweden

PostPosted: Sun Dec 25, 2005 8:09 pm    Post subject: Reply with quote

Moved from Portage & Programming to Duplicate Threads in favour of [Solved] "XPath error : Undefined variable" ;kaffeine etc.
_________________
Please read our FAQ Forum, it answers many of your questions.
irc: #gentoo-forums on irc.freenode.net
Back to top
View user's profile Send private message
Display posts from previous:   
Reply to topic    Gentoo Forums Forum Index Duplicate Threads All times are GMT
Page 1 of 1

 
Jump to:  
You cannot post new topics in this forum
You cannot reply to topics in this forum
You cannot edit your posts in this forum
You cannot delete your posts in this forum
You cannot vote in polls in this forum