Gentoo Forums
Gentoo Forums
Gentoo Forums
Quick Search: in
kopete 3.5 : compilations error
View unanswered posts
View posts from last 24 hours

 
Reply to topic    Gentoo Forums Forum Index Duplicate Threads
View previous topic :: View next topic  
Author Message
lourog
n00b
n00b


Joined: 10 Apr 2004
Posts: 10
Location: Belgium

PostPosted: Sat Dec 03, 2005 1:31 pm    Post subject: kopete 3.5 : compilations error Reply with quote

Hello,

I installed with success the new kde-3.5 (emerge kde-meta), after the installation I wanted to test everything.

It was ok for everything except for kopete.

In the compilation process of kde I saw all time a warning with "libxml2 kopete won't compile" but kopete had been compiled without problem.

After the installation I installed the internationalisation package (i18n), and the new version of libxml2, I tried to do an emerge kopete and now the compilation bugs ! I saw that the problem comes with the documentation then I tried to do a USE="-doc" emerge kopete but the same problem occurs.

Please help me and sorry for my bad english.

Code:

Making all in kopete
make[3]: Entering directory `/var/tmp/portage/kopete-3.5.0/work/kopete-3.5.0/doc/kopete'
/usr/kde/3.5/bin/meinproc --check --cache index.cache.bz2 ./index.docbook
XPath error : Undefined variable
compilation error: file /usr/kde/3.5/share/apps/ksgmltools2/docbook/xsl/html/autotoc.xsl line 544 element div
Attribute template class: failed to compile $titles
XPath error : Undefined variable
compilation error: file /usr/kde/3.5/share/apps/ksgmltools2/docbook/xsl/html/lists.xsl line 735 element ol
Attribute template type: failed to compile $numeration
XPath error : Undefined variable
compilation error: file /usr/kde/3.5/share/apps/ksgmltools2/docbook/xsl/html/callout.xsl line 158 element img
Attribute template src: failed to compile $callout.graphics.path
XPath error : Undefined variable
compilation error: file /usr/kde/3.5/share/apps/ksgmltools2/docbook/xsl/html/callout.xsl line 158 element img
Attribute template alt: failed to compile $conum
XPath error : Undefined variable
compilation error: file /usr/kde/3.5/share/apps/ksgmltools2/docbook/xsl/html/formal.xsl line 19 element div
Attribute template class: failed to compile $class
XPath error : Undefined variable
compilation error: file /usr/kde/3.5/share/apps/ksgmltools2/docbook/xsl/html/formal.xsl line 71 element div
Attribute template class: failed to compile $class
XPath error : Undefined variable
compilation error: file /usr/kde/3.5/share/apps/ksgmltools2/docbook/xsl/html/inline.xsl line 856 element a
Attribute template href: failed to compile $chunkbase
XPath error : Undefined variable
compilation error: file /usr/kde/3.5/share/apps/ksgmltools2/docbook/xsl/html/inline.xsl line 934 element code
Attribute template class: failed to compile $class
XPath error : Undefined variable
compilation error: file /usr/kde/3.5/share/apps/ksgmltools2/docbook/xsl/html/html.xsl line 24 element a
Attribute template name: failed to compile $id
XPath error : Undefined variable
compilation error: file /usr/kde/3.5/share/apps/ksgmltools2/docbook/xsl/html/index.xsl line 115 element a
Attribute template name: failed to compile $id
XPath error : Undefined variable
concat('ln-',$id,$html.ext)
                ^
compilation error: file /usr/kde/3.5/share/apps/ksgmltools2/docbook/xsl/html/titlepage.xsl line 475 element a
Attribute template href: failed to compile concat('ln-',$id,$html.ext)
XPath error : Undefined variable
compilation error: file /usr/kde/3.5/share/apps/ksgmltools2/docbook/xsl/html/titlepage.xsl line 502 element a
Attribute template name: failed to compile $id
XPath error : Undefined variable
compilation error: file /usr/kde/3.5/share/apps/ksgmltools2/docbook/xsl/html/titlepage.xsl line 780 element a
Attribute template name: failed to compile $id
XPath error : Undefined variable
compilation error: file /usr/kde/3.5/share/apps/ksgmltools2/docbook/xsl/html/docbook.xsl line 137 element base
Attribute template href: failed to compile $html.base
XPath error : Undefined variable
substring-before($stylesheets, ' ')
                             ^
compilation error: file /usr/kde/3.5/share/apps/ksgmltools2/docbook/xsl/html/docbook.xsl line 197 element link
Attribute template href: failed to compile substring-before($stylesheets, ' ')
XPath error : Undefined variable
compilation error: file /usr/kde/3.5/share/apps/ksgmltools2/customization/kde-navig.xsl line 43 element div
Attribute template style: failed to compile $kde.common
XPath error : Undefined variable
compilation error: file /usr/kde/3.5/share/apps/ksgmltools2/customization/kde-navig.xsl line 47 element img
Attribute template src: failed to compile $kde.common
XPath error : Undefined variable
compilation error: file /usr/kde/3.5/share/apps/ksgmltools2/customization/kde-navig.xsl line 195 element div
Attribute template style: failed to compile $kde.common
XPath error : Undefined variable
compilation error: file /usr/kde/3.5/share/apps/ksgmltools2/customization/kde-navig.xsl line 198 element img
Attribute template src: failed to compile $kde.common
XPath error : Undefined variable
compilation error: file /usr/kde/3.5/share/apps/ksgmltools2/customization/kde-navig.xsl line 201 element img
Attribute template src: failed to compile $kde.common
unable to parse ./index.docbook
make[3]: *** [index.cache.bz2] Error 1
make[3]: Leaving directory `/var/tmp/portage/kopete-3.5.0/work/kopete-3.5.0/doc/kopete'
make[2]: *** [all-recursive] Error 1
make[2]: Leaving directory `/var/tmp/portage/kopete-3.5.0/work/kopete-3.5.0/doc'
make[1]: *** [all-recursive] Error 1
make[1]: Leaving directory `/var/tmp/portage/kopete-3.5.0/work/kopete-3.5.0'
make: *** [all] Error 2


Lourog
Back to top
View user's profile Send private message
kallamej
Administrator
Administrator


Joined: 27 Jun 2003
Posts: 4920
Location: Gothenburg, Sweden

PostPosted: Sun Dec 25, 2005 8:10 pm    Post subject: Reply with quote

Moved from Desktop Environments to Duplicate Threads in favour of [Solved] "XPath error : Undefined variable" ;kaffeine etc.
_________________
Please read our FAQ Forum, it answers many of your questions.
irc: #gentoo-forums on irc.freenode.net
Back to top
View user's profile Send private message
Display posts from previous:   
Reply to topic    Gentoo Forums Forum Index Duplicate Threads All times are GMT
Page 1 of 1

 
Jump to:  
You cannot post new topics in this forum
You cannot reply to topics in this forum
You cannot edit your posts in this forum
You cannot delete your posts in this forum
You cannot vote in polls in this forum