Gentoo Forums
Gentoo Forums
Gentoo Forums
Quick Search: in
[SOLVED]: Installing KDE
View unanswered posts
View posts from last 24 hours

 
Reply to topic    Gentoo Forums Forum Index Duplicate Threads
View previous topic :: View next topic  
Author Message
samek
n00b
n00b


Joined: 26 Aug 2004
Posts: 38

PostPosted: Mon Dec 19, 2005 8:50 pm    Post subject: [SOLVED]: Installing KDE Reply with quote

I decided to switch to KDE, but i have problem installing it.. i do "emerge -av kde" and i get this compile error at kdebase-3.4.3-r1 package:

Quote:

....
compilation error: file /usr/kde/3.4/share/apps/ksgmltools2/customization/kde-navig.xsl line 115 element if
xsl:if : could not compile test expression '$suppress.navigation = '0''
XPath error : Undefined variable
count($prev)>0
^
compilation error: file /usr/kde/3.4/share/apps/ksgmltools2/customization/kde-navig.xsl line 121 element if
xsl:if : could not compile test expression 'count($prev)>0'
XPath error : Undefined variable
count($next)>0
^
compilation error: file /usr/kde/3.4/share/apps/ksgmltools2/customization/kde-navig.xsl line 133 element if
xsl:if : could not compile test expression 'count($next)>0'
XPath error : Undefined variable
$home != .
^
compilation error: file /usr/kde/3.4/share/apps/ksgmltools2/customization/kde-navig.xsl line 146 element when
xsl:when : could not compile test expression '$home != .'
XPath error : Undefined variable
compilation error: file /usr/kde/3.4/share/apps/ksgmltools2/customization/kde-navig.xsl line 165 element apply-templates
xsl:apply-templates : could not compile select expression '$prev'
XPath error : Undefined variable
compilation error: file /usr/kde/3.4/share/apps/ksgmltools2/customization/kde-navig.xsl line 170 element apply-templates
xsl:apply-templates : could not compile select expression '$next'
XPath error : Undefined variable
count($up)>0
^
compilation error: file /usr/kde/3.4/share/apps/ksgmltools2/customization/kde-navig.xsl line 174 element when
xsl:when : could not compile test expression 'count($up)>0'
XPath error : Undefined variable
compilation error: file /usr/kde/3.4/share/apps/ksgmltools2/customization/kde-navig.xsl line 200 element img
Attribute template src: failed to compile $kde.common
XPath error : Undefined variable
compilation error: file /usr/kde/3.4/share/apps/ksgmltools2/customization/kde-navig.xsl line 203 element img
Attribute template src: failed to compile $kde.common
unable to parse ./index.docbook
make[3]: *** [index.cache.bz2] Error 1
make[3]: Leaving directory `/var/tmp/portage/kdebase-3.4.3-r1/work/kdebase-3.4.3/doc/faq'
make[2]: *** [all-recursive] Error 1
make[2]: Leaving directory `/var/tmp/portage/kdebase-3.4.3-r1/work/kdebase-3.4.3/doc'
make[1]: *** [all-recursive] Error 1
make[1]: Leaving directory `/var/tmp/portage/kdebase-3.4.3-r1/work/kdebase-3.4.3'
make: *** [all] Error 2

!!! ERROR: kde-base/kdebase-3.4.3-r1 failed.
!!! Function kde_src_compile, Line 173, Exitcode 2
!!! died running emake, kde_src_compile:make
!!! If you need support, post the topmost build error, NOT this status message.


I have tried to remove all kde packages and tried to compile KDE onece again but no success..
Does anybody have any suggestion what do to?

i thank you in anticipation..
_________________
Best regards,
Samo


Last edited by samek on Tue Dec 20, 2005 7:07 pm; edited 1 time in total
Back to top
View user's profile Send private message
kadu
Apprentice
Apprentice


Joined: 09 Oct 2005
Posts: 267

PostPosted: Mon Dec 19, 2005 9:02 pm    Post subject: Reply with quote

try to install kde-3.5
_________________
:*
Back to top
View user's profile Send private message
samek
n00b
n00b


Joined: 26 Aug 2004
Posts: 38

PostPosted: Mon Dec 19, 2005 11:10 pm    Post subject: Reply with quote

i have already tried but no success, same error..
_________________
Best regards,
Samo
Back to top
View user's profile Send private message
samek
n00b
n00b


Joined: 26 Aug 2004
Posts: 38

PostPosted: Mon Dec 19, 2005 11:52 pm    Post subject: Reply with quote

ok i found a solution by re-emerging (reinstalling) libxslt..
_________________
Best regards,
Samo
Back to top
View user's profile Send private message
kallamej
Administrator
Administrator


Joined: 27 Jun 2003
Posts: 4920
Location: Gothenburg, Sweden

PostPosted: Sun Dec 25, 2005 8:17 pm    Post subject: Reply with quote

Moved from Desktop Environments to Duplicate Threads in favour of [Solved] "XPath error : Undefined variable" ;kaffeine etc.
_________________
Please read our FAQ Forum, it answers many of your questions.
irc: #gentoo-forums on irc.freenode.net
Back to top
View user's profile Send private message
Display posts from previous:   
Reply to topic    Gentoo Forums Forum Index Duplicate Threads All times are GMT
Page 1 of 1

 
Jump to:  
You cannot post new topics in this forum
You cannot reply to topics in this forum
You cannot edit your posts in this forum
You cannot delete your posts in this forum
You cannot vote in polls in this forum