Gentoo Forums
Gentoo Forums
Gentoo Forums
Quick Search: in
Many packages fail to emerge/xsltproc error
View unanswered posts
View posts from last 24 hours

 
Reply to topic    Gentoo Forums Forum Index Duplicate Threads
View previous topic :: View next topic  
Author Message
Haifen
n00b
n00b


Joined: 14 Aug 2005
Posts: 37

PostPosted: Mon Jan 23, 2006 1:13 pm    Post subject: Many packages fail to emerge/xsltproc error Reply with quote

Hi-
I've been trying to upgrade my system via 'emerge -u'...I found that gconf (2.12.1) wouldn't install. There are several xsl compilation errors. I couldn't grab the entire list of errors as my gnome-terminal buffer filled up, but here's what I was able to grab:
XPath error : Undefined variable
$action='seq'
^
compilation error: file file:///usr/share/sgml/docbook/xsl-stylesheets-1.68.1/html/inline.xsl line 1014 element when
xsl:when : could not compile test expression '$action='seq''
XPath error : Undefined variable
$action='simul'
^
compilation error: file file:///usr/share/sgml/docbook/xsl-stylesheets-1.68.1/html/inline.xsl line 1015 element when
xsl:when : could not compile test expression '$action='simul''
XPath error : Undefined variable
$action='press'
^
compilation error: file file:///usr/share/sgml/docbook/xsl-stylesheets-1.68.1/html/inline.xsl line 1016 element when
xsl:when : could not compile test expression '$action='press''
XPath error : Undefined variable
$action='click'
^
compilation error: file file:///usr/share/sgml/docbook/xsl-stylesheets-1.68.1/html/inline.xsl line 1017 element when
xsl:when : could not compile test expression '$action='click''
XPath error : Undefined variable
$action='double-click'
^
compilation error: file file:///usr/share/sgml/docbook/xsl-stylesheets-1.68.1/html/inline.xsl line 1018 element when
xsl:when : could not compile test expression '$action='double-click''
XPath error : Undefined variable
$action='other'
^
compilation error: file file:///usr/share/sgml/docbook/xsl-stylesheets-1.68.1/html/inline.xsl line 1019 element when
xsl:when : could not compile test expression '$action='other''
XPath error : Undefined variable
$count>count($nodelist)
^
compilation error: file file:///usr/share/sgml/docbook/xsl-stylesheets-1.68.1/html/inline.xsl line 1050 element when
xsl:when : could not compile test expression '$count>count($nodelist)'
XPath error : Undefined variable
$count=1
^
compilation error: file file:///usr/share/sgml/docbook/xsl-stylesheets-1.68.1/html/inline.xsl line 1051 element when
xsl:when : could not compile test expression '$count=1'
XPath error : Undefined variable
compilation error: file file:///usr/share/sgml/docbook/xsl-stylesheets-1.68.1/html/inline.xsl line 1054 element with-param
xsl:param : could not compile select expression '$nodelist'
XPath error : Undefined variable
$count+1
^
compilation error: file file:///usr/share/sgml/docbook/xsl-stylesheets-1.68.1/html/inline.xsl line 1055 element with-param
xsl:param : could not compile select expression '$count+1'
XPath error : Undefined variable
name($node)='guimenuitem' or name($node)='guisubmenu'
^
compilation error: file file:///usr/share/sgml/docbook/xsl-stylesheets-1.68.1/html/inline.xsl line 1062 element when
xsl:when : could not compile test expression 'name($node)='guimenuitem' or name($node)='guisubmenu''
XPath error : Undefined variable
compilation error: file file:///usr/share/sgml/docbook/xsl-stylesheets-1.68.1/html/inline.xsl line 1071 element with-param
xsl:param : could not compile select expression '$nodelist'
XPath error : Undefined variable
$count+1
^
compilation error: file file:///usr/share/sgml/docbook/xsl-stylesheets-1.68.1/html/inline.xsl line 1072 element with-param
xsl:param : could not compile select expression '$count+1'
XPath error : Undefined variable
compilation error: file file:///usr/share/sgml/docbook/xsl-stylesheets-1.68.1/html/footnote.xsl line 60 element apply-templates
xsl:apply-templates : could not compile select expression '$footnote'
XPath error : Undefined variable
compilation error: file file:///usr/share/sgml/docbook/xsl-stylesheets-1.68.1/html/footnote.xsl line 168 element apply-templates
xsl:apply-templates : could not compile select expression '$html-nodes'
XPath error : Undefined variable
compilation error: file file:///usr/share/sgml/docbook/xsl-stylesheets-1.68.1/html/footnote.xsl line 173 element apply-templates
xsl:apply-templates : could not compile select expression '$html-nodes'
XPath error : Undefined variable
compilation error: file file:///usr/share/sgml/docbook/xsl-stylesheets-1.68.1/html/footnote.xsl line 220 element apply-templates
xsl:apply-templates : could not compile select expression '$footnotes'
XPath error : Undefined variable
compilation error: file file:///usr/share/sgml/docbook/xsl-stylesheets-1.68.1/html/footnote.xsl line 30 element a
Attribute template name: failed to compile $name
XPath error : Undefined variable
compilation error: file file:///usr/share/sgml/docbook/xsl-stylesheets-1.68.1/html/footnote.xsl line 30 element a
Attribute template href: failed to compile $href
XPath error : Undefined variable
compilation error: file file:///usr/share/sgml/docbook/xsl-stylesheets-1.68.1/html/footnote.xsl line 39 element a
Attribute template name: failed to compile $name
XPath error : Undefined variable
compilation error: file file:///usr/share/sgml/docbook/xsl-stylesheets-1.68.1/html/footnote.xsl line 39 element a
Attribute template href: failed to compile $href
XPath error : Undefined variable
compilation error: file file:///usr/share/sgml/docbook/xsl-stylesheets-1.68.1/html/footnote.xsl line 59 element a
Attribute template href: failed to compile $href
XPath error : Undefined variable
compilation error: file file:///usr/share/sgml/docbook/xsl-stylesheets-1.68.1/html/footnote.xsl line 123 element a
Attribute template name: failed to compile $name
XPath error : Undefined variable
compilation error: file file:///usr/share/sgml/docbook/xsl-stylesheets-1.68.1/html/footnote.xsl line 123 element a
Attribute template href: failed to compile $href
XPath error : Undefined variable
compilation error: file file:///usr/share/sgml/docbook/xsl-stylesheets-1.68.1/html/footnote.xsl line 151 element a
Attribute template name: failed to compile $name
XPath error : Undefined variable
compilation error: file file:///usr/share/sgml/docbook/xsl-stylesheets-1.68.1/html/footnote.xsl line 151 element a
Attribute template href: failed to compile $href
XPath error : Undefined variable
$refentrytitle[1]
^
compilation error: file file:///usr/share/sgml/docbook/xsl-stylesheets-1.68.1/html/refentry.xsl line 60 element apply-templates
xsl:apply-templates : could not compile select expression '$refentrytitle[1]'
XPath error : Undefined variable
$refdesc[1]
^
compilation error: file file:///usr/share/sgml/docbook/xsl-stylesheets-1.68.1/html/refentry.xsl line 63 element apply-templates
xsl:apply-templates : could not compile select expression '$refdesc[1]'
XPath error : Undefined variable
$refname[1]
^
compilation error: file file:///usr/share/sgml/docbook/xsl-stylesheets-1.68.1/html/refentry.xsl line 66 element apply-templates
xsl:apply-templates : could not compile select expression '$refname[1]'
XPath error : Undefined variable
compilation error: file file:///usr/share/sgml/docbook/xsl-stylesheets-1.68.1/html/component.xsl line 43 element apply-templates
xsl:apply-templates : could not compile select expression '$node'
XPath error : Undefined variable
substring-after(normalize-space($formal.title.placement), concat(local-name(.), ' '))
^
compilation error: file file:///usr/share/sgml/docbook/xsl-stylesheets-1.68.1/html/task.xsl line 20 element variable
xsl:variable : could not compile select expression 'substring-after(normalize-space($formal.title.placement), concat(local-name(.), ' '))'
XPath error : Undefined variable
$choice='plain'
^
compilation error: file file:///usr/share/sgml/docbook/xsl-stylesheets-1.68.1/html/synop.xsl line 59 element when
xsl:when : could not compile test expression '$choice='plain''
XPath error : Undefined variable
$choice='req'
^
compilation error: file file:///usr/share/sgml/docbook/xsl-stylesheets-1.68.1/html/synop.xsl line 62 element when
xsl:when : could not compile test expression '$choice='req''
XPath error : Undefined variable
$choice='opt'
^
compilation error: file file:///usr/share/sgml/docbook/xsl-stylesheets-1.68.1/html/synop.xsl line 65 element when
xsl:when : could not compile test expression '$choice='opt''
XPath error : Undefined variable
$rep='repeat'
^
compilation error: file file:///usr/share/sgml/docbook/xsl-stylesheets-1.68.1/html/synop.xsl line 74 element when
xsl:when : could not compile test expression '$rep='repeat''
XPath error : Undefined variable
$rep='norepeat'
^
compilation error: file file:///usr/share/sgml/docbook/xsl-stylesheets-1.68.1/html/synop.xsl line 77 element when
xsl:when : could not compile test expression '$rep='norepeat''
XPath error : Undefined variable
$choice='plain'
^
compilation error: file file:///usr/share/sgml/docbook/xsl-stylesheets-1.68.1/html/synop.xsl line 85 element when
xsl:when : could not compile test expression '$choice='plain''
XPath error : Undefined variable
$choice='req'
^
compilation error: file file:///usr/share/sgml/docbook/xsl-stylesheets-1.68.1/html/synop.xsl line 88 element when
xsl:when : could not compile test expression '$choice='req''
XPath error : Undefined variable
$choice='opt'
^
compilation error: file file:///usr/share/sgml/docbook/xsl-stylesheets-1.68.1/html/synop.xsl line 91 element when
xsl:when : could not compile test expression '$choice='opt''
XPath error : Undefined variable
$html-style != ''
^
compilation error: file file:///usr/share/sgml/docbook/xsl-stylesheets-1.68.1/html/synop.xsl line 179 element when
xsl:when : could not compile test expression '$html-style != '''
XPath error : Undefined variable
$style = 'kr' and $tabular-p
^
compilation error: file file:///usr/share/sgml/docbook/xsl-stylesheets-1.68.1/html/synop.xsl line 193 element when
xsl:when : could not compile test expression '$style = 'kr' and $tabular-p'
XPath error : Undefined variable
$style = 'kr'
^
compilation error: file file:///usr/share/sgml/docbook/xsl-stylesheets-1.68.1/html/synop.xsl line 196 element when
xsl:when : could not compile test expression '$style = 'kr''
XPath error : Undefined variable
$style = 'ansi' and $tabular-p
^
compilation error: file file:///usr/share/sgml/docbook/xsl-stylesheets-1.68.1/html/synop.xsl line 199 element when
xsl:when : could not compile test expression '$style = 'ansi' and $tabular-p'
XPath error : Undefined variable
$funcsynopsis.decoration != 0
^
compilation error: file file:///usr/share/sgml/docbook/xsl-stylesheets-1.68.1/html/synop.xsl line 230 element when
xsl:when : could not compile test expression '$funcsynopsis.decoration != 0'
XPath error : Undefined variable
$funcsynopsis.decoration != 0
^
compilation error: file file:///usr/share/sgml/docbook/xsl-stylesheets-1.68.1/html/synop.xsl line 265 element when
xsl:when : could not compile test expression '$funcsynopsis.decoration != 0'
XPath error : Undefined variable
$funcsynopsis.decoration != 0
^
compilation error: file file:///usr/share/sgml/docbook/xsl-stylesheets-1.68.1/html/synop.xsl line 327 element when
xsl:when : could not compile test expression '$funcsynopsis.decoration != 0'
XPath error : Undefined variable
$funcsynopsis.decoration != 0
^
compilation error: file file:///usr/share/sgml/docbook/xsl-stylesheets-1.68.1/html/synop.xsl line 371 element when
xsl:when : could not compile test expression '$funcsynopsis.decoration != 0'
XPath error : Undefined variable
$funcsynopsis.decoration != 0
^
compilation error: file file:///usr/share/sgml/docbook/xsl-stylesheets-1.68.1/html/synop.xsl line 420 element when
xsl:when : could not compile test expression '$funcsynopsis.decoration != 0'
XPath error : Undefined variable
$funcsynopsis.decoration != 0
^
compilation error: file file:///usr/share/sgml/docbook/xsl-stylesheets-1.68.1/html/synop.xsl line 456 element when
xsl:when : could not compile test expression '$funcsynopsis.decoration != 0'
XPath error : Undefined variable
$funcsynopsis.decoration != 0
^
compilation error: file file:///usr/share/sgml/docbook/xsl-stylesheets-1.68.1/html/synop.xsl line 491 element when
xsl:when : could not compile test expression '$funcsynopsis.decoration != 0'
XPath error : Undefined variable
$funcsynopsis.decoration != 0
^
compilation error: file file:///usr/share/sgml/docbook/xsl-stylesheets-1.68.1/html/synop.xsl line 540 element when
xsl:when : could not compile test expression '$funcsynopsis.decoration != 0'
XPath error : Undefined variable
$funcsynopsis.decoration != 0
^
compilation error: file file:///usr/share/sgml/docbook/xsl-stylesheets-1.68.1/html/synop.xsl line 605 element when
xsl:when : could not compile test expression '$funcsynopsis.decoration != 0'
XPath error : Undefined variable
$language='java'
^
compilation error: file file:///usr/share/sgml/docbook/xsl-stylesheets-1.68.1/html/synop.xsl line 643 element when
xsl:when : could not compile test expression '$language='java''
XPath error : Undefined variable
$language='perl'
^
compilation error: file file:///usr/share/sgml/docbook/xsl-stylesheets-1.68.1/html/synop.xsl line 646 element when
xsl:when : could not compile test expression '$language='perl''
XPath error : Undefined variable
$language='idl'
^
compilation error: file file:///usr/share/sgml/docbook/xsl-stylesheets-1.68.1/html/synop.xsl line 649 element when
xsl:when : could not compile test expression '$language='idl''
XPath error : Undefined variable
$language='cpp'
^
compilation error: file file:///usr/share/sgml/docbook/xsl-stylesheets-1.68.1/html/synop.xsl line 652 element when
xsl:when : could not compile test expression '$language='cpp''
XPath error : Undefined variable
compilation error: file file:///usr/share/sgml/docbook/xsl-stylesheets-1.68.1/html/synop.xsl line 664 element with-param
xsl:param : could not compile select expression '$default-classsynopsis-language'
XPath error : Undefined variable
$indent + 1
^
compilation error: file file:///usr/share/sgml/docbook/xsl-stylesheets-1.68.1/html/synop.xsl line 821 element with-param
xsl:param : could not compile select expression '$indent + 1'
XPath error : Undefined variable
compilation error: file file:///usr/share/sgml/docbook/xsl-stylesheets-1.68.1/html/synop.xsl line 855 element copy-of
xsl:copy-of : could not compile select expression '$decl'
XPath error : Undefined variable
string-length($decl)
^
compilation error: file file:///usr/share/sgml/docbook/xsl-stylesheets-1.68.1/html/synop.xsl line 858 element with-param
xsl:param : could not compile select expression 'string-length($decl)'
XPath error : Undefined variable
$revnumber[1]
^
compilation error: file file:///usr/share/sgml/docbook/xsl-stylesheets-1.68.1/html/titlepage.xsl line 685 element apply-templates
xsl:apply-templates : could not compile select expression '$revnumber[1]'
XPath error : Undefined variable
$revdate[1]
^
compilation error: file file:///usr/share/sgml/docbook/xsl-stylesheets-1.68.1/html/titlepage.xsl line 689 element apply-templates
xsl:apply-templates : could not compile select expression '$revdate[1]'
XPath error : Undefined variable
$revauthor[1]
^
compilation error: file file:///usr/share/sgml/docbook/xsl-stylesheets-1.68.1/html/titlepage.xsl line 694 element apply-templates
xsl:apply-templates : could not compile select expression '$revauthor[1]'
XPath error : Undefined variable
$revremark[1]
^
compilation error: file file:///usr/share/sgml/docbook/xsl-stylesheets-1.68.1/html/titlepage.xsl line 706 element apply-templates
xsl:apply-templates : could not compile select expression '$revremark[1]'
XPath error : Undefined variable
concat('ln-',$id,$html.ext)
^
compilation error: file file:///usr/share/sgml/docbook/xsl-stylesheets-1.68.1/html/titlepage.xsl line 475 element a
Attribute template href: failed to compile concat('ln-',$id,$html.ext)
XPath error : Undefined variable
compilation error: file file:///usr/share/sgml/docbook/xsl-stylesheets-1.68.1/html/titlepage.xsl line 657 element th
Attribute template colspan: failed to compile $numcols
XPath error : Undefined variable
compilation error: file file:///usr/share/sgml/docbook/xsl-stylesheets-1.68.1/html/titlepage.xsl line 705 element td
Attribute template colspan: failed to compile $numcols
XPath error : Undefined variable
compilation error: file file:///usr/share/sgml/docbook/xsl-stylesheets-1.68.1/html/ebnf.xsl line 306 element apply-templates
xsl:apply-templates : could not compile select expression '$target'
XPath error : Undefined variable
compilation error: file file:///usr/share/sgml/docbook/xsl-stylesheets-1.68.1/html/ebnf.xsl line 236 element a
Attribute template href: failed to compile $href
XPath error : Undefined variable
compilation error: file file:///usr/share/sgml/docbook/xsl-stylesheets-1.68.1/html/ebnf.xsl line 303 element a
Attribute template href: failed to compile $href
XPath error : Undefined namespace prefix
not(preceding::p|preceding::html:p)
^
compilation error: file file:///usr/share/sgml/docbook/xsl-stylesheets-1.68.1/html/html-rtf.xsl line 52 element if
xsl:if : could not compile test expression 'not(preceding::p|preceding::html:p)'XPath error : Undefined variable
exsl:node-set($p)
^
compilation error: file file:///usr/share/sgml/docbook/xsl-stylesheets-1.68.1/html/html-rtf.xsl line 114 element apply-templates
xsl:apply-templates : could not compile select expression 'exsl:node-set($p)'
XPath error : Undefined variable
compilation error: file file:///usr/share/sgml/docbook/xsl-stylesheets-1.68.1/html/html-rtf.xsl line 185 element apply-templates
xsl:apply-templates : could not compile select expression '$leading'
XPath error : Undefined variable
compilation error: file file:///usr/share/sgml/docbook/xsl-stylesheets-1.68.1/html/html-rtf.xsl line 189 element apply-templates
xsl:apply-templates : could not compile select expression '$block'
XPath error : Undefined variable
compilation error: file file:///usr/share/sgml/docbook/xsl-stylesheets-1.68.1/html/html-rtf.xsl line 208 element apply-templates
xsl:apply-templates : could not compile select expression '$nodes'
XPath error : Undefined variable
exsl:node-set($div)
^
compilation error: file file:///usr/share/sgml/docbook/xsl-stylesheets-1.68.1/html/html-rtf.xsl line 304 element apply-templates
xsl:apply-templates : could not compile select expression 'exsl:node-set($div)'
XPath error : Undefined variable
compilation error: file file:///usr/share/sgml/docbook/xsl-stylesheets-1.68.1/html/docbook.xsl line 138 element base
Attribute template href: failed to compile $html.base
XPath error : Undefined variable
substring-before($stylesheets, ' ')
^
compilation error: file file:///usr/share/sgml/docbook/xsl-stylesheets-1.68.1/html/docbook.xsl line 198 element link
Attribute template href: failed to compile substring-before($stylesheets, ' ')
XPath error : Undefined variable
compilation error: file file:///usr/share/sgml/docbook/xsl-stylesheets-1.68.1/html/docbook.xsl line 421 element ulink
Attribute template url: failed to compile $href
XPath error : Undefined variable
compilation error: file file:///usr/share/sgml/docbook/xsl-stylesheets-1.68.1/html/chunk-common.xsl line 749 element apply-templates
xsl:apply-templates : could not compile select expression '$up'
XPath error : Undefined variable
compilation error: file file:///usr/share/sgml/docbook/xsl-stylesheets-1.68.1/html/chunk-common.xsl line 866 element apply-templates
xsl:apply-templates : could not compile select expression '$prev'
XPath error : Undefined variable
compilation error: file file:///usr/share/sgml/docbook/xsl-stylesheets-1.68.1/html/chunk-common.xsl line 907 element apply-templates
xsl:apply-templates : could not compile select expression '$next'
XPath error : Undefined variable
key('id',$rootid)
^
compilation error: file file:///usr/share/sgml/docbook/xsl-stylesheets-1.68.1/html/chunk-code.xsl line 512 element apply-templates
xsl:apply-templates : could not compile select expression 'key('id',$rootid)'
XPath error : Undefined variable
key('id',$rootid)
^
compilation error: file file:///usr/share/sgml/docbook/xsl-stylesheets-1.68.1/html/chunk-code.xsl line 515 element apply-templates
xsl:apply-templates : could not compile select expression 'key('id',$rootid)'
XPath error : Undefined variable
$footnotes[1]
^
compilation error: file file:///usr/share/sgml/docbook/xsl-stylesheets-1.68.1/html/chunk-code.xsl line 954 element apply-templates
xsl:apply-templates : could not compile select expression '$footnotes[1]'
XPath error : Undefined variable
compilation error: file file:///usr/share/sgml/docbook/xsl-stylesheets-1.68.1/html/chunk-code.xsl line 805 element a
Attribute template href: failed to compile $href
XPath error : Undefined variable
compilation error: file /usr/share/gtk-doc/data/devhelp.xsl line 51 element apply-templates
xsl:apply-templates : could not compile select expression '$toc.nodes'
XPath error : Undefined variable
compilation error: file /usr/share/gtk-doc/data/devhelp.xsl line 47 element bookAttribute template title: failed to compile $title
XPath error : Undefined variable
compilation error: file /usr/share/gtk-doc/data/devhelp.xsl line 47 element bookAttribute template name: failed to compile $gtkdoc.bookname
XPath error : Undefined variable
compilation error: file /usr/share/gtk-doc/data/devhelp.xsl line 79 element sub
Attribute template name: failed to compile $title
XPath error : Undefined variable
compilation error: file /usr/share/gtk-doc/data/devhelp.xsl line 79 element sub
Attribute template link: failed to compile $target
XPath error : Undefined variable
compilation error: file /usr/share/gtk-doc/data/devhelp.xsl line 102 element function
Attribute template name: failed to compile $title
XPath error : Undefined variable
compilation error: file /usr/share/gtk-doc/data/devhelp.xsl line 102 element function
Attribute template link: failed to compile $target
XPath error : Undefined variable
compilation error: file /usr/share/gtk-doc/data/gtk-doc.xsl line 122 element meta
Attribute template content: failed to compile $gtkdoc.version
make[3]: *** [html-build.stamp] Error 5
make[3]: Leaving directory `/var/tmp/portage/gconf-2.12.1/work/GConf-2.12.1/doc/gconf'
make[2]: *** [all-recursive] Error 1
make[2]: Leaving directory `/var/tmp/portage/gconf-2.12.1/work/GConf-2.12.1/doc'make[1]: *** [all-recursive] Error 1
make[1]: Leaving directory `/var/tmp/portage/gconf-2.12.1/work/GConf-2.12.1'
make: *** [all] Error 2

I thought this might be a problem specific to gconf, but later I tried to upgrade gnome-applets and got this error when installing gnome-doc-utils-0.4.4:
xsltproc -o gnome-doc-make-C.omf --stringparam db2omf.basename gnome-doc-make --stringparam db2omf.format 'docbook' --stringparam db2omf.dtd "-//OASIS//DTD DocBook XML V4.4//EN" --stringparam db2omf.lang C --stringparam db2omf.omf_dir "/usr/share/omf" --stringparam db2omf.help_dir "/usr/share/gnome/help" --stringparam db2omf.omf_in "`pwd`/./gnome-doc-make.omf.in" ../../xslt/docbook/omf/db2omf.xsl C/gnome-doc-make.xml
XPath error : Undefined variable
compilation error: file ../../xslt/docbook/omf/db2omf.xsl line 688 element language
Attribute template code: failed to compile $db2omf.lang
make[2]: *** [gnome-doc-make-C.omf] Error 5
make[2]: Leaving directory `/var/tmp/portage/gnome-doc-utils-0.4.4/work/gnome-doc-utils-0.4.4/doc/gnome-doc-make'
make[1]: *** [all-recursive] Error 1
make[1]: Leaving directory `/var/tmp/portage/gnome-doc-utils-0.4.4/work/gnome-doc-utils-0.4.4/doc'
make: *** [all-recursive] Error 1

I made a similar post earlier (just about gconf) and someone asked me what my version of GCC was. It's:
3.4.4 (Gentoo 3.4.4-r1, ssp-3.4.4-1.0, pie-8.7.8). Since I'm guesing both errors are generated by xsltproc, the version of libxslt I have installed is 1.1.14-r2.
If anyone could shed any light as to why this is happening, I'd greatly appreciate it.
Back to top
View user's profile Send private message
Carlo
Developer
Developer


Joined: 12 Aug 2002
Posts: 3356

PostPosted: Mon Jan 23, 2006 2:00 pm    Post subject: Reply with quote

re-emerge libxslt
_________________
Please make sure that you have searched for an answer to a question after reading all the relevant docs.
Back to top
View user's profile Send private message
mark_alec
Bodhisattva
Bodhisattva


Joined: 11 Sep 2004
Posts: 6066
Location: Melbourne, Australia

PostPosted: Mon Jan 23, 2006 2:35 pm    Post subject: Reply with quote

Duplicate of https://forums.gentoo.org/viewtopic-t-379523.html
_________________
www.gentoo.org.au || #gentoo-au
Back to top
View user's profile Send private message
Display posts from previous:   
Reply to topic    Gentoo Forums Forum Index Duplicate Threads All times are GMT
Page 1 of 1

 
Jump to:  
You cannot post new topics in this forum
You cannot reply to topics in this forum
You cannot edit your posts in this forum
You cannot delete your posts in this forum
You cannot vote in polls in this forum