Gentoo Forums
Gentoo Forums
Gentoo Forums
Quick Search: in
cannot compile KDE or GNOME,getting same errors [solved]
View unanswered posts
View posts from last 24 hours

 
Reply to topic    Gentoo Forums Forum Index Duplicate Threads
View previous topic :: View next topic  
Author Message
bigfam
Tux's lil' helper
Tux's lil' helper


Joined: 30 Dec 2004
Posts: 106
Location: ottawa

PostPosted: Wed Jan 25, 2006 8:19 am    Post subject: cannot compile KDE or GNOME,getting same errors [solved] Reply with quote

Code:

make[2]: Leaving directory `/tmp/portage/portage/gnome-doc-utils-0.4.4/work/gnome-doc-utils-0.4.4/xml2po'
make[1]: Leaving directory `/tmp/portage/portage/gnome-doc-utils-0.4.4/work/gnome-doc-utils-0.4.4/xml2po'
Making all in doc
make[1]: Entering directory `/tmp/portage/portage/gnome-doc-utils-0.4.4/work/gnome-doc-utils-0.4.4/doc'
Making all in gnome-doc-make
make[2]: Entering directory `/tmp/portage/portage/gnome-doc-utils-0.4.4/work/gnome-doc-utils-0.4.4/doc/gnome-doc-make'
xsltproc -o gnome-doc-make-C.omf --stringparam db2omf.basename gnome-doc-make --stringparam db2omf.format 'docbook' --stringparam db2omf.dtd "-//OASIS//DTD DocBook XML V4.4//EN" --stringparam db2omf.lang C --stringparam db2omf.omf_dir "/usr/share/omf" --stringparam db2omf.help_dir "/usr/share/gnome/help" --stringparam db2omf.omf_in "`pwd`/./gnome-doc-make.omf.in" ../../xslt/docbook/omf/db2omf.xsl C/gnome-doc-make.xml
XPath error : Undefined variable
document($db2omf.omf_in)
                       ^
compilation error: file ../../xslt/docbook/omf/db2omf.xsl line 126 element variable
xsl:variable : could not compile select expression 'document($db2omf.omf_in)'
XPath error : Undefined variable
compilation error: file ../../xslt/docbook/omf/db2omf.xsl line 151 element with-param
xsl:param : could not compile select expression '$info'
XPath error : Undefined variable
compilation error: file ../../xslt/docbook/omf/db2omf.xsl line 154 element with-param
xsl:param : could not compile select expression '$info'
XPath error : Undefined variable
compilation error: file ../../xslt/docbook/omf/db2omf.xsl line 157 element with-param
xsl:param : could not compile select expression '$info'
XPath error : Undefined variable
compilation error: file ../../xslt/docbook/omf/db2omf.xsl line 160 element with-param
xsl:param : could not compile select expression '$info'
XPath error : Undefined variable
compilation error: file ../../xslt/docbook/omf/db2omf.xsl line 163 element with-param
xsl:param : could not compile select expression '$info'
XPath error : Undefined variable
compilation error: file ../../xslt/docbook/omf/db2omf.xsl line 166 element with-param
xsl:param : could not compile select expression '$info'
XPath error : Undefined variable
compilation error: file ../../xslt/docbook/omf/db2omf.xsl line 169 element with-param
xsl:param : could not compile select expression '$info'
XPath error : Undefined variable
compilation error: file ../../xslt/docbook/omf/db2omf.xsl line 172 element with-param
xsl:param : could not compile select expression '$info'
XPath error : Undefined variable
compilation error: file ../../xslt/docbook/omf/db2omf.xsl line 175 element with-param
xsl:param : could not compile select expression '$info'
XPath error : Undefined variable
compilation error: file ../../xslt/docbook/omf/db2omf.xsl line 178 element with-param
xsl:param : could not compile select expression '$info'
XPath error : Undefined variable
compilation error: file ../../xslt/docbook/omf/db2omf.xsl line 181 element with-param
xsl:param : could not compile select expression '$info'
XPath error : Undefined variable
compilation error: file ../../xslt/docbook/omf/db2omf.xsl line 184 element with-param
xsl:param : could not compile select expression '$info'
XPath error : Undefined variable
compilation error: file ../../xslt/docbook/omf/db2omf.xsl line 187 element with-param
xsl:param : could not compile select expression '$info'
.mime = 'text/xml'
             ^
compilation error: file ../../xslt/docbook/omf/db2omf.xsl line 588 element when
xsl:when : could not compile test expression '$db2omf.mime = 'text/xml''
XPath error : Undefined variable
compilation error: file ../../xslt/docbook/omf/db2omf.xsl line 593 element value-of
xsl:value-of : could not compile select expression '$db2omf.dtd'
XPath error : Undefined variable
compilation error: file ../../xslt/docbook/omf/db2omf.xsl line 607 element value-of
xsl:value-of : could not compile select expression '$db2omf.mime'
XPath error : Undefined variable
compilation error: file ../../xslt/docbook/omf/db2omf.xsl line 637 element value-of
xsl:value-of : could not compile select expression '$db2omf.help_dir'
XPath error : Undefined variable
not(substring($db2omf.help_dir,                                   string-length($db2omf.help_dir)) = '/')
                              ^
compilation error: file ../../xslt/docbook/omf/db2omf.xsl line 639 element if
xsl:if : could not compile test expression 'not(substring($db2omf.help_dir,                                   string-length($db2omf.help_dir)) = '/')'
XPath error : Undefined variable
compilation error: file ../../xslt/docbook/omf/db2omf.xsl line 642 element value-of
xsl:value-of : could not compile select expression '$db2omf.basename'
XPath error : Undefined variable
compilation error: file ../../xslt/docbook/omf/db2omf.xsl line 644 element value-of
xsl:value-of : could not compile select expression '$db2omf.lang'

compilation error: file ../../xslt/docbook/common/db-common.xsl line 211 element if
xsl:if : could not compile test expression '$node/surname'
XPath error : Undefined variable
compilation error: file ../../xslt/docbook/omf/db2omf.xsl line 688 element language
Attribute template code: failed to compile $db2omf.lang
make[2]: *** [gnome-doc-make-C.omf] Error 5
make[2]: Leaving directory `/tmp/portage/portage/gnome-doc-utils-0.4.4/work/gnome-doc-utils-0.4.4/doc/gnome-doc-make'
make[1]: *** [all-recursive] Error 1
make[1]: Leaving directory `/tmp/portage/portage/gnome-doc-utils-0.4.4/work/gnome-doc-utils-0.4.4/doc'
make: *** [all-recursive] Error 1

!!! ERROR: app-text/gnome-doc-utils-0.4.4 failed.
!!! Function gnome2_src_compile, Line 48, Exitcode 2
!!! compile failure
!!! If you need support, post the topmost build error, NOT this status message.



this has me totally confused, any suggestions ?


Last edited by bigfam on Wed Jan 25, 2006 10:23 am; edited 2 times in total
Back to top
View user's profile Send private message
bigfam
Tux's lil' helper
Tux's lil' helper


Joined: 30 Dec 2004
Posts: 106
Location: ottawa

PostPosted: Wed Jan 25, 2006 10:14 am    Post subject: Reply with quote

im getting the same errors when compiling kdebase


Code:

compilation error: file /usr/kde/3.5/share/apps/ksgmltools2/docbook/xsl/html/chunk-code.xsl lin                                           
e 918 element param
xsl:param : could not compile select expression '$node//footnote'
XPath error : Undefined variable
compilation error: file /usr/kde/3.5/share/apps/ksgmltools2/docbook/xsl/html/chunk-code.xsl lin                                           
e 926 element with-param
xsl:param : could not compile select expression '$node'
XPath error : Undefined variable
$footnotes[1]
          ^
compilation error: file /usr/kde/3.5/share/apps/ksgmltools2/docbook/xsl/html/chunk-code.xsl lin                                           
e 927 element with-param
xsl:param : could not compile select expression '$footnotes[1]'
XPath error : Undefined variable
count($footnotes) = 0
                ^
compilation error: file /usr/kde/3.5/share/apps/ksgmltools2/docbook/xsl/html/chunk-code.xsl lin                                           
e 932 element when
xsl:when : could not compile test expression 'count($footnotes) = 0'
XPath error : Undefined variable
$in.other.chunk != 0
                ^
compilation error: file /usr/kde/3.5/share/apps/ksgmltools2/docbook/xsl/html/chunk-code.xsl lin                                           
e 937 element when
xsl:when : could not compile test expression '$in.other.chunk != 0'
XPath error : Undefined variable
compilation error: file /usr/kde/3.5/share/apps/ksgmltools2/docbook/xsl/html/chunk-code.xsl lin                                           
e 939 element with-param
xsl:param : could not compile select expression '$node'
XPath error : Undefined variable
$footnotes[position() > 1]
          ^
compilation error: file /usr/kde/3.5/share/apps/ksgmltools2/docbook/xsl/html/chunk-code.xsl lin                                           
e 941 element with-param
xsl:param : could not compile select expression '$footnotes[position() > 1]'
XPath error : Undefined variable
$footnotes[1]/ancestor::table                         |$footnotes[1]/ancestor::informaltable
          ^
compilation error: file /usr/kde/3.5/share/apps/ksgmltools2/docbook/xsl/html/chunk-code.xsl lin                                           
e 945 element when
xsl:when : could not compile test expression '$footnotes[1]/ancestor::table                                                               
     |$footnotes[1]/ancestor::informaltable'
XPath error : Undefined variable
compilation error: file /usr/kde/3.5/share/apps/ksgmltools2/docbook/xsl/html/chunk-code.xsl lin                                           
e 947 element with-param
xsl:param : could not compile select expression '$node'
XPath error : Undefined variable
$footnotes[position() > 1]
          ^
compilation error: file /usr/kde/3.5/share/apps/ksgmltools2/docbook/xsl/html/chunk-code.xsl lin                                           
e 949 element with-param
xsl:param : could not compile select expression '$footnotes[position() > 1]'
XPath error : Undefined variable
$footnotes[1]
          ^
compilation error: file /usr/kde/3.5/share/apps/ksgmltools2/docbook/xsl/html/chunk-code.xsl lin                                           
e 954 element apply-templates
xsl:apply-templates : could not compile select expression '$footnotes[1]'
XPath error : Undefined variable
compilation error: file /usr/kde/3.5/share/apps/ksgmltools2/docbook/xsl/html/chunk-code.xsl lin                                           
e 956 element with-param
xsl:param : could not compile select expression '$node'
XPath error : Undefined variable
$footnotes[position() > 1]          ^
compilation error: file /usr/kde/3.5/share/apps/ksgmltools2/docbook/xsl/html/chunk-code.xsl lin                                           
e 958 element with-param
xsl:param : could not compile select expression '$footnotes[position() > 1]'
XPath error : Undefined variable
compilation error: file /usr/kde/3.5/share/apps/ksgmltools2/docbook/xsl/html/chunk-code.xsl lin                                           
e 971 element with-param
xsl:param : could not compile select expression '$footnotes'
XPath error : Undefined variable
compilation error: file /usr/kde/3.5/share/apps/ksgmltools2/docbook/xsl/html/chunk-code.xsl lin                                           
e 990 element with-param
xsl:param : could not compile select expression '$footnotes'
XPath error : Undefined variable
$is.chunk = 1
          ^
compilation error: file /usr/kde/3.5/share/apps/ksgmltools2/docbook/xsl/html/chunk-code.xsl lin                                           
e 1000 element if
xsl:if : could not compile test expression '$is.chunk = 1'
XPath error : Undefined variable
count($prev)>0
           ^
compilation error: file /usr/kde/3.5/share/apps/ksgmltools2/customization/kde-navig.xsl line 67                                           
 element if
xsl:if : could not compile test expression 'count($prev)>0'
XPath error : Undefined variable
compilation error: file /usr/kde/3.5/share/apps/ksgmltools2/customization/kde-navig.xsl line 71                                           
 element with-param
xsl:param : could not compile select expression '$prev'
XPath error : Undefined variable
count($next)>0
           ^
compilation error: file /usr/kde/3.5/share/apps/ksgmltools2/customization/kde-navig.xsl line 80                                           
 element if
xsl:if : could not compile test expression 'count($next)>0'
XPath error : Undefined variable
compilation error: file /usr/kde/3.5/share/apps/ksgmltools2/customization/kde-navig.xsl line 84                                           
 element with-param
xsl:param : could not compile select expression '$next'
XPath error : Undefined variable
compilation error: file /usr/kde/3.5/share/apps/ksgmltools2/customization/kde-navig.xsl line 94                                           
 element apply-templates
xsl:apply-templates : could not compile select expression '$up'
XPath error : Undefined variable
$suppress.navigation = '0'
                     ^
compilation error: file /usr/kde/3.5/share/apps/ksgmltools2/customization/kde-navig.xsl line 11                                           
2 element if
xsl:if : could not compile test expression '$suppress.navigation = '0''
XPath error : Undefined variable
count($prev)>0
           ^
compilation error: file /usr/kde/3.5/share/apps/ksgmltools2/customization/kde-navig.xsl line 11                                           
8 element if
xsl:if : could not compile test expression 'count($prev)>0'
XPath error : Undefined variable
compilation error: file /usr/kde/3.5/share/apps/ksgmltools2/customization/kde-navig.xsl line 12                                           
2 element with-param
xsl:param : could not compile select expression '$prev'
XPath error : Undefined variable
count($next)>0
           ^
compilation error: file /usr/kde/3.5/share/apps/ksgmltools2/customization/kde-navig.xsl line 13                                           
0 element if
xsl:if : could not compile test expression 'count($next)>0'
XPath error : Undefined variable
compilation error: file /usr/kde/3.5/share/apps/ksgmltools2/customization/kde-navig.xsl line 13                                           
4 element with-param
xsl:param : could not compile select expression '$next'
XPath error : Undefined variable
$home != .
      ^
compilation error: file /usr/kde/3.5/share/apps/ksgmltools2/customization/kde-navig.xsl line 14                                           
3 element when
xsl:when : could not compile test expression '$home != .'
XPath error : Undefined variable
compilation error: file /usr/kde/3.5/share/apps/ksgmltools2/customization/kde-navig.xsl line 14                                           
7 element with-param
xsl:param : could not compile select expression '$home'
XPath error : Undefined variable
compilation error: file /usr/kde/3.5/share/apps/ksgmltools2/customization/kde-navig.xsl line 16                                           
2 element apply-templates
xsl:apply-templates : could not compile select expression '$prev'
XPath error : Undefined variable
compilation error: file /usr/kde/3.5/share/apps/ksgmltools2/customization/kde-navig.xsl line 16                                           
7 element apply-templates
xsl:apply-templates : could not compile select expression '$next'
XPath error : Undefined variable
compilation error: file /usr/kde/3.5/share/apps/ksgmltools2/customization/kde-navig.xsl line 17                                           
5 element with-param
xsl:param : could not compile select expression '$up'
XPath error : Undefined variable
compilation error: file /usr/kde/3.5/share/apps/ksgmltools2/customization/kde-navig.xsl line 43                                           
 element div
Attribute template style: failed to compile $kde.common
XPath error : Undefined variable
compilation error: file /usr/kde/3.5/share/apps/ksgmltools2/customization/kde-navig.xsl line 47                                           
 element img
Attribute template src: failed to compile $kde.common
XPath error : Undefined variable
compilation error: file /usr/kde/3.5/share/apps/ksgmltools2/customization/kde-navig.xsl line 20                                           
1 element img
Attribute template src: failed to compile $kde.common
XPath error : Undefined variable
compilation error: file /usr/kde/3.5/share/apps/ksgmltools2/customization/kde-chunk.xsl line 33                                           
 element FILENAME
Attribute template filename: failed to compile $filename
XPath error : Undefined variable
compilation error: file /usr/kde/3.5/share/apps/ksgmltools2/customization/kde-chunk.xsl line 96                                           
 element a
Attribute template href: failed to compile $filename
unable to parse ./index.docbook
make[3]: *** [index.cache.bz2] Error 1
make[3]: Leaving directory `/tmp/portage/portage/kdebase-3.5.0-r1/work/kdebase-3.5.0/doc/kdepri                                           
nt'
make[2]: *** [all-recursive] Error 1
make[2]: Leaving directory `/tmp/portage/portage/kdebase-3.5.0-r1/work/kdebase-3.5.0/doc'
make[1]: *** [all-recursive] Error 1
make[1]: Leaving directory `/tmp/portage/portage/kdebase-3.5.0-r1/work/kdebase-3.5.0'
make: *** [all] Error 2

!!! ERROR: kde-base/kdebase-3.5.0-r1 failed.
!!! Function kde_src_compile, Line 175, Exitcode 2
!!! died running emake, kde_src_compile:make
!!! If you need support, post the topmost build error, NOT this status message.

localhost famine #



i need help!!!
Back to top
View user's profile Send private message
bigfam
Tux's lil' helper
Tux's lil' helper


Joined: 30 Dec 2004
Posts: 106
Location: ottawa

PostPosted: Wed Jan 25, 2006 10:23 am    Post subject: Reply with quote

re-emerging 'libxslt' seems to have fixed this problem
Back to top
View user's profile Send private message
Penguin of Wonder
Apprentice
Apprentice


Joined: 17 Jan 2006
Posts: 280
Location: West Virginia

PostPosted: Thu Jan 26, 2006 9:33 pm    Post subject: Reply with quote

i know this has been "solved" but I have a quick question.

I've gotten the same error compiling gnome. After I re-emerge the library mentioned, do I have to re-emerge gnome as well??

(hope that wasn't a stupid question :oops: )
_________________
My Linux Blog

AMD64 3700+
2G DDR 3200 Ram
320G HDD
Back to top
View user's profile Send private message
mark_alec
Bodhisattva
Bodhisattva


Joined: 11 Sep 2004
Posts: 6066
Location: Melbourne, Australia

PostPosted: Fri Jan 27, 2006 3:13 am    Post subject: Reply with quote

Duplicate of https://forums.gentoo.org/viewtopic-t-379523.html

Penguin of Wonder, after re-emerging libxslt, you will need to try to emerge gnome again.
_________________
www.gentoo.org.au || #gentoo-au
Back to top
View user's profile Send private message
Display posts from previous:   
Reply to topic    Gentoo Forums Forum Index Duplicate Threads All times are GMT
Page 1 of 1

 
Jump to:  
You cannot post new topics in this forum
You cannot reply to topics in this forum
You cannot edit your posts in this forum
You cannot delete your posts in this forum
You cannot vote in polls in this forum