Gentoo Forums
Gentoo Forums
Gentoo Forums
Quick Search: in
Can't emerge kdebase-startkde
View unanswered posts
View posts from last 24 hours

 
Reply to topic    Gentoo Forums Forum Index Duplicate Threads
View previous topic :: View next topic  
Author Message
Zee
Apprentice
Apprentice


Joined: 10 Jan 2004
Posts: 213
Location: Podgrad, Slovenia

PostPosted: Sat Jan 28, 2006 11:43 pm    Post subject: Can't emerge kdebase-startkde Reply with quote

Today I'm doing a little upgrade on my big machine and when compiling kdebase-startkde (from KDE 3.4.3) I repeatedly get the following error. I tried an "emerge sync" followed by a fresh download of the source code but nothing helped.

can anybody point me in the right direction, please?
thanks in advance,
zee

The error:
make all-recursive
make[1]: Entering directory `/var/tmp/portage/kdesu-3.4.1/work/kdesu-3.4.1'
Making all in doc
make[2]: Entering directory `/var/tmp/portage/kdesu-3.4.1/work/kdesu-3.4.1/doc'
Making all in kdesu
make[3]: Entering directory `/var/tmp/portage/kdesu-3.4.1/work/kdesu-3.4.1/doc/kdesu'
/usr/kde/3.4/bin/meinproc --check --cache index.cache.bz2 ./index.docbook
XPath error : Undefined variable
compilation error: file /usr/kde/3.4/share/apps/ksgmltools2/docbook/xsl/html/inline.xsl line 856 element a
Attribute template href: failed to compile $id
XPath error : Undefined variable
compilation error: file /usr/kde/3.4/share/apps/ksgmltools2/docbook/xsl/html/admon.xsl line 83 element img
Attribute template alt: failed to compile $alt
XPath error : Undefined variable
compilation error: file /usr/kde/3.4/share/apps/ksgmltools2/docbook/xsl/html/docbook.xsl line 140 element meta
Attribute template content: failed to compile $VERSION
XPath error : Undefined variable
compilation error: file /usr/kde/3.4/share/apps/ksgmltools2/customization/kde-navig.xsl line 43 element div
Attribute template style: failed to compile $kde.common
XPath error : Undefined variable
compilation error: file /usr/kde/3.4/share/apps/ksgmltools2/customization/kde-navig.xsl line 198 element div
Attribute template style: failed to compile $kde.common
unable to parse ./index.docbook
make[3]: *** [index.cache.bz2] Error 1
make[3]: Leaving directory `/var/tmp/portage/kdesu-3.4.1/work/kdesu-3.4.1/doc/kdesu'
make[2]: *** [all-recursive] Error 1
make[2]: Leaving directory `/var/tmp/portage/kdesu-3.4.1/work/kdesu-3.4.1/doc'
make[1]: *** [all-recursive] Error 1
make[1]: Leaving directory `/var/tmp/portage/kdesu-3.4.1/work/kdesu-3.4.1'
make: *** [all] Error 2

!!! ERROR: kde-base/kdesu-3.4.1 failed.
!!! Function kde_src_compile, Line 175, Exitcode 2
!!! died running emake, kde_src_compile:make
!!! If you need support, post the topmost build error, NOT this status message.
Back to top
View user's profile Send private message
mark_alec
Bodhisattva
Bodhisattva


Joined: 11 Sep 2004
Posts: 6066
Location: Melbourne, Australia

PostPosted: Sun Jan 29, 2006 4:54 am    Post subject: Reply with quote

Moved from Desktop Environments to Duplicate Threads.

https://forums.gentoo.org/viewtopic-t-379523.html has the solution, the searching is the tool to find it :wink:
_________________
www.gentoo.org.au || #gentoo-au
Back to top
View user's profile Send private message
Display posts from previous:   
Reply to topic    Gentoo Forums Forum Index Duplicate Threads All times are GMT
Page 1 of 1

 
Jump to:  
You cannot post new topics in this forum
You cannot reply to topics in this forum
You cannot edit your posts in this forum
You cannot delete your posts in this forum
You cannot vote in polls in this forum