Gentoo Forums
Gentoo Forums
Gentoo Forums
Quick Search: in
gnome-base/orbit-2.12.4 build failed
View unanswered posts
View posts from last 24 hours

 
Reply to topic    Gentoo Forums Forum Index Duplicate Threads
View previous topic :: View next topic  
Author Message
meisterlampe
n00b
n00b


Joined: 02 Jun 2004
Posts: 23

PostPosted: Mon Mar 06, 2006 12:13 pm    Post subject: gnome-base/orbit-2.12.4 build failed Reply with quote

Hello!
The build for "gnome-base/orbit-2.12.4 [2.12.3] -debug +doc* +ssl -static" failed.
I've tried compilation with gcc-3.5.5 and gcc-3.5.6 with the same result.
my CFLAGS="-O2 -march=pentium3 -pipe"

Heres the last output:
Code:

make[3]: Entering directory `/var/tmp/portage/orbit-2.12.4/work/ORBit2-2.12.4/docs/api'
*** Scanning header files ***
if grep -l '^..*$' ./ORBit2.types > /dev/null 2>&1 ; then \
    CC="/bin/sh ../../libtool --mode=compile i686-pc-linux-gnu-gcc   -O2 -march=pentium3 -pipe" LD="/bin/sh ../../libtool --mode=link i686-pc-linux-gnu-gcc  -O2 -march=pentium3 -pipe " CFLAGS="" LDFLAGS="" gtkdoc-scangobj  --module=ORBit2 --output-dir=. ; \
else \
    cd . ; \
    for i in ORBit2.args ORBit2.hierarchy ORBit2.interfaces ORBit2.prerequisites ORBit2.signals ; do \
               test -f $i || touch $i ; \
    done \
fi
cd . && \
  gtkdoc-scan --module=ORBit2 --source-dir=../../src/orb/orb-core --ignore-headers="corba-ops.h iop-profiles.h orb-core-export.h orb-core-private.h orbhttp.h rbit-debug.h orbit-policy.h" --deprecated-guards="ORBIT2_DISABLE_DEPRECATED" ../../include/orbit/orb-core/allocators.h ../../include/orbit/orb-core/orbit-small.h
touch scan-build.stamp

*** Rebuilding template files ***
cd . && gtkdoc-mktmpl --module=ORBit2
=============================================================================
WARNING: 23 unused declarations.
  These can be found in ORBit2-unused.txt.
  They should be added to ORBit2-sections.txt in the appropriate place.
=============================================================================
touch tmpl-build.stamp
*** Building XML ***
cd . && \
gtkdoc-mkdb --module=ORBit2 --source-dir=../../src/orb/orb-core --output-format=xml --expand-content-files="" --sgml-mode --output-format=xml
ERROR parsing comment block file : parameter expected -
 ../../src/orb/orb-core/corba-orb.c:710
20% symbol docs coverage (9 symbols documented, 1 symbols incomplete, 35 not documented)
See ORBit2-undocumented.txt for a list of missing docs.
The doc coverage percentage doesn't include intro sections.
touch sgml-build.stamp

*** Building HTML ***
rm -rf ./html
mkdir ./html
cd ./html && gtkdoc-mkhtml ORBit2 ../ORBit2-docs.sgml
XPath error : Undefined variable
compilation error: file file:///usr/share/sgml/docbook/xsl-stylesheets-1.68.1/html/autotoc.xsl line 550 element div
Attribute template class: failed to compile $titles
XPath error : Undefined variable
compilation error: file file:///usr/share/sgml/docbook/xsl-stylesheets-1.68.1/html/lists.xsl line 735 element ol
Attribute template type: failed to compile $numeration
XPath error : Undefined variable
compilation error: file file:///usr/share/sgml/docbook/xsl-stylesheets-1.68.1/html/callout.xsl line 158 element img
Attribute template src: failed to compile $callout.graphics.path
XPath error : Undefined variable
compilation error: file file:///usr/share/sgml/docbook/xsl-stylesheets-1.68.1/html/callout.xsl line 158 element img
Attribute template alt: failed to compile $conum
XPath error : Undefined variable
compilation error: file file:///usr/share/sgml/docbook/xsl-stylesheets-1.68.1/html/formal.xsl line 19 element div
Attribute template class: failed to compile $class
XPath error : Undefined variable
compilation error: file file:///usr/share/sgml/docbook/xsl-stylesheets-1.68.1/html/formal.xsl line 71 element div
Attribute template class: failed to compile $class
XPath error : Undefined variable
compilation error: file file:///usr/share/sgml/docbook/xsl-stylesheets-1.68.1/html/inline.xsl line 856 element a
Attribute template href: failed to compile $chunkbase
XPath error : Undefined variable
compilation error: file file:///usr/share/sgml/docbook/xsl-stylesheets-1.68.1/html/inline.xsl line 934 element code
Attribute template class: failed to compile $class
XPath error : Undefined variable
compilation error: file file:///usr/share/sgml/docbook/xsl-stylesheets-1.68.1/html/html.xsl line 24 element a
Attribute template name: failed to compile $id
XPath error : Undefined variable
compilation error: file file:///usr/share/sgml/docbook/xsl-stylesheets-1.68.1/html/index.xsl line 115 element a
Attribute template name: failed to compile $id
XPath error : Undefined variable
concat('ln-',$id,$html.ext)

compilation error: file file:///usr/share/sgml/docbook/xsl-stylesheets-1.68.1/html/titlepage.xsl line 475 element a
Attribute template href: failed to compile concat('ln-',$id,$html.ext)
XPath error : Undefined variable
compilation error: file file:///usr/share/sgml/docbook/xsl-stylesheets-1.68.1/html/titlepage.xsl line 502 element a
Attribute template name: failed to compile $id
XPath error : Undefined variable
compilation error: file file:///usr/share/sgml/docbook/xsl-stylesheets-1.68.1/html/titlepage.xsl line 780 element a
Attribute template name: failed to compile $id
XPath error : Undefined variable
compilation error: file file:///usr/share/sgml/docbook/xsl-stylesheets-1.68.1/html/docbook.xsl line 138 element base
Attribute template href: failed to compile $html.base
XPath error : Undefined variable
substring-before($stylesheets, ' ')
                             ^
compilation error: file file:///usr/share/sgml/docbook/xsl-stylesheets-1.68.1/html/docbook.xsl line 198 element link
Attribute template href: failed to compile substring-before($stylesheets, ' ')
XPath error : Undefined variable
substring-after($href,'#')

compilation error: file file:///usr/share/sgml/docbook/xsl-stylesheets-1.68.1/html/docbook.xsl line 431 element link
Attribute template linkend: failed to compile substring-after($href,'#')
XPath error : Undefined variable
compilation error: file /usr/share/gtk-doc/data/devhelp.xsl line 47 element book
Attribute template title: failed to compile $title
XPath error : Undefined variable
compilation error: file /usr/share/gtk-doc/data/devhelp.xsl line 47 element book
Attribute template author: failed to compile $author
XPath error : Undefined variable
compilation error: file /usr/share/gtk-doc/data/devhelp.xsl line 79 element sub
Attribute template name: failed to compile $title
XPath error : Undefined variable
compilation error: file /usr/share/gtk-doc/data/devhelp.xsl line 79 element sub
Attribute template link: failed to compile $target
XPath error : Undefined variable
compilation error: file /usr/share/gtk-doc/data/devhelp.xsl line 102 element function
Attribute template name: failed to compile $title
XPath error : Undefined variable
compilation error: file /usr/share/gtk-doc/data/devhelp.xsl line 102 element function
Attribute template link: failed to compile $target
XPath error : Undefined variable
compilation error: file /usr/share/gtk-doc/data/gtk-doc.xsl line 122 element meta
Attribute template content: failed to compile $gtkdoc.version
make[3]: *** [html-build.stamp] Error 5
make[3]: Leaving directory `/var/tmp/portage/orbit-2.12.4/work/ORBit2-2.12.4/docs/api'
make[2]: *** [all-recursive] Error 1
make[2]: Leaving directory `/var/tmp/portage/orbit-2.12.4/work/ORBit2-2.12.4/docs'
make[1]: *** [all-recursive] Error 1
make[1]: Leaving directory `/var/tmp/portage/orbit-2.12.4/work/ORBit2-2.12.4'
make: *** [all] Error 2


thanks for your help!
Back to top
View user's profile Send private message
crudh
l33t
l33t


Joined: 12 May 2005
Posts: 696
Location: Sundbyberg, Sweden

PostPosted: Tue Mar 07, 2006 9:16 pm    Post subject: Reply with quote

Don't know why it fails, but if you don't need the documentation try emergeing it with -doc.
Back to top
View user's profile Send private message
mark_alec
Bodhisattva
Bodhisattva


Joined: 11 Sep 2004
Posts: 6066
Location: Melbourne, Australia

PostPosted: Wed Mar 08, 2006 6:21 am    Post subject: Reply with quote

Moved from Portage & Programming to Duplicate Threads.

See https://forums.gentoo.org/viewtopic-t-379523.html
_________________
www.gentoo.org.au || #gentoo-au
Back to top
View user's profile Send private message
Display posts from previous:   
Reply to topic    Gentoo Forums Forum Index Duplicate Threads All times are GMT
Page 1 of 1

 
Jump to:  
You cannot post new topics in this forum
You cannot reply to topics in this forum
You cannot edit your posts in this forum
You cannot delete your posts in this forum
You cannot vote in polls in this forum