Gentoo Forums
Gentoo Forums
Gentoo Forums
Quick Search: in
amarok 1.4B3 doesn't compile
View unanswered posts
View posts from last 24 hours

 
Reply to topic    Gentoo Forums Forum Index Duplicate Threads
View previous topic :: View next topic  
Author Message
michael3
n00b
n00b


Joined: 17 Aug 2004
Posts: 34

PostPosted: Wed Apr 12, 2006 11:16 pm    Post subject: amarok 1.4B3 doesn't compile Reply with quote

Hello

I would like to install the new Amarok 1.4 Beta3 but it doesn't compile. I get this error Message. What can I do?

Code:
O_ASCII_CAST -DQT_NO_STL -DQT_NO_COMPAT -DQT_NO_TRANSLATION  -c -o collectionscanner.o `test -f 'collectionscanner.cpp' || echo './'`collectionscanner.cpp
/bin/sh ../../../libtool --silent --mode=link --tag=CXX i686-pc-linux-gnu-g++  -Wno-long-long -Wundef -ansi -D_XOPEN_SOURCE=500 -D_BSD_SOURCE -Wcast-align -Wconversion -Wchar-subscripts -Wall -W -Wpointer-arith -DNDEBUG -DNO_DEBUG -O2 -march=athlon-xp -pipe -O2 -fno-inline -Wformat-security -Wmissing-format-attribute -Wno-non-virtual-dtor -fno-exceptions -fno-check-new -fno-common -DQT_CLEAN_NAMESPACE -DQT_NO_ASCII_CAST -DQT_NO_STL -DQT_NO_COMPAT -DQT_NO_TRANSLATION    -o amarokcollectionscanner -L/usr/kde/3.5/lib -L/usr/qt/3/lib -L/usr/lib    -L/usr/kde/3.5/lib -R /usr/lib -R /usr/kde/3.5/lib -R /usr/qt/3/lib -R /usr/lib -R /usr/kde/3.5/lib main.o collectionscanner.o ../../../amarok/src/metadata/libmetadata.la ../../../amarok/src/libamarok.la -lqt-mt  -lz -lpng -lz -lm -lXext -lX11  -lSM -lICE -lpthread -lkdecore -L/usr/lib -ltag
make[4]: Leaving directory `/var/tmp/portage/amarok-1.4_beta3-r2/work/amarok-1.4-beta3c/amarok/src/collectionscanner'
make[3]: Leaving directory `/var/tmp/portage/amarok-1.4_beta3-r2/work/amarok-1.4-beta3c/amarok/src'
make[3]: Entering directory `/var/tmp/portage/amarok-1.4_beta3-r2/work/amarok-1.4-beta3c/amarok'
make[3]: Für das Ziel »all-am« ist nichts zu tun.
make[3]: Leaving directory `/var/tmp/portage/amarok-1.4_beta3-r2/work/amarok-1.4-beta3c/amarok'
make[2]: Leaving directory `/var/tmp/portage/amarok-1.4_beta3-r2/work/amarok-1.4-beta3c/amarok'
Making all in doc
make[2]: Entering directory `/var/tmp/portage/amarok-1.4_beta3-r2/work/amarok-1.4-beta3c/doc'
Making all in de
make[3]: Entering directory `/var/tmp/portage/amarok-1.4_beta3-r2/work/amarok-1.4-beta3c/doc/de'
/usr/kde/3.5/bin/meinproc --check --cache index.cache.bz2 ./index.docbook
XPath error : Undefined variable
compilation error: file /usr/kde/3.5/share/apps/ksgmltools2/docbook/xsl/html/autotoc.xsl line 544 element div
Attribute template class: failed to compile $titles
XPath error : Undefined variable
compilation error: file /usr/kde/3.5/share/apps/ksgmltools2/docbook/xsl/html/lists.xsl line 735 element ol
Attribute template type: failed to compile $numeration
XPath error : Undefined variable
compilation error: file /usr/kde/3.5/share/apps/ksgmltools2/docbook/xsl/html/callout.xsl line 158 element img
Attribute template src: failed to compile $callout.graphics.path
XPath error : Undefined variable
compilation error: file /usr/kde/3.5/share/apps/ksgmltools2/docbook/xsl/html/callout.xsl line 158 element img
Attribute template alt: failed to compile $conum
XPath error : Undefined variable
compilation error: file /usr/kde/3.5/share/apps/ksgmltools2/docbook/xsl/html/formal.xsl line 19 element div
Attribute template class: failed to compile $class
XPath error : Undefined variable
compilation error: file /usr/kde/3.5/share/apps/ksgmltools2/docbook/xsl/html/formal.xsl line 71 element div
Attribute template class: failed to compile $class
XPath error : Undefined variable
compilation error: file /usr/kde/3.5/share/apps/ksgmltools2/docbook/xsl/html/inline.xsl line 856 element a
Attribute template href: failed to compile $chunkbase
XPath error : Undefined variable
compilation error: file /usr/kde/3.5/share/apps/ksgmltools2/docbook/xsl/html/inline.xsl line 934 element code
Attribute template class: failed to compile $class
XPath error : Undefined variable
compilation error: file /usr/kde/3.5/share/apps/ksgmltools2/docbook/xsl/html/html.xsl line 24 element a
Attribute template name: failed to compile $id
XPath error : Undefined variable
compilation error: file /usr/kde/3.5/share/apps/ksgmltools2/docbook/xsl/html/index.xsl line 115 element a
Attribute template name: failed to compile $id
XPath error : Undefined variable
concat('ln-',$id,$html.ext)
                ^
compilation error: file /usr/kde/3.5/share/apps/ksgmltools2/docbook/xsl/html/titlepage.xsl line 475 element a
Attribute template href: failed to compile concat('ln-',$id,$html.ext)
XPath error : Undefined variable
compilation error: file /usr/kde/3.5/share/apps/ksgmltools2/docbook/xsl/html/titlepage.xsl line 502 element a
Attribute template name: failed to compile $id
XPath error : Undefined variable
compilation error: file /usr/kde/3.5/share/apps/ksgmltools2/docbook/xsl/html/titlepage.xsl line 780 element a
Attribute template name: failed to compile $id
XPath error : Undefined variable
compilation error: file /usr/kde/3.5/share/apps/ksgmltools2/docbook/xsl/html/docbook.xsl line 137 element base
Attribute template href: failed to compile $html.base
XPath error : Undefined variable
substring-before($stylesheets, ' ')
                             ^
compilation error: file /usr/kde/3.5/share/apps/ksgmltools2/docbook/xsl/html/docbook.xsl line 197 element link
Attribute template href: failed to compile substring-before($stylesheets, ' ')
XPath error : Undefined variable
compilation error: file /usr/kde/3.5/share/apps/ksgmltools2/customization/kde-navig.xsl line 43 element div
Attribute template style: failed to compile $kde.common
XPath error : Undefined variable
compilation error: file /usr/kde/3.5/share/apps/ksgmltools2/customization/kde-navig.xsl line 47 element img
Attribute template src: failed to compile $kde.common
XPath error : Undefined variable
compilation error: file /usr/kde/3.5/share/apps/ksgmltools2/customization/kde-navig.xsl line 195 element div
Attribute template style: failed to compile $kde.common
XPath error : Undefined variable
compilation error: file /usr/kde/3.5/share/apps/ksgmltools2/customization/kde-navig.xsl line 198 element img
Attribute template src: failed to compile $kde.common
XPath error : Undefined variable
compilation error: file /usr/kde/3.5/share/apps/ksgmltools2/customization/kde-navig.xsl line 201 element img
Attribute template src: failed to compile $kde.common
unable to parse ./index.docbook
make[3]: *** [index.cache.bz2] Fehler 1
make[3]: Leaving directory `/var/tmp/portage/amarok-1.4_beta3-r2/work/amarok-1.4-beta3c/doc/de'
make[2]: *** [all-recursive] Fehler 1
make[2]: Leaving directory `/var/tmp/portage/amarok-1.4_beta3-r2/work/amarok-1.4-beta3c/doc'
make[1]: *** [all-recursive] Fehler 1
make[1]: Leaving directory `/var/tmp/portage/amarok-1.4_beta3-r2/work/amarok-1.4-beta3c'
make: *** [all] Fehler 2


Code:
[ebuild  N    ] media-sound/amarok-1.4_beta3-r2  +aac -arts -debug -exscalibar +flac +gstreamer -ifp -ipod +kde +musicbrainz -mysql -noamazon +opengl -postgres +real +visualization -xinerama +xmms 0 kB


Code:
Portage 2.0.53 (default-linux/x86/2005.0, gcc-3.3.4, glibc-2.3.4.20041102-r1, 2.6.12y i686)
=================================================================
System uname: 2.6.12y i686 AMD Athlon(tm) XP 2800+
Gentoo Base System version 1.4.16
dev-lang/python:     2.3.5, 2.4.2
sys-apps/sandbox:    1.2.12
sys-devel/autoconf:  2.13, 2.59-r6
sys-devel/automake:  1.4_p6, 1.5, 1.6.3, 1.7.9-r1, 1.8.5-r3, 1.9.6-r1
sys-devel/binutils:  2.15.92.0.2-r7
sys-devel/libtool:   1.5.16
virtual/os-headers:  2.6.8.1-r2
ACCEPT_KEYWORDS="x86"
AUTOCLEAN="yes"
CBUILD="i686-pc-linux-gnu"
CFLAGS="-march=athlon-xp -pipe -O2"
CHOST="i686-pc-linux-gnu"
CONFIG_PROTECT="/etc /usr/kde/2/share/config /usr/kde/3/share/config /usr/share/config /var/qmail/control"
CONFIG_PROTECT_MASK="/etc/eselect/compiler /etc/gconf /etc/env.d"
CXXFLAGS="-march=athlon-xp -pipe -O2"
DISTDIR="/usr/portage/distfiles"
FEATURES="autoconfig distlocks sandbox sfperms strict"
GENTOO_MIRRORS="http://130.59.10.35/mirror/gentoo/"
LC_ALL="de_DE"
LINGUAS="de"
MAKEOPTS="-j2"
PKGDIR="/usr/portage/packages"
PORTAGE_TMPDIR="/var/tmp"
PORTDIR="/usr/portage"
PORTDIR_OVERLAY="/usr/local/portage"
SYNC="rsync://rsync.de.gentoo.org/gentoo-portage"
USE="x86 X aac aalib acpi apm audiofile avi bash-completion berkdb bitmap-fonts bzip2 bzlib cdb cddb cdparanoia cdr codecs crypt cups curl directfb divx4linux dri dvd dvdr eds emboss encode esd ethereal exif expat fam ffmpeg flac foomaticdb fortran ftp fusion gd gdbm gif glut gmp gphoto2 gpm gstreamer gtk gtk2 idn imagemagick imlib ipv6 isdnlog java jpeg junit kde lcms libg++ libwww lm_sensors logitech-mouse mad mhash mikmod mng moodbar motif mozilla mozsvg mp3 mpeg musicbrainz mysql ncurses nls nptl nvidia ogg oggvorbis openal opengl oss pam pcre pdflib perl png pppd python qt quicktime radeon readline real recode ruby samba sdl slang spell sqlite ssl svg svga tcltk tcpd theora tiff truetype truetype-fonts type1-fonts udev unicode usb visualization vorbis win32codecs xine xml xml2 xmms xv xvid zlib linguas_de userland_GNU kernel_linux elibc_glibc"
Unset:  ASFLAGS, CTARGET, INSTALL_MASK, LANG, LDFLAGS
Back to top
View user's profile Send private message
mark_alec
Bodhisattva
Bodhisattva


Joined: 11 Sep 2004
Posts: 6066
Location: Melbourne, Australia

PostPosted: Thu Apr 13, 2006 4:32 am    Post subject: Reply with quote

Moved from Multimedia to Duplicate Threads.

See https://forums.gentoo.org/viewtopic-t-379523.html
Back to top
View user's profile Send private message
Display posts from previous:   
Reply to topic    Gentoo Forums Forum Index Duplicate Threads All times are GMT
Page 1 of 1

 
Jump to:  
You cannot post new topics in this forum
You cannot reply to topics in this forum
You cannot edit your posts in this forum
You cannot delete your posts in this forum
You cannot vote in polls in this forum