Gentoo Forums
Gentoo Forums
Gentoo Forums
Quick Search: in
openmotif 2.2.3-r9 compile errors
View unanswered posts
View posts from last 24 hours

 
Reply to topic    Gentoo Forums Forum Index Gentoo on PPC
View previous topic :: View next topic  
Author Message
goku8499
n00b
n00b


Joined: 20 Feb 2004
Posts: 22

PostPosted: Fri Jun 30, 2006 5:43 am    Post subject: openmotif 2.2.3-r9 compile errors Reply with quote

Hello i am tring to upgrade to Xorg 7.0-r1 and i keep getting this

Quote:
In file included from XmStrDefs.c:10:
../Xm/Xm.h:59:34: X11/extensions/Print.h: No such file or directory
In file included from XmStrDefs.c:10:
../Xm/Xm.h:827: error: parse error before "XPContext"
../Xm/Xm.h:827: warning: no semicolon at end of struct or union
../Xm/Xm.h:830: error: parse error before '}' token
../Xm/Xm.h:830: warning: type defaults to 'int' in declaration of 'XmPrintShellCallbackStruct'
../Xm/Xm.h:830: warning: data definition has no type or storage class
make[3]: *** [XmStrDefs.lo] Error 1
make[3]: Leaving directory '/var/tmp/portage/openmotif-2.2.3-r9/work/openMotif-2.2.3/lib/Xm'
make[2]: *** [all] Error 2
make[2]: Leaving directory '/var/tmp/portage/openmotif-2.2.3-r9/work/openMotif-2.2.3/lib/Xm'
make[1]: *** [all-recursive] Error 1
make[1]: Leaving director '/var/tmp/portage/openmotif-2.2.3-r9/work/openMotif-2.2.3/lib'
make: *** [al=recursive] Error 1
!!! ERROR: x11-libs/openmotif-2.2.3-r9 failed.
Call Stack:
ebuild.sh, line 1539: Called dyn_compile
ebuild.sh, line 939: Called src_compile
openmotif-2.2.3-r9.ebuild, line 84: Called die

!!! make failed, if you have lesstif installed remove it, compile openmotif and recompile lesstif
!!! If you need support, post the topmost build error, and the call stack if relevant


Just wondering what to do now? thanks in advance.
Back to top
View user's profile Send private message
Philantrop
Retired Dev
Retired Dev


Joined: 21 Dec 2004
Posts: 1129
Location: Germany

PostPosted: Fri Jun 30, 2006 5:53 am    Post subject: Reply with quote

Try emerging x11-proto/printproto.
_________________
If you feel the issues discussed in this thread have been resolved, please add a "[Solved]" to the subject of your original posting.
Back to top
View user's profile Send private message
fb
l33t
l33t


Joined: 08 Dec 2003
Posts: 636
Location: New Zealand

PostPosted: Fri Jun 30, 2006 9:06 am    Post subject: Reply with quote

If you emerged Xorg-x11 7.x you probably can't compile open motif
with it. This is a known issue and I think it is still unresolved.
Diego Peteno of the dev team mentionned the other day in his blog
that he was looking at it.
This is also in the gentoo wiki:
Code:
Note: At this point, given that OpenMotif does not compile against xorg-x11-7.x, you should do emerge -DuNav openmotif (if you want to use OpenMotif) and then continue with this howto. If not, set the -motif USE flag.


Look at HOWTO_Modular_Xorg in the gentoo wiki.
Back to top
View user's profile Send private message
AJM
Tux's lil' helper
Tux's lil' helper


Joined: 25 Sep 2002
Posts: 99
Location: Aberdeen, Scotland

PostPosted: Fri Jun 30, 2006 1:58 pm    Post subject: Re: openmotif 2.2.3-r9 compile errors Reply with quote

goku8499 wrote:
Hello i am tring to upgrade to Xorg 7.0-r1 and i keep getting this

Quote:

make[3]: Leaving directory '/var/tmp/portage/openmotif-2.2.3-r9/work/openMotif-2.2.3/lib/Xm'
make[2]: *** [all] Error 2
make[2]: Leaving directory '/var/tmp/portage/openmotif-2.2.3-r9/work/openMotif-2.2.3/lib/Xm'
make[1]: *** [all-recursive] Error 1
make[1]: Leaving director '/var/tmp/portage/openmotif-2.2.3-r9/work/openMotif-2.2.3/lib'
make: *** [al=recursive] Error 1
!!! ERROR: x11-libs/openmotif-2.2.3-r9 failed.
Call Stack:
ebuild.sh, line 1539: Called dyn_compile
ebuild.sh, line 939: Called src_compile
openmotif-2.2.3-r9.ebuild, line 84: Called die

Just wondering what to do now? thanks in advance.


Emerging libXp and xbitmaps first resolved the problem here...

AJ
Back to top
View user's profile Send private message
Bokke
n00b
n00b


Joined: 05 Jul 2006
Posts: 1

PostPosted: Wed Jul 05, 2006 11:48 pm    Post subject: Re: openmotif 2.2.3-r9 compile errors Reply with quote

AJM wrote:
goku8499 wrote:
Hello i am tring to upgrade to Xorg 7.0-r1 and i keep getting this

Quote:

make[3]: Leaving directory '/var/tmp/portage/openmotif-2.2.3-r9/work/openMotif-2.2.3/lib/Xm'
make[2]: *** [all] Error 2
make[2]: Leaving directory '/var/tmp/portage/openmotif-2.2.3-r9/work/openMotif-2.2.3/lib/Xm'
make[1]: *** [all-recursive] Error 1
make[1]: Leaving director '/var/tmp/portage/openmotif-2.2.3-r9/work/openMotif-2.2.3/lib'
make: *** [al=recursive] Error 1
!!! ERROR: x11-libs/openmotif-2.2.3-r9 failed.
Call Stack:
ebuild.sh, line 1539: Called dyn_compile
ebuild.sh, line 939: Called src_compile
openmotif-2.2.3-r9.ebuild, line 84: Called die

Just wondering what to do now? thanks in advance.


Emerging libXp and xbitmaps first resolved the problem here...

AJ


This works for me to
Back to top
View user's profile Send private message
mike_nl
n00b
n00b


Joined: 16 Nov 2005
Posts: 7
Location: The Netherlands

PostPosted: Fri Jul 07, 2006 7:59 pm    Post subject: Reply with quote

That's rock. After merging the two libs, openmotiv is merged without errors.

Greetings,

Mike
_________________
Everything is possible, only our mind stops us sometimes, everytime, the whole time?
Back to top
View user's profile Send private message
Display posts from previous:   
Reply to topic    Gentoo Forums Forum Index Gentoo on PPC All times are GMT
Page 1 of 1

 
Jump to:  
You cannot post new topics in this forum
You cannot reply to topics in this forum
You cannot edit your posts in this forum
You cannot delete your posts in this forum
You cannot vote in polls in this forum