Gentoo Forums
Gentoo Forums
Gentoo Forums
Quick Search: in
"compile failed"
View unanswered posts
View posts from last 24 hours

 
Reply to topic    Gentoo Forums Forum Index Gentoo on PPC
View previous topic :: View next topic  
Author Message
sdidier
n00b
n00b


Joined: 23 May 2004
Posts: 46
Location: Idaho, USA

PostPosted: Thu Feb 07, 2008 7:10 am    Post subject: "compile failed" Reply with quote

Hi I have been trying to compile gnome on an external firewire drive connected to my TiPowerbook. I have been unable to get past compiling x11-libs-gtk+-2.12.5-r1.
ERROR : X11-libs/gtk+-2.12.5-r1 failed.
Call stack:
ebuild.sh, line 1701: called dyn_compile
ebuild.sh, line 1039: called qa_call 'src_compile'
ebuild.sh, line 44: called src_compile
gtk+-2.12.5-r1.ebuild, line 111: Called die

the specific snippet of code:
emake:: die "compile failed"


Can anyone advise on what I need to do to move forward? I have a working 2.6.23-r3 install at the shell but would like to end up with a functional GUI

Thanks,
Steve
_________________
Steve Didier
Back to top
View user's profile Send private message
mjf55
Guru
Guru


Joined: 25 Aug 2007
Posts: 372

PostPosted: Thu Feb 07, 2008 7:23 am    Post subject: Reply with quote

Please post about 10-15 line before the ERROR line you posted. We should be able to see what is happening.
_________________
Mark
No longer a n00b, but still a 'Kool Kid' wannabe
Back to top
View user's profile Send private message
sdidier
n00b
n00b


Joined: 23 May 2004
Posts: 46
Location: Idaho, USA

PostPosted: Wed Mar 05, 2008 4:15 am    Post subject: Reply with quote

thanks for the reply. Sorry for the delay in getting back to this thread I have been away!
the lines before the make error are as follows: /var/tmp/portage/x11-libs/gtk+-2.12.5-r1/work/gtk+-2.12.5/gtk/.libs/lt-gtk-query-immodules-2.0: error while loading shared libraries: libexpt.so.0:cannot open shared object file: No such file or directory
make[3]: *** [gtk.immodules] Error 127
make[3]: Leaving directory `/var/tmp/portage/x11-libs/gtk+-2.12.5-r1/work/gtk+-2.12.5/modules/input'
make[2]: *** [all-recursive] error1
make[2]: Leaving `/var/tmp/portage/x11-libs/gtk+-2.12.5-r1/work/gtk+-2.12.5/modules'
make[1]: *** [all-recursive] error1
make[1]: Leaving `/var/tmp/portage/x11-libs/gtk+-2.12.5-r1/work/gtk+-2.12.5'
make: *** [all] Error 2
ERROR : X11-libs/gtk+-2.12.5-r1 failed.
Call stack:
ebuild.sh, line 1701: called dyn_compile
ebuild.sh, line 1039: called qa_call 'src_compile'
ebuild.sh, line 44: called src_compile
gtk+-2.12.5-r1.ebuild, line 111: Called die

Thanks in advance for the help
Steve
_________________
Steve Didier
Back to top
View user's profile Send private message
JoseJX
Retired Dev
Retired Dev


Joined: 28 Apr 2002
Posts: 2774

PostPosted: Wed Mar 05, 2008 6:01 am    Post subject: Reply with quote

You've upgraded expat without running revdep-rebuild. Do that first and everything else should work fine.
_________________
Gentoo PPC FAQ: http://www.gentoo.org/doc/en/gentoo-ppc-faq.xml
Back to top
View user's profile Send private message
sdidier
n00b
n00b


Joined: 23 May 2004
Posts: 46
Location: Idaho, USA

PostPosted: Thu Mar 06, 2008 2:25 am    Post subject: Reply with quote

Thank you JoseJX, myTiBook has been happily churning away compiling the source code for gnome.

Steve Didier
_________________
Steve Didier
Back to top
View user's profile Send private message
Display posts from previous:   
Reply to topic    Gentoo Forums Forum Index Gentoo on PPC All times are GMT
Page 1 of 1

 
Jump to:  
You cannot post new topics in this forum
You cannot reply to topics in this forum
You cannot edit your posts in this forum
You cannot delete your posts in this forum
You cannot vote in polls in this forum