Gentoo Forums
Gentoo Forums
Gentoo Forums
Quick Search: in
KDE4 Overlay (Part 6)
View unanswered posts
View posts from last 24 hours

Goto page Previous  1, 2, 3 ... 23, 24, 25, 26, 27, 28  Next  
This topic is locked: you cannot edit posts or make replies.    Gentoo Forums Forum Index Unsupported Software
View previous topic :: View next topic  
Author Message
enzobelmont
Guru
Guru


Joined: 06 Apr 2004
Posts: 345
Location: Chiapas, Mexico

PostPosted: Thu Aug 28, 2008 7:31 pm    Post subject: Reply with quote

i'm trying superkaramba but some themes ask for kross any idea???
_________________
Mens sana in corpore sano... Gentoo laetificat cor hominis
Back to top
View user's profile Send private message
beso_1717
Apprentice
Apprentice


Joined: 19 Jul 2007
Posts: 263

PostPosted: Thu Aug 28, 2008 7:59 pm    Post subject: Reply with quote

enzobelmont wrote:
i'm trying superkaramba but some themes ask for kross any idea???


for what i know kross is already inside kdebindings and shoulf be compiled there. without it amarok scripts wouldn't work...
Back to top
View user's profile Send private message
gimpel
Advocate
Advocate


Joined: 15 Oct 2004
Posts: 2720
Location: Munich, Bavaria

PostPosted: Thu Aug 28, 2008 8:07 pm    Post subject: Reply with quote

For superkaramba you'll need at least krosspython.


Does anyone know how to activate panel audohiding as long the config GUI for that isn't there yet?
I tried setting autohide=1 in plasma-appletsrc in general section of the panel config, but that has no effect.
_________________
http://proaudio.tuxfamily.org/wiki - pro-audio software overlay
Back to top
View user's profile Send private message
enzobelmont
Guru
Guru


Joined: 06 Apr 2004
Posts: 345
Location: Chiapas, Mexico

PostPosted: Thu Aug 28, 2008 8:10 pm    Post subject: Reply with quote

beso_1717 wrote:
enzobelmont wrote:
i'm trying superkaramba but some themes ask for kross any idea???


for what i know kross is already inside kdebindings and shoulf be compiled there. without it amarok scripts wouldn't work...


content of kdebindings-scm-conf
Code:
?: kde-base/krosspython:kde-svn
?: kde-base/krossruby:kde-svn
?: kde-base/pykde4:kde-svn


thanks.
_________________
Mens sana in corpore sano... Gentoo laetificat cor hominis
Back to top
View user's profile Send private message
Stefano Crocco
Apprentice
Apprentice


Joined: 28 Sep 2006
Posts: 157

PostPosted: Fri Aug 29, 2008 6:28 am    Post subject: Reply with quote

Since some weeks ago, kde 3 applications used with kde 4 seem not to be able to find their icons anymore, since they're all replaced by the unknown icon everywhere (toolbars, taskbar, system tray). I can't understand what's happened, since they used to work correctly. I checked the KDEDIRS environment variable and it seems correct: /usr:/usr/local:/usr/kde/svn:/usr/kde/3.5. Has anyone else experienced this behaviour? Can someone give me some hints in how to solve this problem?

Thanks
_________________
Stefano
Back to top
View user's profile Send private message
invsblduck
n00b
n00b


Joined: 29 Aug 2008
Posts: 1
Location: Santa Barbara, CA

PostPosted: Fri Aug 29, 2008 8:16 pm    Post subject: Reply with quote

Stefano Crocco wrote:

At any rate, today I succeeded to compile konqueror by changing the following files:

  • /var/paludis/distfiles/svn-src/KDE/kdebase/kdebase/apps/konqueror/sidebar/trees/bookmark_module/CMakeLists.txt
  • /var/paludis/distfiles/svn-src/KDE/kdebase/kdebase/apps/konqueror/sidebar/trees/dirtree_module/CMakeLists.txt
  • /var/paludis/distfiles/svn-src/KDE/kdebase/kdebase/apps/konqueror/sidebar/trees/history_module/CMakeLists.txt



This worked!!

But I also had to update /var/paludis/distfiles/svn-src/KDE/kdebase/kdebase/apps/konqueror/sidebar/trees/CMakeLists.txt (the top-level cmake file in the .../sidebar/trees/ directory).

Thanks a lot for the tip. :D
Back to top
View user's profile Send private message
Drantin
n00b
n00b


Joined: 11 Feb 2004
Posts: 9

PostPosted: Sun Aug 31, 2008 10:51 pm    Post subject: konqueror Reply with quote

Thanks, Stefano Crocco, and invsblduck, using that info I was able to make a patch that got committed, so building konqueror works now.
Back to top
View user's profile Send private message
tarsinionhh
n00b
n00b


Joined: 01 Sep 2008
Posts: 1

PostPosted: Mon Sep 01, 2008 3:12 pm    Post subject: step comile failed Reply with quote

Hello,
i tried to install kde-svn with paludis and it stops everytime when compiling step. Anybody can help?

----------------------------------------------------------------------------
-- The following external packages were located on your system.
-- This installation will have the extra features provided by these packages.
+ Gmm++
+ Qalculate
+ GSL
Congratulations! All external packages have been found.
-----------------------------------------------------------------------------

-- Configuring done
-- Generating done
-- Build files have been written to: /var/tmp/paludis/kde-base-step-scm/work/step_build
make -j3
Scanning dependencies of target stepcore
[ 1%] Building CXX object step/stepcore/CMakeFiles/stepcore.dir/stepcore_automoc.o
[ 5%] [ 5%] [ 7%] Building CXX object step/stepcore/CMakeFiles/stepcore.dir/object.o
Building CXX object step/stepcore/CMakeFiles/stepcore.dir/constants.o
Building CXX object step/stepcore/CMakeFiles/stepcore.dir/world.o
[ 9%] Building CXX object step/stepcore/CMakeFiles/stepcore.dir/solver.o
[ 11%] Building CXX object step/stepcore/CMakeFiles/stepcore.dir/collisionsolver.o
[ 13%] Building CXX object step/stepcore/CMakeFiles/stepcore.dir/constraintsolver.o
/var/tmp/paludis/kde-base-step-scm/work/step/step/stepcore/collisionsolver.cc: In member function 'virtual int StepCore::GJKCollisionSolver::solveCollisions(StepCore::BodyList&)':
/var/tmp/paludis/kde-base-step-scm/work/step/step/stepcore/collisionsolver.cc:1192: warning: suggest braces around empty body in an 'else' statement
/var/tmp/paludis/kde-base-step-scm/work/step/step/stepcore/collisionsolver.cc: In member function 'int StepCore::GJKCollisionSolver::checkPolygonParticle(StepCore::Contact*)':
/var/tmp/paludis/kde-base-step-scm/work/step/step/stepcore/collisionsolver.cc:564: warning: 'si' may be used uninitialized in this function
[ 15%] Building CXX object step/stepcore/CMakeFiles/stepcore.dir/factory.o
[ 16%] Building CXX object step/stepcore/CMakeFiles/stepcore.dir/xmlfile.o
[ 18%] Building CXX object step/stepcore/CMakeFiles/stepcore.dir/particle.o
[ 20%] Building CXX object step/stepcore/CMakeFiles/stepcore.dir/rigidbody.o
[ 22%] Building CXX object step/stepcore/CMakeFiles/stepcore.dir/gas.o
[ 24%] Building CXX object step/stepcore/CMakeFiles/stepcore.dir/softbody.o
[ 26%] Building CXX object step/stepcore/CMakeFiles/stepcore.dir/gravitation.o
[ 28%] Building CXX object step/stepcore/CMakeFiles/stepcore.dir/coulombforce.o
[ 30%] Building CXX object step/stepcore/CMakeFiles/stepcore.dir/spring.o
/var/tmp/paludis/kde-base-step-scm/work/step/step/stepcore/spring.cc:191:2: warning: #warning variance calculation for spring connected to rigidbody is not finished !
/var/tmp/paludis/kde-base-step-scm/work/step/step/stepcore/spring.cc:192:2: warning: #warning consider unification of some part of Particle and RigidBody
[ 32%] Building CXX object step/stepcore/CMakeFiles/stepcore.dir/motor.o
[ 33%] Building CXX object step/stepcore/CMakeFiles/stepcore.dir/joint.o
/var/tmp/paludis/kde-base-step-scm/work/step/step/stepcore/motor.cc:47: warning: unused parameter 'calcVariances'
/var/tmp/paludis/kde-base-step-scm/work/step/step/stepcore/motor.cc:108: warning: unused parameter 'calcVariances'
[ 35%] Building CXX object step/stepcore/CMakeFiles/stepcore.dir/eulersolver.o
[ 37%] Building CXX object step/stepcore/CMakeFiles/stepcore.dir/tool.o
[ 39%] Building CXX object step/stepcore/CMakeFiles/stepcore.dir/gslsolver.o
/var/tmp/paludis/kde-base-step-scm/work/step/step/stepcore/gslsolver.cc:129: warning: unused parameter 'yvar'
Linking CXX static library ../../lib/libstepcore.a
[ 39%] Built target stepcore
[ 41%] [ 43%] Generating settings.h, settings.cpp
Generating ui_create_gas_particles.h
[ 45%] Generating ui_create_softbody_items.h
Generating mainwindow.moc
[ 47%] Generating ui_configure_graph.h
[ 49%] Generating ui_configure_meter.h
[ 50%] [ 52%] Generating ui_configure_controller.h
Generating ui_configure_step_general.h
Generating worldbrowser.moc
Generating infobrowser.moc
Generating simulationthread.moc
Generating itempalette.moc
Generating worldmodel.moc
Generating toolgraphics.moc
Generating worldscene.moc
Generating gasgraphics.moc
Generating propertiesbrowser.moc
Generating undobrowser.moc
Generating softbodygraphics.moc
Generating moc_messageframe.cpp
Generating moc_polygongraphics.cpp
Generating moc_worldgraphics.cpp
Scanning dependencies of target step
[ 54%] Building CXX object step/step/CMakeFiles/step.dir/mainwindow.o
[ 56%] Building CXX object step/step/CMakeFiles/step.dir/worldmodel.o
[ 58%] Building CXX object step/step/CMakeFiles/step.dir/worldscene.o
/var/tmp/paludis/kde-base-step-scm/work/step/step/step/worldscene.cc:133:6: warning: #warning TODO: measure what index method is faster
/var/tmp/paludis/kde-base-step-scm/work/step/step/step/worldscene.cc:568:6: warning: #warning Check paint() for all items to preserve painter state
/var/tmp/paludis/kde-base-step-scm/work/step/step/step/worldscene.cc:569:6: warning: #warning Use NoViewportUpdate and manual updating here !
/var/tmp/paludis/kde-base-step-scm/work/step/step/step/worldmodel.cc: In member function 'QString WorldModel::formatProperty(const StepCore::Object*, const StepCore::Object*, const StepCore::MetaProperty*, QFlags<WorldModel::FormatFlag>) const':
/var/tmp/paludis/kde-base-step-scm/work/step/step/step/worldmodel.cc:733: warning: suggest explicit braces to avoid ambiguous 'else'
[ 60%] Building CXX object step/step/CMakeFiles/step.dir/worldgraphics.o
/var/tmp/paludis/kde-base-step-scm/work/step/step/step/worldgraphics.cc:75:2: warning: #warning Do not add item until it is fully created
[ 62%] Building CXX object step/step/CMakeFiles/step.dir/worldbrowser.o
[ 64%] Building CXX object step/step/CMakeFiles/step.dir/propertiesbrowser.o
/var/tmp/paludis/kde-base-step-scm/work/step/step/step/propertiesbrowser.cc:243:2: warning: #warning XXX: add error information for lists
[ 66%] Building CXX object step/step/CMakeFiles/step.dir/infobrowser.o
/var/tmp/paludis/kde-base-step-scm/work/step/step/step/propertiesbrowser.cc:744: warning: unused parameter 'parent'
/var/tmp/paludis/kde-base-step-scm/work/step/step/step/propertiesbrowser.cc:744: warning: unused parameter 'start'
/var/tmp/paludis/kde-base-step-scm/work/step/step/step/propertiesbrowser.cc:744: warning: unused parameter 'end'
[ 67%] Building CXX object step/step/CMakeFiles/step.dir/undobrowser.o
[ 69%] Building CXX object step/step/CMakeFiles/step.dir/itempalette.o
[ 71%] Building CXX object step/step/CMakeFiles/step.dir/worldfactory.o
[ 73%] Building CXX object step/step/CMakeFiles/step.dir/particlegraphics.o
[ 75%] Building CXX object step/step/CMakeFiles/step.dir/polygongraphics.o
[ 77%] Building CXX object step/step/CMakeFiles/step.dir/gasgraphics.o
/var/tmp/paludis/kde-base-step-scm/work/step/step/step/gasgraphics.cc:203:2: warning: #warning Consider renaming measureRectCenter to position
[ 79%] Building CXX object step/step/CMakeFiles/step.dir/softbodygraphics.o
[ 81%] Building CXX object step/step/CMakeFiles/step.dir/springgraphics.o
[ 83%] Building CXX object step/step/CMakeFiles/step.dir/motorgraphics.o
[ 84%] Building CXX object step/step/CMakeFiles/step.dir/jointgraphics.o
[ 86%] Building CXX object step/step/CMakeFiles/step.dir/toolgraphics.o
/var/tmp/paludis/kde-base-step-scm/work/step/step/step/toolgraphics.cc:414:2: warning: #warning Select right icon here
/var/tmp/paludis/kde-base-step-scm/work/step/step/step/toolgraphics.cc:611:2: warning: #warning Strange, the following line does nothing !
[ 88%] Building CXX object step/step/CMakeFiles/step.dir/simulationthread.o
[ 90%] Building CXX object step/step/CMakeFiles/step.dir/unitscalc.o
In file included from /usr/lib/gcc/i686-pc-linux-gnu/4.3.1/include/g++-v4/ext/hash_map:64,
from /usr/include/libqalculate/includes.h:40,
from /usr/include/libqalculate/qalculate.h:15,
from /var/tmp/paludis/kde-base-step-scm/work/step/step/step/unitscalc.cc:23:
/usr/lib/gcc/i686-pc-linux-gnu/4.3.1/include/g++-v4/backward/backward_warning.h:32:2: warning: #warning This file includes at least one deprecated or antiquated header which may be removed without further notice at a future date. Please use a non-deprecated interface with equivalent functionality instead. For a listing of replacement headers and interfaces, consult the file backward_warning.h. To disable this warning use -Wno-deprecated.
[ 92%] Building CXX object step/step/CMakeFiles/step.dir/latexformula.o
[ 94%] Building CXX object step/step/CMakeFiles/step.dir/messageframe.o
[ 96%] Building CXX object step/step/CMakeFiles/step.dir/main.o
[ 98%] Building CXX object step/step/CMakeFiles/step.dir/settings.o
[100%] Building CXX object step/step/CMakeFiles/step.dir/step_automoc.o
Linking CXX executable step
CMakeFiles/step.dir/unitscalc.o: In function `global constructors keyed to _ZN9UnitsCalc4selfEv':
unitscalc.cc:(.text+0x26f): undefined reference to `cl_module__cl_random_def__globalctors'
unitscalc.cc:(.text+0x29e): undefined reference to `cl_module__cl_prin_globals__globalctors'
unitscalc.cc:(.text+0x2a3): undefined reference to `cl_module__cl_st_null__globalctors'
unitscalc.cc:(.text+0x2a9): undefined reference to `cl_module__cl_symbol__globalctors'
unitscalc.cc:(.text+0x2b1): undefined reference to `cl_module__cl_no_ring__globalctors'
unitscalc.cc:(.text+0x2c7): undefined reference to `cl_module__cl_FF_globals__globalctors'
unitscalc.cc:(.text+0x2d1): undefined reference to `cl_module__cl_DF_globals__globalctors'
unitscalc.cc:(.text+0x2d9): undefined reference to `cl_module__cl_LF_globals__globalctors'
unitscalc.cc:(.text+0x2e1): undefined reference to `cl_module__cl_ieee__globalctors'
unitscalc.cc:(.text+0x2f2): undefined reference to `cl_module__cl_ieee__globalctors'
unitscalc.cc:(.text+0x2f7): undefined reference to `cl_module__cl_ieee__globalctors'
unitscalc.cc:(.text+0x301): undefined reference to `cl_module__cl_MI__globalctors'
unitscalc.cc:(.text+0x309): undefined reference to `cl_module__cl_MI__globalctors'
unitscalc.cc:(.text+0x311): undefined reference to `cl_module__cl_GV_number__globalctors'
unitscalc.cc:(.text+0x319): undefined reference to `cl_module__cl_GV_I__globalctors'
unitscalc.cc:(.text+0x321): undefined reference to `cl_module__cl_SV_number__globalctors'
unitscalc.cc:(.text+0x329): undefined reference to `cl_module__cl_SV_ringelt__globalctors'
unitscalc.cc:(.text+0x331): undefined reference to `cl_module__cl_UP__globalctors'
unitscalc.cc:(.text+0x339): undefined reference to `cl_module__cl_UP_no_ring__globalctors'
unitscalc.cc:(.text+0x341): undefined reference to `cl_module__cl_C_ring__globalctors'
unitscalc.cc:(.text+0x349): undefined reference to `cl_module__cl_R_ring__globalctors'
unitscalc.cc:(.text+0x351): undefined reference to `cl_module__cl_RA_ring__globalctors'
unitscalc.cc:(.text+0x359): undefined reference to `cl_module__cl_I_ring__globalctors'
collect2: ld returned 1 exit status
make[2]: *** [step/step/step] Error 1
make[1]: *** [step/step/CMakeFiles/step.dir/all] Error 2
make: *** [all] Error 2
/usr/local/libexec/paludis/utils/emake: emake returned error 2

!!! ERROR in kde-base/step-scm:
!!! In cmake-utils_src_make at line 1124
!!! Make failed!

!!! Call stack:
!!! * cmake-utils_src_make (/var/tmp/paludis/kde-base-step-scm/temp/loadsaveenv:1124)
!!! * kde4-base_src_make (/var/tmp/paludis/kde-base-step-scm/temp/loadsaveenv:3116)
!!! * kde4-meta_src_make (/var/tmp/paludis/kde-base-step-scm/temp/loadsaveenv:3406)
!!! * kde4-meta_src_compile (/var/tmp/paludis/kde-base-step-scm/temp/loadsaveenv:3357)
!!! * src_compile (/var/tmp/paludis/kde-base-step-scm/temp/loadsaveenv:4325)
!!! * ebuild_f_compile (/usr/local/libexec/paludis/1/src_compile.bash:49)
!!! * ebuild_main (/usr/local/libexec/paludis/ebuild.bash:463)
!!! * main (/usr/local/libexec/paludis/ebuild.bash:478)

diefunc: making ebuild PID 19096 exit with error
die trap: exiting with error.

Install error:
* In program paludis -i genkdesvn-all*:
* When performing install action from command line:
* When executing install task:
* When installing 'kde-base/step-scm:kde-svn::kde4-experimental':
* Install error: Install failed for 'kde-base/step-scm:kde-svn::kde4-experimental'



Summary of failures:

* kde-base/step-scm:kde-svn::kde4-experimental: failure
Back to top
View user's profile Send private message
wrc1944
Advocate
Advocate


Joined: 15 Aug 2002
Posts: 3273
Location: Gainesville, Florida

PostPosted: Tue Sep 02, 2008 7:02 pm    Post subject: Reply with quote

On today's "paludis -i1 genkdesvn-all --dl-reinstall-targets always" I got this error on kdialog (only package that failed):
Code:
- Configuring done
-- Generating done
-- Build files have been written to: /var/tmp/paludis/kde-base-kdialog-scm/work/kdialog_build
make -j2
[ 12%] Generating progressdialogadaptor.cpp, progressdialogadaptor.h
[ 25%] Generating progressdialogadaptor.moc
Generating klistboxdialog.moc
Generating progressdialog.moc
Scanning dependencies of target kdialog
[ 37%] Building CXX object apps/kdialog/CMakeFiles/kdialog.dir/kdialog.o
[ 50%] Building CXX object apps/kdialog/CMakeFiles/kdialog.dir/widgets.o
[ 62%] Building CXX object apps/kdialog/CMakeFiles/kdialog.dir/klistboxdialog.o
/var/tmp/paludis/kde-base-kdialog-scm/work/kdialog/apps/kdialog/kdialog.cpp: In function 'int directCommand(KCmdLineArgs*)':
/var/tmp/paludis/kde-base-kdialog-scm/work/kdialog/apps/kdialog/kdialog.cpp:122: error: invalid cast from type 'long int' to type 'WId'
/var/tmp/paludis/kde-base-kdialog-scm/work/kdialog/apps/kdialog/kdialog.cpp:127: error: invalid cast from type 'long int' to type 'WId'
make[2]: *** [apps/kdialog/CMakeFiles/kdialog.dir/kdialog.o] Error 1
make[2]: *** Waiting for unfinished jobs....
make[1]: *** [apps/kdialog/CMakeFiles/kdialog.dir/all] Error 2
make: *** [all] Error 2
/usr/libexec/paludis/utils/emake: emake returned error 2

!!! ERROR in kde-base/kdialog-scm:
!!! In cmake-utils_src_make at line 1137
!!! Make failed!


Here's the kdialog.cpp, lines 122-127:
Code:
WId winid = 0;
    bool attach = args->isSet("attach");
    if(attach) {
        winid = reinterpret_cast<WId>(args->getOption("attach").toLong(&attach, 0));  //C style parsing.  If the string begins with "0x", base 16 is used; if the string begins with "0", base 8 is used; otherwise, base 10 is used.
    } else if(args->isSet("embed")) {
        /* KDialog originally used --embed for attaching the dialog box.  However this is misleading and so we changed to --attach.
         * For consistancy, we silently map --embed to --attach */
        attach = true;
        winid = reinterpret_cast<WId>(args->getOption("embed").toLong(&attach, 0));  //C style parsing.  If the string begins with "0x", base 16 is used; if the string begins with "0", base 8 is used; otherwise, base 10 is used.
Not knowing c++, and never seeing this type error before, I'm unsure of how to resolve this one. Anyone else run into this, and have an edit, or must we wait for a fix in svn?

EDIT: Apparently fixed in svn a few hours ago. :) http://websvn.kde.org/trunk/KDE/kdebase/apps/kdialog/kdialog.cpp?r1=855301&r2=856290 I'll give it a try. OK- works fine. :)
_________________
Main box- AsRock x370 Gaming K4
Ryzen 1700, 3.0GHz, 16GB GSkill Flare DDR4 3200mhz
Samsung SATA 1000GB, Radeon HD R7 350 2GB DDR5
Gentoo ~amd64 plasma, glibc-2.30-r2, gcc-9.2.0 kernel-5.4.1-gentoo USE=experimental
Back to top
View user's profile Send private message
eusanpe
Tux's lil' helper
Tux's lil' helper


Joined: 06 Sep 2002
Posts: 107

PostPosted: Wed Sep 03, 2008 1:33 pm    Post subject: Reply with quote

Hello All:

Any ideas about how to get KTorrent to compile? I get errors saying that it can't find the
QCA2 Libraries and QCA2 Includes. They are installed.

Thanks,
Tony
====================================================================

Quote:
>>> Verifying ebuild manifests

>>> Emerging (1 of 1) net-p2p/ktorrent-9999
* checking ebuild checksums ;-) ... [ ok ]
* checking auxfile checksums ;-) ... [ ok ]
* checking miscfile checksums ;-) ... [ ok ]

* WARNING! This is an experimental ebuild of the extragear/network KDE4 SVN tree.
* Use at your own risk. Do _NOT_ file bugs at bugs.gentoo.org because
* of this ebuild!

>>> Unpacking source...
* Fetching disabled since 1 hours has not passed since last update.
* Using existing repository copy at revision 856641.
* working copy: /usr/portage/distfiles/svn-src/KDE/extragear/network/network

* Exporting parts of working copy to /var/tmp/portage/net-p2p/ktorrent-9999/work/ktorrent
>>> Source unpacked.
>>> Compiling source in /var/tmp/portage/net-p2p/ktorrent-9999/work/ktorrent ...
-- The C compiler identification is GNU
-- The CXX compiler identification is GNU
-- Check for working C compiler: /usr/bin/x86_64-pc-linux-gnu-gcc
-- Check for working C compiler: /usr/bin/x86_64-pc-linux-gnu-gcc -- works
-- Detecting C compiler ABI info
-- Detecting C compiler ABI info - done
-- Check for working CXX compiler: /usr/bin/x86_64-pc-linux-gnu-g++
-- Check for working CXX compiler: /usr/bin/x86_64-pc-linux-gnu-g++ -- works
-- Detecting CXX compiler ABI info
-- Detecting CXX compiler ABI info - done
-- Looking for Q_WS_X11
-- Looking for Q_WS_X11 - found
-- Looking for Q_WS_WIN
-- Looking for Q_WS_WIN - not found.
-- Looking for Q_WS_QWS
-- Looking for Q_WS_QWS - not found.
-- Looking for Q_WS_MAC
-- Looking for Q_WS_MAC - not found.
-- Found Qt-Version 4.4.1 (using /usr/bin/qmake)
-- Looking for XOpenDisplay in /usr/lib64/libX11.so;/usr/lib64/libXext.so;/usr/lib64/libXft.so;/usr/lib64/libXau.so;/usr/lib64/libXdmcp.so;/usr/lib64/libXpm.so
-- Looking for XOpenDisplay in /usr/lib64/libX11.so;/usr/lib64/libXext.so;/usr/lib64/libXft.so;/usr/lib64/libXau.so;/usr/lib64/libXdmcp.so;/usr/lib64/libXpm.so - found
-- Looking for gethostbyname
-- Looking for gethostbyname - found
-- Looking for connect
-- Looking for connect - found
-- Looking for remove
-- Looking for remove - found
-- Looking for shmat
-- Looking for shmat - found
-- Looking for IceConnectionNumber in ICE
-- Looking for IceConnectionNumber in ICE - found
-- Found X11: /usr/lib64/libX11.so
-- Looking for include files CMAKE_HAVE_PTHREAD_H
-- Looking for include files CMAKE_HAVE_PTHREAD_H - found
-- Looking for pthread_create in pthreads
-- Looking for pthread_create in pthreads - not found
-- Looking for pthread_create in pthread
-- Looking for pthread_create in pthread - found
-- Found Automoc4: /usr/bin/automoc4
-- Found Perl: /usr/bin/perl
-- Performing Test _OFFT_IS_64BIT
-- Performing Test _OFFT_IS_64BIT - Success
-- Performing Test HAVE_FPIE_SUPPORT
-- Performing Test HAVE_FPIE_SUPPORT - Success
-- Performing Test __KDE_HAVE_W_OVERLOADED_VIRTUAL
-- Performing Test __KDE_HAVE_W_OVERLOADED_VIRTUAL - Success
-- Performing Test __KDE_HAVE_GCC_VISIBILITY
-- Performing Test __KDE_HAVE_GCC_VISIBILITY - Success
-- Found Phonon: /usr/lib64/libphonon.so
-- Found Phonon Includes: /usr/include/KDE;/usr/include
-- Found KDE 4.2 include dir: /usr/kde/svn/include
-- Found KDE 4.2 library dir: /usr/kde/svn/lib64
-- Found KDE4 kconfig_compiler preprocessor: /usr/kde/svn/bin/kconfig_compiler
-- Found automoc4: /usr/bin/automoc4
-- Found IW: /usr/include
-- Found Kopete: /usr/kde/svn/lib64/libkopete.so
-- Found Kdepim: /usr/kde/svn/lib64/libkdepim.so
-- Found KDE PIM libraries
-- Found gpgme-config at /usr/bin/gpgme-config
-- Found gpgme v1.1.6, checking for flavours...
-- Found flavour 'vanilla', checking whether it's usable...yes
-- Found flavour 'pthread', checking whether it's usable...yes
-- Usable gpgme flavours found: vanilla pthread
-- Found qgpgme: libraries: qgpgme;gpgme++-pthread;/usr/lib64/libgpgme-pthread.so;/usr/lib64/libpthread.so;/usr/lib64/libgpg-error.so
-- WARNING: you are using the obsolete 'PKGCONFIG' macro use FindPkgConfig
-- Could NOT find QCA2 includes
-- Could NOT find QCA2 libraries
--
-----------------------------------------------------------------------------
-- The following external packages were located on your system.
-- This installation will have the extra features provided by these packages.
+ gpgme
+ Kopete
+ KDE PIM Libraries
+ KDE PIM
Congratulations! All external packages have been found.
-----------------------------------------------------------------------------

-- Configuring done
-- Generating done
-- Build files have been written to: /var/tmp/portage/net-p2p/ktorrent-9999/work/ktorrent_build
>>> Source compiled.
>>> Test phase [not enabled]: net-p2p/ktorrent-9999

>>> Install ktorrent-9999 into /var/tmp/portage/net-p2p/ktorrent-9999/image/ category net-p2p
make: *** No rule to make target `install'. Stop.
*
* ERROR: net-p2p/ktorrent-9999 failed.
* Call stack:
* ebuild.sh, line 49: Called src_install
* environment, line 3078: Called kde4overlay-meta_src_install
* environment, line 2380: Called cmake-utils_src_install
* environment, line 736: Called die
* The specific snippet of code:
* emake install DESTDIR="${D}" || die "Make install failed";
* The die message:
* Make install failed
*
* If you need support, post the topmost build error, and the call stack if relevant.
* A complete build log is located at '/var/log/portage/net-p2p:ktorrent-9999:20080903-132532.log'.
* The ebuild environment file is located at '/var/tmp/portage/net-p2p/ktorrent-9999/temp/environment'.
* This ebuild is from an overlay: '/usr/local/portage/layman/kdesvn-portage/'
*

* Messages for package net-p2p/ktorrent-9999:

* WARNING! This is an experimental ebuild of the extragear/network KDE4 SVN tree.
* Use at your own risk. Do _NOT_ file bugs at bugs.gentoo.org because
* of this ebuild!
*
* ERROR: net-p2p/ktorrent-9999 failed.
* Call stack:
* ebuild.sh, line 49: Called src_install
* environment, line 3078: Called kde4overlay-meta_src_install
* environment, line 2380: Called cmake-utils_src_install
* environment, line 736: Called die
* The specific snippet of code:
* emake install DESTDIR="${D}" || die "Make install failed";
* The die message:
* Make install failed
*
* If you need support, post the topmost build error, and the call stack if relevant.
* A complete build log is located at '/var/log/portage/net-p2p:ktorrent-9999:20080903-132532.log'.
* The ebuild environment file is located at '/var/tmp/portage/net-p2p/ktorrent-9999/temp/environment'.
* This ebuild is from an overlay: '/usr/local/portage/layman/kdesvn-portage/'
*
Back to top
View user's profile Send private message
ericxx2005
Apprentice
Apprentice


Joined: 05 Apr 2005
Posts: 231
Location: 10 square miles surrounded by reality

PostPosted: Wed Sep 03, 2008 1:56 pm    Post subject: Reply with quote

kdelibs-4.1.0-r2 compile fails here. I haven't seen it on this thread yet (although I admittedly did not read all 24 pages!):

Code:
[ 13%] Building CXX object kdecore/CMakeFiles/kdecore.dir/network/k3sockssocketdevice.o                                                                         
[ 13%] Building CXX object kdecore/CMakeFiles/kdecore.dir/network/klocalsocket_unix.o                                                                           
[ 13%] In file included from /var/tmp/portage/kde-base/kdelibs-4.1.0-r2/work/kdelibs-4.1.0/kdecore/network/k3sockssocketdevice.h:24,                           
                 from /var/tmp/portage/kde-base/kdelibs-4.1.0-r2/work/kdelibs-4.1.0/kdecore/network/k3sockssocketdevice.cpp:21:                                 
/var/tmp/portage/kde-base/kdelibs-4.1.0-r2/work/kdelibs-4.1.0/kdecore/network/k3socketbase.h:699: warning: 'virtual qint64 KNetwork::KActiveSocketBase::readData(char*, qint64)' was hidden                                                     
/var/tmp/portage/kde-base/kdelibs-4.1.0-r2/work/kdelibs-4.1.0/kdecore/network/k3socketdevice.h:264: warning:   by 'virtual qint64 KNetwork::KSocketDevice::readData(char*, qint64, KNetwork::KSocketAddress*)'                                 
/var/tmp/portage/kde-base/kdelibs-4.1.0-r2/work/kdelibs-4.1.0/kdecore/network/k3socketbase.h:734: warning: 'virtual qint64 KNetwork::KActiveSocketBase::writeData(const char*, qint64)' was hidden                                             
/var/tmp/portage/kde-base/kdelibs-4.1.0-r2/work/kdelibs-4.1.0/kdecore/network/k3socketdevice.h:275: warning:   by 'virtual qint64 KNetwork::KSocketDevice::writeData(const char*, qint64, const KNetwork::KSocketAddress*)'                     
In file included from /var/tmp/portage/kde-base/kdelibs-4.1.0-r2/work/kdelibs-4.1.0/kdecore/network/k3sockssocketdevice.cpp:21:                                 
/var/tmp/portage/kde-base/kdelibs-4.1.0-r2/work/kdelibs-4.1.0/kdecore/network/k3socketdevice.h:183: warning: 'virtual bool KNetwork::KSocketDevice::connect(const KNetwork::KResolverEntry&, QFlags<QIODevice::OpenModeFlag>)' was hidden       
/var/tmp/portage/kde-base/kdelibs-4.1.0-r2/work/kdelibs-4.1.0/kdecore/network/k3sockssocketdevice.h:77: warning:   by 'virtual bool KNetwork::KSocksSocketDevice::connect(const KNetwork::KResolverEntry&)'                                     
Building CXX object kdecore/CMakeFiles/kdecore.dir/network/netsupp.o           
[ 13%] Building CXX object kdecore/CMakeFiles/kdecore.dir/io/klockfile_unix.o   
[ 13%] Building CXX object kdecore/CMakeFiles/kdecore.dir/util/kshell_unix.o   
[ 13%] Building CXX object kdecore/CMakeFiles/kdecore.dir/util/kuser_unix.o     
[ 13%] Building CXX object kdecore/CMakeFiles/kdecore.dir/util/kmacroexpander_unix.o                                                                           
[ 13%] Building C object kdecore/CMakeFiles/kdecore.dir/fakes.o                 
[ 13%] Building CXX object kdecore/CMakeFiles/kdecore.dir/kdecore_automoc.o     
Linking CXX shared library ../lib/libkdecore.so                                 
[ 13%] Built target kdecore                                                     
make: *** [all] Error 2                                                         
 *                                                                             
 * ERROR: kde-base/kdelibs-4.1.0-r2 failed.                                     
 * Call stack:                                                                 
 *               ebuild.sh, line   49:  Called src_compile                     
 *             environment, line 2690:  Called kde4overlay-base_src_compile     
 *             environment, line 1974:  Called kde4overlay-base_src_make       
 *             environment, line 2007:  Called cmake-utils_src_make             
 *             environment, line  666:  Called die                             
 * The specific snippet of code:                                               
 *           emake "$@" || die "Make failed!";                                 
 *  The die message:                                                           
 *   Make failed!                                                               
 *   



emerge --info:

Code:
Portage 2.2_rc8 (default/linux/amd64/2008.0, gcc-4.3.1, glibc-2.8_p20080602-r0, 2.6.26-gentoo-r1 x86_64)                                                       
=================================================================               
System uname: Linux-2.6.26-gentoo-r1-x86_64-Intel-R-_Core-TM-2_Duo_CPU_T5450_@_1.66GHz-with-glibc2.2.5                                                         
Timestamp of tree: Wed, 03 Sep 2008 12:00:01 +0000                             
ccache version 2.4 [enabled]                                                   
app-shells/bash:     3.2_p39                                                   
dev-java/java-config: 1.3.7, 2.1.6-r1                                           
dev-lang/python:     2.5.2-r7                                                   
dev-util/ccache:     2.4-r7                                                     
sys-apps/baselayout: 2.0.0                                                     
sys-apps/openrc:     0.2.5                                                     
sys-apps/sandbox:    1.2.18.1-r3                                               
sys-devel/autoconf:  2.13, 2.62-r1                                             
sys-devel/automake:  1.5, 1.7.9-r1, 1.8.5-r3, 1.9.6-r2, 1.10.1-r1               
sys-devel/binutils:  2.18-r3                                                   
sys-devel/gcc-config: 1.4.0-r4                                                 
sys-devel/libtool:   2.2.4                                                     
virtual/os-headers:  2.6.26                                                     
ACCEPT_KEYWORDS="amd64 ~amd64"                                                 
CBUILD="x86_64-pc-linux-gnu"                                                   
CFLAGS="-march=native -O2 -pipe -fomit-frame-pointer"                           
CHOST="x86_64-pc-linux-gnu"                                                     
CONFIG_PROTECT="/etc /usr/kde/svn/env /usr/kde/svn/share/config /usr/kde/svn/shutdown /usr/share/config"                                                       
CONFIG_PROTECT_MASK="/etc/ca-certificates.conf /etc/env.d /etc/env.d/java/ /etc/fonts/fonts.conf /etc/gconf /etc/gentoo-release /etc/php/apache2-php5/ext-active/ /etc/php/cgi-php5/ext-active/ /etc/php/cli-php5/ext-active/ /etc/revdep-rebuild /etc/splash /etc/terminfo /etc/udev/rules.d"                                 
CXXFLAGS="-march=native -O2 -pipe -fomit-frame-pointer"                         
DISTDIR="/usr/portage/distfiles"                                               
FEATURES="ccache distlocks parallel-fetch prelink preserve-libs sandbox sfperms strict unmerge-orphans userfetch"                                               
GENTOO_MIRRORS="http://distfiles.gentoo.org http://distro.ibiblio.org/pub/linux/distributions/gentoo"                                                           
LDFLAGS="-Wl,--hash-style=both"                                                 
LINGUAS="en en_US"                                                             
MAKEOPTS="-j3 -s"                                                               
PKGDIR="/usr/portage/packages"                                                 
PORTAGE_RSYNC_OPTS="--recursive --links --safe-links --perms --times --compress --force --whole-file --delete --stats --timeout=180 --exclude=/distfiles --exclude=/local --exclude=/packages"                                                 
PORTAGE_TMPDIR="/var/tmp"                                                       
PORTDIR="/usr/portage"                                                         
PORTDIR_OVERLAY="/usr/local/portage/layman/desktop-effects /usr/local/portage/layman/sunrise /usr/local/portage/layman/arcon /usr/local/portage/layman/secondlife /usr/local/portage/layman/java-binary /usr/local/portage/layman/Spring /usr/local/portage/layman/pro-audio /usr/local/portage/layman/kdesvn-portage /usr/local/portage/layman/zen-overlay /usr/local/portage"                                 
SYNC="rsync://rsync.gentoo.org/gentoo-portage"                                 
USE="X a52 aac aalib acl acpi additions aim alsa amarok amazon amd64 aspnet aspnet2 avahi bash-completion berkdb blender-game bluetooth bonjour bzip2 cdaudio cdda cddb cdio cdr cdrom chm cli cpp cpufreq cracklib crypt cups daap dbus dhcp divx dri dvd fat festival ffmpeg firefox firefox3 flac fortran fuse garmin gdbm gif gimp glitz gpm groupwise grub gtk hal iconv ipv6 ipw4965 isdnlog jabber java john jpeg kde kde4 laptop lcd lm_sensors mdnsresponder-compat midi mktemp mmx mp2 mp3 mp3tunes mp4 mpeg mudflap multilib musepack ncurses network networkmanagernls nptl nptlonly nsplugin nvidia old-daemons openal opengl opengl-video openmporacle oss pam pcre pda pdf perl plasma png ppds pppd pulseaudio python qt-copyqt3 qt3support qt4 quicktime readline realmedia reflection samba sdl semantic-desktop session spell spl sse sse2 ssl ssse3 svg sysfs tcpd unicode unsupported usb visualization vnc vorbis wav wavpack webkit wifi wma wmp x264 xcf xcomposite xinerama xorg xrandr xscreensaver xulrunner zlib" ALSA_CARDS="hda-intel" ALSA_PCM_PLUGINS="adpcm alaw asym copy dmix dshare dsnoop empty extplug file hooks iec958 ioplug ladspa lfloat linear meter mmap_emul mulaw multi null plug rate route share shm softvol" APACHE2_MODULES="actions alias auth_basic authn_alias authn_anon authn_dbm authn_default authn_file authz_dbm authz_default authz_groupfile authz_host authz_owner authz_user autoindex cache dav dav_fs dav_lock deflate dirdisk_cache env expires ext_filter file_cache filter headers include info log_config logio mem_cache mime mime_magic negotiation rewrite setenvif speling statusunique_id userdir usertrack vhost_alias" ELIBC="glibc" INPUT_DEVICES="keyboard mouse evdev joystick" KERNEL="linux" LCD_DEVICES="bayrad cfontz cfontz633 glk hd44780 lb216 lcdm001 mtxorb ncurses text" LINGUAS="en en_US" USERLAND="GNU" VIDEO_CARDS="vesa nvidia nv"
Unset:  CPPFLAGS, CTARGET, EMERGE_DEFAULT_OPTS, FFLAGS, INSTALL_MASK, LANG, LC_ALL, PORTAGE_COMPRESS, PORTAGE_COMPRESS_FLAGS, PORTAGE_RSYNC_EXTRA_OPTS

_________________
AMD 1090T | 2 GB | AMD 890GX | Gentoo x86_64
Core i7-920 | 6 GB | AMD 5850 | Windows 7 Pro
Back to top
View user's profile Send private message
pattie102
n00b
n00b


Joined: 07 Jul 2004
Posts: 24
Location: Germany

PostPosted: Wed Sep 03, 2008 4:37 pm    Post subject: Reply with quote

eusanpe wrote:
Hello All:

Any ideas about how to get KTorrent to compile? I get errors saying that it can't find the
QCA2 Libraries and QCA2 Includes. They are installed.



Hi.

I suppose this has to do with this bug:

https://bugs.gentoo.org/show_bug.cgi?id=236514

At least I could compile ktorrent, when I linked the file mentioned there to its old place. By the way, this also seems to be responsible for kopete not beeing able to use the jabber protocol (at least I had this problem for some days now.)
Back to top
View user's profile Send private message
eusanpe
Tux's lil' helper
Tux's lil' helper


Joined: 06 Sep 2002
Posts: 107

PostPosted: Wed Sep 03, 2008 6:37 pm    Post subject: Reply with quote

Quote:
Hi.

I suppose this has to do with this bug:

https://bugs.gentoo.org/show_bug.cgi?id=236514

At least I could compile ktorrent, when I linked the file mentioned there to its old place. By the way, this also seems to be responsible for kopete not beeing able to use the jabber protocol (at least I had this problem for some days now.)



That is what it was..

Thanks,
Tony
Back to top
View user's profile Send private message
HeissFuss
Guru
Guru


Joined: 11 Jan 2005
Posts: 414

PostPosted: Thu Sep 04, 2008 12:00 am    Post subject: Reply with quote

ericxx2005 wrote:
kdelibs-4.1.0-r2 compile fails here. I haven't seen it on this thread yet (although I admittedly did not read all 24 pages!):

Code:
[ 13%] Building CXX object kdecore/CMakeFiles/kdecore.dir/network/k3sockssocketdevice.o                                                                         
[ 13%] Building CXX object kdecore/CMakeFiles/kdecore.dir/network/klocalsocket_unix.o                                                                           
[ 13%] In file included from /var/tmp/portage/kde-base/kdelibs-4.1.0-r2/work/kdelibs-4.1.0/kdecore/network/k3sockssocketdevice.h:24,                           
                 from /var/tmp/portage/kde-base/kdelibs-4.1.0-r2/work/kdelibs-4.1.0/kdecore/network/k3sockssocketdevice.cpp:21:                                 
/var/tmp/portage/kde-base/kdelibs-4.1.0-r2/work/kdelibs-4.1.0/kdecore/network/k3socketbase.h:699: warning: 'virtual qint64 KNetwork::KActiveSocketBase::readData(char*, qint64)' was hidden                                                     
/var/tmp/portage/kde-base/kdelibs-4.1.0-r2/work/kdelibs-4.1.0/kdecore/network/k3socketdevice.h:264: warning:   by 'virtual qint64 KNetwork::KSocketDevice::readData(char*, qint64, KNetwork::KSocketAddress*)'                                 
/var/tmp/portage/kde-base/kdelibs-4.1.0-r2/work/kdelibs-4.1.0/kdecore/network/k3socketbase.h:734: warning: 'virtual qint64 KNetwork::KActiveSocketBase::writeData(const char*, qint64)' was hidden                                             
/var/tmp/portage/kde-base/kdelibs-4.1.0-r2/work/kdelibs-4.1.0/kdecore/network/k3socketdevice.h:275: warning:   by 'virtual qint64 KNetwork::KSocketDevice::writeData(const char*, qint64, const KNetwork::KSocketAddress*)'                     
In file included from /var/tmp/portage/kde-base/kdelibs-4.1.0-r2/work/kdelibs-4.1.0/kdecore/network/k3sockssocketdevice.cpp:21:                                 
/var/tmp/portage/kde-base/kdelibs-4.1.0-r2/work/kdelibs-4.1.0/kdecore/network/k3socketdevice.h:183: warning: 'virtual bool KNetwork::KSocketDevice::connect(const KNetwork::KResolverEntry&, QFlags<QIODevice::OpenModeFlag>)' was hidden       
/var/tmp/portage/kde-base/kdelibs-4.1.0-r2/work/kdelibs-4.1.0/kdecore/network/k3sockssocketdevice.h:77: warning:   by 'virtual bool KNetwork::KSocksSocketDevice::connect(const KNetwork::KResolverEntry&)'                                     
Building CXX object kdecore/CMakeFiles/kdecore.dir/network/netsupp.o           
[ 13%] Building CXX object kdecore/CMakeFiles/kdecore.dir/io/klockfile_unix.o   
[ 13%] Building CXX object kdecore/CMakeFiles/kdecore.dir/util/kshell_unix.o   
[ 13%] Building CXX object kdecore/CMakeFiles/kdecore.dir/util/kuser_unix.o     
[ 13%] Building CXX object kdecore/CMakeFiles/kdecore.dir/util/kmacroexpander_unix.o                                                                           
[ 13%] Building C object kdecore/CMakeFiles/kdecore.dir/fakes.o                 
[ 13%] Building CXX object kdecore/CMakeFiles/kdecore.dir/kdecore_automoc.o     
Linking CXX shared library ../lib/libkdecore.so                                 
[ 13%] Built target kdecore                                                     
make: *** [all] Error 2                                                         
 *                                                                             
 * ERROR: kde-base/kdelibs-4.1.0-r2 failed.                                     
 * Call stack:                                                                 
 *               ebuild.sh, line   49:  Called src_compile                     
 *             environment, line 2690:  Called kde4overlay-base_src_compile     
 *             environment, line 1974:  Called kde4overlay-base_src_make       
 *             environment, line 2007:  Called cmake-utils_src_make             
 *             environment, line  666:  Called die                             
 * The specific snippet of code:                                               
 *           emake "$@" || die "Make failed!";                                 
 *  The die message:                                                           
 *   Make failed!                                                               
 *   



I had the same issue with 4.1.0-r2 and now also have it with 4.1.1. Maybe there's some similarity here. It's not the gcc version though because I had the same problem on the stable version.

*edit
It was strigi. That was the only non-slotted package I had an svn version of. I downgraded to 0.5.11 and kdelibs compiled.
Looking at other things, if you have svn soprano, that may also cause problems since it also isn't slotted.
Back to top
View user's profile Send private message
drizzt
Guru
Guru


Joined: 21 Jul 2002
Posts: 416

PostPosted: Thu Sep 04, 2008 5:42 am    Post subject: Reply with quote

Hello I need urgent help.
I'm running kde-4 from overlay since 4.0 was out but since about 4 weeks it started to get strange.
First kdepim-kresources-4.1.0 asked for kde-base/akonadi:kde-4 which I it seems isn't available via overlay (because there is only kde-base/akonadi:4.1). So I blocked this package to get the rest updated.
Yesterday kde-4.1.1 came out and I hoped to get this error fixed but it wasn't. kdepim-kresources-4.1.1 also asked for kde-base/akonadi:kde-4. :roll:
Then after half way through upgrade to kde-4.1.1 emerge complained about kdepim-4.1.1.tar.bz2 having the wrong size (got ~13mb, wanted 0(!)). Okay, I thought to myself just sync overlay again maybe a typo in ebuild or manifest. After sync everything got completely screwed up. Now portage wants to install kde-4.2 although I never unmasked / keyworded this and I can't get the update finished correctly.
I must write from another workstation since my kde is broken atm.
If somebody could write down step by step how to correctly unmask / keyword kde-4.1(.1) with portage so I can finish the update and use my workstation again that would be very nice.

Thanks
_________________
People don't have to earn my respect. I offer my respect to them, but be careful to lose my respect...
Back to top
View user's profile Send private message
beso_1717
Apprentice
Apprentice


Joined: 19 Jul 2007
Posts: 263

PostPosted: Thu Sep 04, 2008 11:11 am    Post subject: Reply with quote

drizzt wrote:
Hello I need urgent help.
I'm running kde-4 from overlay since 4.0 was out but since about 4 weeks it started to get strange.
First kdepim-kresources-4.1.0 asked for kde-base/akonadi:kde-4 which I it seems isn't available via overlay (because there is only kde-base/akonadi:4.1). So I blocked this package to get the rest updated.
Yesterday kde-4.1.1 came out and I hoped to get this error fixed but it wasn't. kdepim-kresources-4.1.1 also asked for kde-base/akonadi:kde-4. :roll:
Then after half way through upgrade to kde-4.1.1 emerge complained about kdepim-4.1.1.tar.bz2 having the wrong size (got ~13mb, wanted 0(!)). Okay, I thought to myself just sync overlay again maybe a typo in ebuild or manifest. After sync everything got completely screwed up. Now portage wants to install kde-4.2 although I never unmasked / keyworded this and I can't get the update finished correctly.
I must write from another workstation since my kde is broken atm.
If somebody could write down step by step how to correctly unmask / keyword kde-4.1(.1) with portage so I can finish the update and use my workstation again that would be very nice.

Thanks


you couldn't have used portage with this overlay. this overlay works only with paludis and portage shouldn't have been able to push in anything from this overlay. this is the right thread for the portage kde4 overlay: https://forums.gentoo.org/viewtopic-t-639443-highlight-.html
when using the svn version there's a good probability that you system might screw out due to changes in the code. so be sure to use the quickpkg to have snapshots of working versions before updating.
also why not logging in with kde 3.5?! it isn't a good thing going with just kde4 and removing all kde3.5.
Back to top
View user's profile Send private message
trikolon
Apprentice
Apprentice


Joined: 04 Dec 2004
Posts: 297
Location: Erlangen

PostPosted: Thu Sep 04, 2008 11:17 am    Post subject: Reply with quote

hello everybody.
i was able to emerge kde-meta-4.1.1 without errors. but everytime i try to emerge krosspython (does there only the 9999 version excist?) im running in the same errors:

Code:
ben kdesvn # emerge -av krosspython --nodeps
WARNING: repository at /usr/portage/local/mixed is missing a repo_name entry

These are the packages that would be merged, in order:

[ebuild  N    ] kde-base/krosspython-9999  USE="-debug" 0 kB [1]

Total: 1 package (1 new), Size of downloads: 0 kB
Portage tree and overlays:
 [0] /usr/portage
 [1] /usr/local/portage/layman/kdesvn-portage

Would you like to merge these packages? [Yes/No] y

>>> Verifying ebuild manifests

>>> Emerging (1 of 1) kde-base/krosspython-9999
 * checking ebuild checksums ;-) ...                                                                                                                  [ ok ]
 * checking auxfile checksums ;-) ...                                                                                                                 [ ok ]
 * checking miscfile checksums ;-) ...                                                                                                                [ ok ]

 * WARNING! This is an experimental ebuild of the kdebindings KDE4 SVN tree.
 * Use at your own risk. Do _NOT_ file bugs at bugs.gentoo.org because
 * of this ebuild!

>>> Unpacking source...
 * Fetching disabled since 1 hours has not passed since last update.
 * Using existing repository copy at revision 856986.
 *    working copy: /usr/portage/distfiles/svn-src/KDE/kdebindings/kdebindings

 * Exporting parts of working copy to /var/tmp/portage/kde-base/krosspython-9999/work/krosspython
>>> Source unpacked.
>>> Compiling source in /var/tmp/portage/kde-base/krosspython-9999/work/krosspython ...
-- The C compiler identification is GNU
-- The CXX compiler identification is GNU
-- Check for working C compiler: /usr/bin/x86_64-pc-linux-gnu-gcc
-- Check for working C compiler: /usr/bin/x86_64-pc-linux-gnu-gcc -- works
-- Detecting C compiler ABI info
-- Detecting C compiler ABI info - done
-- Check for working CXX compiler: /usr/bin/x86_64-pc-linux-gnu-g++
-- Check for working CXX compiler: /usr/bin/x86_64-pc-linux-gnu-g++ -- works
-- Detecting CXX compiler ABI info
-- Detecting CXX compiler ABI info - done
-- Looking for Q_WS_X11
-- Looking for Q_WS_X11 - found
-- Looking for Q_WS_WIN
-- Looking for Q_WS_WIN - not found.
-- Looking for Q_WS_QWS
-- Looking for Q_WS_QWS - not found.
-- Looking for Q_WS_MAC
-- Looking for Q_WS_MAC - not found.
-- Found Qt-Version 4.4.1 (using /usr/bin/qmake)
-- Looking for XOpenDisplay in /usr/lib64/libX11.so;/usr/lib64/libXext.so;/usr/lib64/libXft.so;/usr/lib64/libXau.so;/usr/lib64/libXdmcp.so;/usr/lib64/libXpm.so
-- Looking for XOpenDisplay in /usr/lib64/libX11.so;/usr/lib64/libXext.so;/usr/lib64/libXft.so;/usr/lib64/libXau.so;/usr/lib64/libXdmcp.so;/usr/lib64/libXpm.so - found
-- Looking for gethostbyname
-- Looking for gethostbyname - found
-- Looking for connect
-- Looking for connect - found
-- Looking for remove
-- Looking for remove - found
-- Looking for shmat
-- Looking for shmat - found
-- Looking for IceConnectionNumber in ICE
-- Looking for IceConnectionNumber in ICE - found
-- Found X11: /usr/lib64/libX11.so
-- Looking for include files CMAKE_HAVE_PTHREAD_H
-- Looking for include files CMAKE_HAVE_PTHREAD_H - found
-- Looking for pthread_create in pthreads
-- Looking for pthread_create in pthreads - not found
-- Looking for pthread_create in pthread
-- Looking for pthread_create in pthread - found
-- Found Automoc4: /usr/bin/automoc4
-- Found Perl: /usr/bin/perl
-- Performing Test _OFFT_IS_64BIT
-- Performing Test _OFFT_IS_64BIT - Success
-- Performing Test HAVE_FPIE_SUPPORT
-- Performing Test HAVE_FPIE_SUPPORT - Success
-- Performing Test __KDE_HAVE_W_OVERLOADED_VIRTUAL
-- Performing Test __KDE_HAVE_W_OVERLOADED_VIRTUAL - Success
-- Performing Test __KDE_HAVE_GCC_VISIBILITY
-- Performing Test __KDE_HAVE_GCC_VISIBILITY - Success
-- Found Phonon: /usr/lib64/libphonon.so
-- Found Phonon Includes: /usr/include/KDE;/usr/include
-- Found KDE 4.1 include dir: /usr/kde/4.1/include
-- Found KDE 4.1 library dir: /usr/kde/4.1/lib64
-- Found KDE4 kconfig_compiler preprocessor: /usr/kde/4.1/bin/kconfig_compiler
-- Found automoc4: /usr/bin/automoc4
-- Found Soprano: /usr/lib64/libsoprano.so
-- Found Soprano includes: /usr/include
-- Found Soprano Index: /usr/lib64/libsopranoindex.so
-- Found Soprano Client: /usr/lib64/libsopranoclient.so
-- Found NEPOMUK: /usr/kde/4.1/lib64/libnepomuk.so
-- Found KDE PIM libraries
-- Found QScintilla2: /usr/lib64/libqscintilla2.a
-- cmake package FindOkular.cmake was not found. The package Okular is needed to compile all part of this program.
-- Found Akonadi: /usr/lib64/libakonadiprotocolinternals.so
-- Found Akonadi includes: /usr/include
-- Found Akonadi common libraries: /usr/lib64/libakonadiprotocolinternals.so
-- Found Akonadi dbus-interfaces: /usr/share/dbus-1/interfaces
-- Found Plasma: /usr/kde/4.1/lib64/libplasma.so
-- cmake package FindKDevPlatform.cmake was not found. The package KDevPlatform is needed to compile all part of this program.
-- Found PythonInterp: /usr/bin/python2.5
-- Found Python executable: /usr/bin/python2.5
-- Found Python version: 2.5.2
-- Found Python library: /usr/lib64/libpython2.5.so
-- Found PythonInterp: /usr/bin/python2.5
-- Found Python executable: /usr/bin/python2.5
-- Found Python version: 2.5.2
-- Found Python library: /usr/lib64/libpython2.5.so
-- Python Libraries: /usr/lib64/libpython2.5.so
-- Python Include Path: /usr/include/python2.5
-- Build Kross Python... yes
-- Found SIP version: 4.7.6
-- Found PyQt4 version: 4.4.2
-- Build PyKDE4... yes
--

-- Configuring done
-- Generating done
-- Build files have been written to: /var/tmp/portage/kde-base/krosspython-9999/work/krosspython_build
Scanning dependencies of target krosspython
[  9%] [ 18%] Building CXX object python/krosspython/CMakeFiles/krosspython.dir/krosspython_automoc.o
Building CXX object python/krosspython/CMakeFiles/krosspython.dir/cxx/cxxsupport.o
[ 27%] Building CXX object python/krosspython/CMakeFiles/krosspython.dir/cxx/cxx_extensions.o
[ 36%] Building C object python/krosspython/CMakeFiles/krosspython.dir/cxx/cxxextensions.o
[ 45%] Building CXX object python/krosspython/CMakeFiles/krosspython.dir/cxx/IndirectPythonInterface.o
[ 54%] Building CXX object python/krosspython/CMakeFiles/krosspython.dir/pythonvariant.o
/var/tmp/portage/kde-base/krosspython-9999/work/krosspython/python/krosspython/pythonvariant.cpp:24:41: Fehler: kross/core/wrapperinterface.h: Datei oder Verzeichnis nicht gefunden
[ 63%] Building CXX object python/krosspython/CMakeFiles/krosspython.dir/pythonextension.o
/var/tmp/portage/kde-base/krosspython-9999/work/krosspython/python/krosspython/pythonvariant.cpp: In static member function »static void* Kross::VoidList::extractVoidStar(const Py::Object&)«:
/var/tmp/portage/kde-base/krosspython-9999/work/krosspython/python/krosspython/pythonvariant.cpp:43: Fehler: »WrapperInterface« wurde in diesem Gültigkeitsbereich nicht definiert
/var/tmp/portage/kde-base/krosspython-9999/work/krosspython/python/krosspython/pythonvariant.cpp:43: Fehler: »wrapper« wurde in diesem Gültigkeitsbereich nicht definiert
/var/tmp/portage/kde-base/krosspython-9999/work/krosspython/python/krosspython/pythonvariant.cpp:43: Fehler: expected type-specifier before »WrapperInterface«
/var/tmp/portage/kde-base/krosspython-9999/work/krosspython/python/krosspython/pythonvariant.cpp:43: Fehler: expected `>' before »WrapperInterface«
/var/tmp/portage/kde-base/krosspython-9999/work/krosspython/python/krosspython/pythonvariant.cpp:43: Fehler: expected `(' before »WrapperInterface«
/var/tmp/portage/kde-base/krosspython-9999/work/krosspython/python/krosspython/pythonvariant.cpp:43: Fehler: expected primary-expression before »>« token
/var/tmp/portage/kde-base/krosspython-9999/work/krosspython/python/krosspython/pythonvariant.cpp:44: Fehler: expected `)' before »return«
/var/tmp/portage/kde-base/krosspython-9999/work/krosspython/python/krosspython/pythonvariant.cpp:44: Warnung: geschweifte Klammern um leeren Körper in einer »if«-Anweisung empfohlen
/var/tmp/portage/kde-base/krosspython-9999/work/krosspython/python/krosspython/pythonvariant.cpp: In static member function »static Py::Object Kross::PythonType<QVariant, Py::Object>::toPyObject(const QVariant&)«:
/var/tmp/portage/kde-base/krosspython-9999/work/krosspython/python/krosspython/pythonvariant.cpp:137: Fehler: »MetaTypeHandler« ist kein Element von »Kross«
/var/tmp/portage/kde-base/krosspython-9999/work/krosspython/python/krosspython/pythonvariant.cpp:137: Fehler: »handler« wurde in diesem Gültigkeitsbereich nicht definiert
/var/tmp/portage/kde-base/krosspython-9999/work/krosspython/python/krosspython/pythonvariant.cpp:137: Fehler: »class Kross::Manager« hat kein Element namens »metaTypeHandler«
/var/tmp/portage/kde-base/krosspython-9999/work/krosspython/python/krosspython/pythonvariant.cpp: In static member function »static Kross::MetaType* Kross::PythonMetaTypeFactory::create(const char*, const Py::Object&, bool)«:
/var/tmp/portage/kde-base/krosspython-9999/work/krosspython/python/krosspython/pythonvariant.cpp:412: Fehler: »WrapperInterface« wurde in diesem Gültigkeitsbereich nicht definiert
/var/tmp/portage/kde-base/krosspython-9999/work/krosspython/python/krosspython/pythonvariant.cpp:412: Fehler: »wrapper« wurde in diesem Gültigkeitsbereich nicht definiert
/var/tmp/portage/kde-base/krosspython-9999/work/krosspython/python/krosspython/pythonvariant.cpp:412: Fehler: expected type-specifier before »WrapperInterface«
/var/tmp/portage/kde-base/krosspython-9999/work/krosspython/python/krosspython/pythonvariant.cpp:412: Fehler: expected `>' before »WrapperInterface«
/var/tmp/portage/kde-base/krosspython-9999/work/krosspython/python/krosspython/pythonvariant.cpp:412: Fehler: expected `(' before »WrapperInterface«
/var/tmp/portage/kde-base/krosspython-9999/work/krosspython/python/krosspython/pythonvariant.cpp:412: Fehler: expected primary-expression before »>« token
/var/tmp/portage/kde-base/krosspython-9999/work/krosspython/python/krosspython/pythonvariant.cpp:413: Fehler: expected `)' before »return«
/var/tmp/portage/kde-base/krosspython-9999/work/krosspython/python/krosspython/pythonvariant.cpp:413: Warnung: geschweifte Klammern um leeren Körper in einer »if«-Anweisung empfohlen
make[2]: *** [python/krosspython/CMakeFiles/krosspython.dir/pythonvariant.o] Fehler 1
make[2]: *** Warte auf noch nicht beendete Prozesse...
In file included from /var/tmp/portage/kde-base/krosspython-9999/work/krosspython/python/krosspython/pythonextension.cpp:23:
/var/tmp/portage/kde-base/krosspython-9999/work/krosspython/python/krosspython/pythonfunction.h: In member function »virtual int Kross::PythonFunction::qt_metacall(QMetaObject::Call, int, void**)«:
/var/tmp/portage/kde-base/krosspython-9999/work/krosspython/python/krosspython/pythonfunction.h:118: Fehler: »class Kross::Manager« hat kein Element namens »strictTypesEnabled«
/var/tmp/portage/kde-base/krosspython-9999/work/krosspython/python/krosspython/pythonextension.cpp: In static member function »static PyObject* Kross::PythonExtension::proxyhandler(PyObject*, PyObject*)«:
/var/tmp/portage/kde-base/krosspython-9999/work/krosspython/python/krosspython/pythonextension.cpp:622: Fehler: »MetaTypeHandler« ist kein Element von »Kross«
/var/tmp/portage/kde-base/krosspython-9999/work/krosspython/python/krosspython/pythonextension.cpp:622: Fehler: »handler« wurde in diesem Gültigkeitsbereich nicht definiert
/var/tmp/portage/kde-base/krosspython-9999/work/krosspython/python/krosspython/pythonextension.cpp:622: Fehler: »class Kross::Manager« hat kein Element namens »metaTypeHandler«
/var/tmp/portage/kde-base/krosspython-9999/work/krosspython/python/krosspython/pythonextension.cpp:632: Fehler: »class Kross::Manager« hat kein Element namens »strictTypesEnabled«
make[2]: *** [python/krosspython/CMakeFiles/krosspython.dir/pythonextension.o] Fehler 1
make[1]: *** [python/krosspython/CMakeFiles/krosspython.dir/all] Fehler 2
make: *** [all] Fehler 2
 *
 * ERROR: kde-base/krosspython-9999 failed.
 * Call stack:
 *               ebuild.sh, line   49:  Called src_compile
 *             environment, line 3075:  Called kde4overlay-meta_src_compile
 *             environment, line 2355:  Called kde4overlay-meta_src_make
 *             environment, line 2404:  Called kde4overlay-base_src_make
 *             environment, line 2115:  Called cmake-utils_src_make
 *             environment, line  767:  Called die
 * The specific snippet of code:
 *           emake "$@" || die "Make failed!";
 *  The die message:
 *   Make failed!
 *
 * If you need support, post the topmost build error, and the call stack if relevant.
 * A complete build log is located at '/var/tmp/portage/kde-base/krosspython-9999/temp/build.log'.
 * The ebuild environment file is located at '/var/tmp/portage/kde-base/krosspython-9999/temp/environment'.
 * This ebuild is from an overlay: '/usr/local/portage/layman/kdesvn-portage/'
 *

 * Messages for package kde-base/krosspython-9999:

 * WARNING! This is an experimental ebuild of the kdebindings KDE4 SVN tree.
 * Use at your own risk. Do _NOT_ file bugs at bugs.gentoo.org because
 * of this ebuild!
 *
 * ERROR: kde-base/krosspython-9999 failed.
 * Call stack:
 *               ebuild.sh, line   49:  Called src_compile
 *             environment, line 3075:  Called kde4overlay-meta_src_compile
 *             environment, line 2355:  Called kde4overlay-meta_src_make
 *             environment, line 2404:  Called kde4overlay-base_src_make
 *             environment, line 2115:  Called cmake-utils_src_make
 *             environment, line  767:  Called die
 * The specific snippet of code:
 *           emake "$@" || die "Make failed!";
 *  The die message:
 *   Make failed!
 *
 * If you need support, post the topmost build error, and the call stack if relevant.
 * A complete build log is located at '/var/tmp/portage/kde-base/krosspython-9999/temp/build.log'.
 * The ebuild environment file is located at '/var/tmp/portage/kde-base/krosspython-9999/temp/environment'.
 * This ebuild is from an overlay: '/usr/local/portage/layman/kdesvn-portage/'
 *
ben kdesvn #


Andy ideas why? im trying it now for at least 4 weeks and wasnt able to compile it one time.
greets, ben
Back to top
View user's profile Send private message
eusanpe
Tux's lil' helper
Tux's lil' helper


Joined: 06 Sep 2002
Posts: 107

PostPosted: Thu Sep 04, 2008 2:27 pm    Post subject: Reply with quote

Hello All:

Has anyone had issues compiling digikam-9999?


Code:
-- cmake package FindIMLIB.cmake was not found. This package needs Imlib to be compile all program


Code:
[100%] Building CXX object digikam/digikam/CMakeFiles/digikam_bin.dir/digikam_bin_automoc.o
Linking CXX executable digikam
CMakeFiles/digikam_bin.dir/__/utilities/imageeditor/editor/imagewindow.o: In function `Digikam::ImageWindow::slotComponentsInfo()':
imagewindow.cpp:(.text+0x499f): undefined reference to `KIPI::Interface::version()'
CMakeFiles/digikam_bin.dir/__/utilities/setup/setupplugins.o: In function `Digikam::SetupPlugins::SetupPlugins(QWidget*)':
setupplugins.cpp:(.text+0x421): undefined reference to `KIPI::PluginLoader::instance()'
setupplugins.cpp:(.text+0x42c): undefined reference to `KIPI::PluginLoader::configWidget(QWidget*)'
CMakeFiles/digikam_bin.dir/__/utilities/setup/setupplugins.o: In function `Digikam::SetupPlugins::SetupPlugins(QWidget*)':
setupplugins.cpp:(.text+0x801): undefined reference to `KIPI::PluginLoader::instance()'
setupplugins.cpp:(.text+0x80c): undefined reference to `KIPI::PluginLoader::configWidget(QWidget*)'
CMakeFiles/digikam_bin.dir/__/utilities/setup/setupplugins.o: In function `Digikam::SetupPlugins::applyPlugins()':
setupplugins.cpp:(.text+0x19): undefined reference to `KIPI::ConfigWidget::apply()'
CMakeFiles/digikam_bin.dir/__/utilities/cameragui/cameraui.o: In function `Digikam::CameraUI::slotComponentsInfo()':
cameraui.cpp:(.text+0x5e57): undefined reference to `KIPI::Interface::version()'
CMakeFiles/digikam_bin.dir/__/utilities/lighttable/lighttablewindow.o: In function `Digikam::LightTableWindow::slotComponentsInfo()':
lighttablewindow.cpp:(.text+0x3f47): undefined reference to `KIPI::Interface::version()'
CMakeFiles/digikam_bin.dir/__/utilities/kipiiface/kipiimageinfo.o: In function `Digikam::KipiImageInfo::~KipiImageInfo()':
kipiimageinfo.cpp:(.text+0xb9): undefined reference to `vtable for KIPI::ImageInfoShared'
kipiimageinfo.cpp:(.text+0xe3): undefined reference to `vtable for KIPI::ImageInfoShared'
CMakeFiles/digikam_bin.dir/__/utilities/kipiiface/kipiimageinfo.o: In function `Digikam::KipiImageInfo::~KipiImageInfo()':
kipiimageinfo.cpp:(.text+0x125): undefined reference to `vtable for KIPI::ImageInfoShared'
kipiimageinfo.cpp:(.text+0x14b): undefined reference to `vtable for KIPI::ImageInfoShared'
CMakeFiles/digikam_bin.dir/__/utilities/kipiiface/kipiimageinfo.o: In function `Digikam::KipiImageInfo::~KipiImageInfo()':
kipiimageinfo.cpp:(.text+0x185): undefined reference to `vtable for KIPI::ImageInfoShared'
CMakeFiles/digikam_bin.dir/__/utilities/kipiiface/kipiimageinfo.o:kipiimageinfo.cpp:(.text+0x1ab): more undefined references to `vtable for KIPI::ImageInfoShared' follow
CMakeFiles/digikam_bin.dir/__/utilities/kipiiface/kipiimageinfo.o: In function `Digikam::KipiImageInfo::KipiImageInfo(KIPI::Interface*, KUrl const&)':
kipiimageinfo.cpp:(.text+0x1e3): undefined reference to `KIPI::ImageInfoShared::ImageInfoShared(KIPI::Interface*, KUrl const&)'
kipiimageinfo.cpp:(.text+0x239): undefined reference to `vtable for KIPI::ImageInfoShared'
CMakeFiles/digikam_bin.dir/__/utilities/kipiiface/kipiimageinfo.o: In function `Digikam::KipiImageInfo::KipiImageInfo(KIPI::Interface*, KUrl const&)':
kipiimageinfo.cpp:(.text+0x293): undefined reference to `KIPI::ImageInfoShared::ImageInfoShared(KIPI::Interface*, KUrl const&)'
kipiimageinfo.cpp:(.text+0x2e9): undefined reference to `vtable for KIPI::ImageInfoShared'
CMakeFiles/digikam_bin.dir/__/utilities/kipiiface/kipiimageinfo.o:(.rodata._ZTVN7Digikam13KipiImageInfoE[vtable for Digikam::KipiImageInfo]+0x60): undefined reference to `KIPI::ImageInfoShared::path()'
CMakeFiles/digikam_bin.dir/__/utilities/kipiiface/kipiimageinfo.o:(.rodata._ZTVN7Digikam13KipiImageInfoE[vtable for Digikam::KipiImageInfo]+0x78): undefined reference to `KIPI::ImageInfoShared::isTimeExact()'
CMakeFiles/digikam_bin.dir/__/utilities/kipiiface/kipiimageinfo.o:(.rodata._ZTVN7Digikam13KipiImageInfoE[vtable for Digikam::KipiImageInfo]+0x80): undefined reference to `KIPI::ImageInfoShared::size()'
CMakeFiles/digikam_bin.dir/__/utilities/kipiiface/kipiimageinfo.o:(.rodata._ZTIN7Digikam13KipiImageInfoE[typeinfo for Digikam::KipiImageInfo]+0x10): undefined reference to `typeinfo for KIPI::ImageInfoShared'
CMakeFiles/digikam_bin.dir/__/utilities/kipiiface/kipiimagecollection.o: In function `Digikam::KipiImageCollection::KipiImageCollection(Digikam::KipiImageCollection::Type, Digikam::Album*, QString const&)':
kipiimagecollection.cpp:(.text+0x394): undefined reference to `KIPI::ImageCollectionShared::ImageCollectionShared()'
kipiimagecollection.cpp:(.text+0x430): undefined reference to `vtable for KIPI::ImageCollectionShared'
CMakeFiles/digikam_bin.dir/__/utilities/kipiiface/kipiimagecollection.o: In function `Digikam::KipiImageCollection::KipiImageCollection(Digikam::KipiImageCollection::Type, Digikam::Album*, QString const&)':
kipiimagecollection.cpp:(.text+0x474): undefined reference to `KIPI::ImageCollectionShared::ImageCollectionShared()'
kipiimagecollection.cpp:(.text+0x510): undefined reference to `vtable for KIPI::ImageCollectionShared'
CMakeFiles/digikam_bin.dir/__/utilities/kipiiface/kipiimagecollection.o: In function `Digikam::KipiImageCollection::~KipiImageCollection()':
kipiimagecollection.cpp:(.text+0x54c): undefined reference to `vtable for KIPI::ImageCollectionShared'
kipiimagecollection.cpp:(.text+0x564): undefined reference to `vtable for KIPI::ImageCollectionShared'
kipiimagecollection.cpp:(.text+0x570): undefined reference to `vtable for KIPI::ImageCollectionShared'
CMakeFiles/digikam_bin.dir/__/utilities/kipiiface/kipiimagecollection.o: In function `Digikam::KipiImageCollection::~KipiImageCollection()':
kipiimagecollection.cpp:(.text+0x59c): undefined reference to `vtable for KIPI::ImageCollectionShared'
CMakeFiles/digikam_bin.dir/__/utilities/kipiiface/kipiimagecollection.o:kipiimagecollection.cpp:(.text+0x5c1): more undefined references to `vtable for KIPI::ImageCollectionShared' follow
CMakeFiles/digikam_bin.dir/__/utilities/kipiiface/kipiimagecollection.o:(.rodata._ZTIN7Digikam19KipiImageCollectionE[typeinfo for Digikam::KipiImageCollection]+0x10): undefined reference to `typeinfo for KIPI::ImageCollectionShared'
CMakeFiles/digikam_bin.dir/__/utilities/kipiiface/kipiimagecollectionselector.o: In function `Digikam::KipiImageCollectionSelector::~KipiImageCollectionSelector()':
kipiimagecollectionselector.cpp:(.text+0x40): undefined reference to `KIPI::ImageCollectionSelector::~ImageCollectionSelector()'
CMakeFiles/digikam_bin.dir/__/utilities/kipiiface/kipiimagecollectionselector.o: In function `Digikam::KipiImageCollectionSelector::selectedImageCollections() const':
kipiimagecollectionselector.cpp:(.text+0x1bd): undefined reference to `KIPI::ImageCollection::ImageCollection(KIPI::ImageCollectionShared*)'
kipiimagecollectionselector.cpp:(.text+0x1d0): undefined reference to `KIPI::ImageCollection::~ImageCollection()'
kipiimagecollectionselector.cpp:(.text+0x265): undefined reference to `KIPI::ImageCollection::ImageCollection(KIPI::ImageCollectionShared*)'
kipiimagecollectionselector.cpp:(.text+0x278): undefined reference to `KIPI::ImageCollection::~ImageCollection()'
kipiimagecollectionselector.cpp:(.text+0x30d): undefined reference to `KIPI::ImageCollection::ImageCollection(KIPI::ImageCollectionShared*)'
kipiimagecollectionselector.cpp:(.text+0x320): undefined reference to `KIPI::ImageCollection::~ImageCollection()'
kipiimagecollectionselector.cpp:(.text+0x4af): undefined reference to `KIPI::ImageCollection::~ImageCollection()'
kipiimagecollectionselector.cpp:(.text+0x4da): undefined reference to `KIPI::ImageCollection::~ImageCollection()'
kipiimagecollectionselector.cpp:(.text+0x508): undefined reference to `KIPI::ImageCollection::~ImageCollection()'
CMakeFiles/digikam_bin.dir/__/utilities/kipiiface/kipiimagecollectionselector.o: In function `Digikam::KipiImageCollectionSelector::qt_metacall(QMetaObject::Call, int, void**)':
kipiimagecollectionselector.cpp:(.text+0x1521): undefined reference to `KIPI::ImageCollectionSelector::qt_metacall(QMetaObject::Call, int, void**)'
CMakeFiles/digikam_bin.dir/__/utilities/kipiiface/kipiimagecollectionselector.o: In function `Digikam::KipiImageCollectionSelector::KipiImageCollectionSelector(Digikam::KipiInterface*, QWidget*)':
kipiimagecollectionselector.cpp:(.text+0x250b): undefined reference to `KIPI::ImageCollectionSelector::ImageCollectionSelector(QWidget*)'
kipiimagecollectionselector.cpp:(.text+0x2c84): undefined reference to `KIPI::ImageCollectionSelector::~ImageCollectionSelector()'
CMakeFiles/digikam_bin.dir/__/utilities/kipiiface/kipiimagecollectionselector.o: In function `Digikam::KipiImageCollectionSelector::KipiImageCollectionSelector(Digikam::KipiInterface*, QWidget*)':
kipiimagecollectionselector.cpp:(.text+0x2e2b): undefined reference to `KIPI::ImageCollectionSelector::ImageCollectionSelector(QWidget*)'
kipiimagecollectionselector.cpp:(.text+0x35a4): undefined reference to `KIPI::ImageCollectionSelector::~ImageCollectionSelector()'
CMakeFiles/digikam_bin.dir/__/utilities/kipiiface/kipiimagecollectionselector.o: In function `Digikam::KipiImageCollectionSelector::~KipiImageCollectionSelector()':
kipiimagecollectionselector.cpp:(.text+0x81): undefined reference to `KIPI::ImageCollectionSelector::~ImageCollectionSelector()'
CMakeFiles/digikam_bin.dir/__/utilities/kipiiface/kipiimagecollectionselector.o: In function `Digikam::KipiImageCollectionSelector::~KipiImageCollectionSelector()':
kipiimagecollectionselector.cpp:(.text+0xb1): undefined reference to `KIPI::ImageCollectionSelector::~ImageCollectionSelector()'
CMakeFiles/digikam_bin.dir/__/utilities/kipiiface/kipiimagecollectionselector.o: In function `Digikam::KipiImageCollectionSelector::qt_metacast(char const*)':
kipiimagecollectionselector.cpp:(.text+0xf7): undefined reference to `KIPI::ImageCollectionSelector::qt_metacast(char const*)'
CMakeFiles/digikam_bin.dir/__/utilities/kipiiface/kipiimagecollectionselector.o: In function `QList<KIPI::ImageCollection>::free(QListData::Data*)':
kipiimagecollectionselector.cpp:(.text._ZN5QListIN4KIPI15ImageCollectionEE4freeEPN9QListData4DataE[QList<KIPI::ImageCollection>::free(QListData::Data*)]+0x41): undefined reference to `KIPI::ImageCollection::~ImageCollection()'
CMakeFiles/digikam_bin.dir/__/utilities/kipiiface/kipiimagecollectionselector.o: In function `QList<KIPI::ImageCollection>::append(KIPI::ImageCollection const&)':
kipiimagecollectionselector.cpp:(.text._ZN5QListIN4KIPI15ImageCollectionEE6appendERKS1_[QList<KIPI::ImageCollection>::append(KIPI::ImageCollection const&)]+0x88): undefined reference to `KIPI::ImageCollection::ImageCollection(KIPI::ImageCollection const&)'
kipiimagecollectionselector.cpp:(.text._ZN5QListIN4KIPI15ImageCollectionEE6appendERKS1_[QList<KIPI::ImageCollection>::append(KIPI::ImageCollection const&)]+0xc9): undefined reference to `KIPI::ImageCollection::ImageCollection(KIPI::ImageCollection const&)'
CMakeFiles/digikam_bin.dir/__/utilities/kipiiface/kipiimagecollectionselector.o:(.rodata+0x0): undefined reference to `KIPI::ImageCollectionSelector::staticMetaObject'
CMakeFiles/digikam_bin.dir/__/utilities/kipiiface/kipiimagecollectionselector.o:(.rodata._ZTIN7Digikam27KipiImageCollectionSelectorE[typeinfo for Digikam::KipiImageCollectionSelector]+0x10): undefined reference to `typeinfo for KIPI::ImageCollectionSelector'
CMakeFiles/digikam_bin.dir/__/utilities/kipiiface/kipiuploadwidget.o: In function `Digikam::KipiUploadWidget::~KipiUploadWidget()':
kipiuploadwidget.cpp:(.text+0x40): undefined reference to `KIPI::UploadWidget::~UploadWidget()'
CMakeFiles/digikam_bin.dir/__/utilities/kipiiface/kipiuploadwidget.o: In function `Digikam::KipiUploadWidget::selectedImageCollection() const':
kipiuploadwidget.cpp:(.text+0x140): undefined reference to `KIPI::ImageCollection::ImageCollection()'
kipiuploadwidget.cpp:(.text+0x19d): undefined reference to `KIPI::ImageCollection::ImageCollection(KIPI::ImageCollectionShared*)'
kipiuploadwidget.cpp:(.text+0x1a8): undefined reference to `KIPI::ImageCollection::operator=(KIPI::ImageCollection const&)'
kipiuploadwidget.cpp:(.text+0x1b0): undefined reference to `KIPI::ImageCollection::~ImageCollection()'
kipiuploadwidget.cpp:(.text+0x1f5): undefined reference to `KIPI::ImageCollection::~ImageCollection()'
kipiuploadwidget.cpp:(.text+0x1fd): undefined reference to `KIPI::ImageCollection::~ImageCollection()'
CMakeFiles/digikam_bin.dir/__/utilities/kipiiface/kipiuploadwidget.o: In function `Digikam::KipiUploadWidget::qt_metacall(QMetaObject::Call, int, void**)':
kipiuploadwidget.cpp:(.text+0x7a1): undefined reference to `KIPI::UploadWidget::qt_metacall(QMetaObject::Call, int, void**)'
CMakeFiles/digikam_bin.dir/__/utilities/kipiiface/kipiuploadwidget.o: In function `Digikam::KipiUploadWidget::KipiUploadWidget(Digikam::KipiInterface*, QWidget*)':
kipiuploadwidget.cpp:(.text+0xc84): undefined reference to `KIPI::UploadWidget::UploadWidget(QWidget*)'
kipiuploadwidget.cpp:(.text+0xe9e): undefined reference to `KIPI::UploadWidget::~UploadWidget()'
CMakeFiles/digikam_bin.dir/__/utilities/kipiiface/kipiuploadwidget.o: In function `Digikam::KipiUploadWidget::KipiUploadWidget(Digikam::KipiInterface*, QWidget*)':
kipiuploadwidget.cpp:(.text+0xf14): undefined reference to `KIPI::UploadWidget::UploadWidget(QWidget*)'
kipiuploadwidget.cpp:(.text+0x112e): undefined reference to `KIPI::UploadWidget::~UploadWidget()'
CMakeFiles/digikam_bin.dir/__/utilities/kipiiface/kipiuploadwidget.o: In function `Digikam::KipiUploadWidget::~KipiUploadWidget()':
kipiuploadwidget.cpp:(.text+0x81): undefined reference to `KIPI::UploadWidget::~UploadWidget()'
CMakeFiles/digikam_bin.dir/__/utilities/kipiiface/kipiuploadwidget.o: In function `Digikam::KipiUploadWidget::~KipiUploadWidget()':
kipiuploadwidget.cpp:(.text+0xb1): undefined reference to `KIPI::UploadWidget::~UploadWidget()'
CMakeFiles/digikam_bin.dir/__/utilities/kipiiface/kipiuploadwidget.o: In function `Digikam::KipiUploadWidget::qt_metacast(char const*)':
kipiuploadwidget.cpp:(.text+0xf7): undefined reference to `KIPI::UploadWidget::qt_metacast(char const*)'
CMakeFiles/digikam_bin.dir/__/utilities/kipiiface/kipiuploadwidget.o:(.rodata+0x0): undefined reference to `KIPI::UploadWidget::staticMetaObject'
CMakeFiles/digikam_bin.dir/__/utilities/kipiiface/kipiuploadwidget.o:(.rodata._ZTIN7Digikam16KipiUploadWidgetE[typeinfo for Digikam::KipiUploadWidget]+0x10): undefined reference to `typeinfo for KIPI::UploadWidget'
CMakeFiles/digikam_bin.dir/__/utilities/kipiiface/kipiinterface.o: In function `Digikam::KipiInterface::slotThumbnailLoaded(Digikam::LoadingDescription const&, QPixmap const&)':
kipiinterface.cpp:(.text+0x10b): undefined reference to `KIPI::Interface::gotThumbnail(KUrl const&, QPixmap const&)'
CMakeFiles/digikam_bin.dir/__/utilities/kipiiface/kipiinterface.o: In function `Digikam::KipiInterface::info(KUrl const&)':
kipiinterface.cpp:(.text+0x1a3): undefined reference to `KIPI::ImageInfo::ImageInfo(KIPI::ImageInfoShared*)'
CMakeFiles/digikam_bin.dir/__/utilities/kipiiface/kipiinterface.o: In function `Digikam::KipiInterface::~KipiInterface()':
kipiinterface.cpp:(.text+0x1ec): undefined reference to `KIPI::Interface::~Interface()'
CMakeFiles/digikam_bin.dir/__/utilities/kipiiface/kipiinterface.o: In function `Digikam::KipiInterface::KipiInterface(QObject*, char const*)':
kipiinterface.cpp:(.text+0x22a): undefined reference to `KIPI::Interface::Interface(QObject*, char const*)'
kipiinterface.cpp:(.text+0x2a9): undefined reference to `KIPI::Interface::~Interface()'
CMakeFiles/digikam_bin.dir/__/utilities/kipiiface/kipiinterface.o: In function `Digikam::KipiInterface::KipiInterface(QObject*, char const*)':
kipiinterface.cpp:(.text+0x2ca): undefined reference to `KIPI::Interface::Interface(QObject*, char const*)'
kipiinterface.cpp:(.text+0x349): undefined reference to `KIPI::Interface::~Interface()'
CMakeFiles/digikam_bin.dir/__/utilities/kipiiface/kipiinterface.o: In function `Digikam::KipiInterface::qt_metacall(QMetaObject::Call, int, void**)':
kipiinterface.cpp:(.text+0x381): undefined reference to `KIPI::Interface::qt_metacall(QMetaObject::Call, int, void**)'
kipiinterface.cpp:(.text+0x3b6): undefined reference to `KIPI::Interface::selectionChanged(bool)'
CMakeFiles/digikam_bin.dir/__/utilities/kipiiface/kipiinterface.o: In function `Digikam::KipiInterface::allAlbums()':
kipiinterface.cpp:(.text+0x74a): undefined reference to `KIPI::ImageCollection::ImageCollection(KIPI::ImageCollectionShared*)'
kipiinterface.cpp:(.text+0x75d): undefined reference to `KIPI::ImageCollection::~ImageCollection()'
kipiinterface.cpp:(.text+0x85a): undefined reference to `KIPI::ImageCollection::ImageCollection(KIPI::ImageCollectionShared*)'
kipiinterface.cpp:(.text+0x86d): undefined reference to `KIPI::ImageCollection::~ImageCollection()'
kipiinterface.cpp:(.text+0x949): undefined reference to `KIPI::ImageCollection::~ImageCollection()'
kipiinterface.cpp:(.text+0x979): undefined reference to `KIPI::ImageCollection::~ImageCollection()'
CMakeFiles/digikam_bin.dir/__/utilities/kipiiface/kipiinterface.o: In function `Digikam::KipiInterface::currentSelection()':
kipiinterface.cpp:(.text+0xa65): undefined reference to `KIPI::ImageCollection::ImageCollection(KIPI::ImageCollectionShared*)'
kipiinterface.cpp:(.text+0xaa6): undefined reference to `KIPI::ImageCollection::ImageCollection(KIPI::ImageCollectionShared*)'
CMakeFiles/digikam_bin.dir/__/utilities/kipiiface/kipiinterface.o: In function `Digikam::KipiInterface::currentAlbum()':
kipiinterface.cpp:(.text+0xb32): undefined reference to `KIPI::ImageCollection::ImageCollection(KIPI::ImageCollectionShared*)'
kipiinterface.cpp:(.text+0xb76): undefined reference to `KIPI::ImageCollection::ImageCollection(KIPI::ImageCollectionShared*)'
CMakeFiles/digikam_bin.dir/__/utilities/kipiiface/kipiinterface.o: In function `Digikam::KipiInterface::slotCurrentAlbumChanged(Digikam::Album*)':
kipiinterface.cpp:(.text+0x14c): undefined reference to `KIPI::Interface::currentAlbumChanged(bool)'
CMakeFiles/digikam_bin.dir/__/utilities/kipiiface/kipiinterface.o: In function `Digikam::KipiInterface::slotSelectionChanged(bool)':
kipiinterface.cpp:(.text+0x155): undefined reference to `KIPI::Interface::selectionChanged(bool)'
CMakeFiles/digikam_bin.dir/__/utilities/kipiiface/kipiinterface.o: In function `Digikam::KipiInterface::~KipiInterface()':
kipiinterface.cpp:(.text+0x208): undefined reference to `KIPI::Interface::~Interface()'
CMakeFiles/digikam_bin.dir/__/utilities/kipiiface/kipiinterface.o: In function `Digikam::KipiInterface::~KipiInterface()':
kipiinterface.cpp:(.text+0x218): undefined reference to `KIPI::Interface::~Interface()'
CMakeFiles/digikam_bin.dir/__/utilities/kipiiface/kipiinterface.o: In function `Digikam::KipiInterface::qt_metacast(char const*)':
kipiinterface.cpp:(.text+0x447): undefined reference to `KIPI::Interface::qt_metacast(char const*)'
CMakeFiles/digikam_bin.dir/__/utilities/kipiiface/kipiinterface.o:(.rodata+0x0): undefined reference to `KIPI::Interface::staticMetaObject'
CMakeFiles/digikam_bin.dir/__/utilities/kipiiface/kipiinterface.o:(.rodata._ZTIN7Digikam13KipiInterfaceE[typeinfo for Digikam::KipiInterface]+0x10): undefined reference to `typeinfo for KIPI::Interface'
CMakeFiles/digikam_bin.dir/albumiconview.o: In function `Digikam::AlbumIconView::slotRightButtonClicked(Digikam::IconItem*, QPoint const&)':
albumiconview.cpp:(.text+0xbda0): undefined reference to `KIPI::PluginLoader::instance()'
albumiconview.cpp:(.text+0xbda8): undefined reference to `KIPI::PluginLoader::pluginList()'
albumiconview.cpp:(.text+0xbe66): undefined reference to `KIPI::PluginLoader::Info::plugin() const'
albumiconview.cpp:(.text+0xbe8b): undefined reference to `KIPI::PluginLoader::Info::name() const'
albumiconview.cpp:(.text+0xbf7f): undefined reference to `KIPI::Plugin::actions(QWidget*)'
CMakeFiles/digikam_bin.dir/albumwidgetstack.o: In function `Digikam::AlbumWidgetStack::AlbumWidgetStack(QWidget*)':
albumwidgetstack.cpp:(.text+0x1b7e): undefined reference to `KHTMLPart::view() const'
CMakeFiles/digikam_bin.dir/albumwidgetstack.o: In function `Digikam::AlbumWidgetStack::AlbumWidgetStack(QWidget*)':
albumwidgetstack.cpp:(.text+0x1f6e): undefined reference to `KHTMLPart::view() const'
CMakeFiles/digikam_bin.dir/digikamapp.o: In function `Digikam::DigikamApp::slotKipiPluginPlug()':
digikamapp.cpp:(.text+0x2455): undefined reference to `KIPI::PluginLoader::pluginList()'
digikamapp.cpp:(.text+0x24f8): undefined reference to `KIPI::PluginLoader::Info::plugin() const'
digikamapp.cpp:(.text+0x2511): undefined reference to `KIPI::PluginLoader::Info::shouldLoad() const'
digikamapp.cpp:(.text+0x2539): undefined reference to `KIPI::Plugin::actions(QWidget*)'
CMakeFiles/digikam_bin.dir/digikamapp.o: In function `Digikam::DigikamApp::slotSetupCamera()':
digikamapp.cpp:(.text+0x4019): undefined reference to `KIPI::PluginLoader::pluginList()'
CMakeFiles/digikam_bin.dir/digikamapp.o: In function `Digikam::DigikamApp::setup(bool)':
digikamapp.cpp:(.text+0x411d): undefined reference to `KIPI::PluginLoader::pluginList()'
CMakeFiles/digikam_bin.dir/digikamapp.o: In function `Digikam::DigikamApp::slotEditKeys()':
digikamapp.cpp:(.text+0x996d): undefined reference to `KIPI::PluginLoader::pluginList()'
digikamapp.cpp:(.text+0x99ef): undefined reference to `KIPI::PluginLoader::Info::plugin() const'
digikamapp.cpp:(.text+0x9a03): undefined reference to `KIPI::PluginLoader::Info::comment() const'
digikamapp.cpp:(.text+0x9a0d): undefined reference to `KIPI::Plugin::actionCollection(QWidget*)'
CMakeFiles/digikam_bin.dir/digikamapp.o: In function `Digikam::DigikamApp::slotComponentsInfo()':
digikamapp.cpp:(.text+0x9d9f): undefined reference to `KIPI::Interface::version()'
CMakeFiles/digikam_bin.dir/digikamapp.o: In function `Digikam::DigikamApp::loadPlugins()':
digikamapp.cpp:(.text+0xcc20): undefined reference to `KIPI::PluginLoader::PluginLoader(QStringList const&, KIPI::Interface*)'
digikamapp.cpp:(.text+0xcc5c): undefined reference to `KIPI::PluginLoader::loadPlugins()'
CMakeFiles/digikam_bin.dir/imagepreviewview.o: In function `Digikam::ImagePreviewView::slotContextMenu()':
imagepreviewview.cpp:(.text+0x228b): undefined reference to `KIPI::PluginLoader::instance()'
imagepreviewview.cpp:(.text+0x2293): undefined reference to `KIPI::PluginLoader::pluginList()'
imagepreviewview.cpp:(.text+0x2346): undefined reference to `KIPI::PluginLoader::Info::plugin() const'
imagepreviewview.cpp:(.text+0x2369): undefined reference to `KIPI::PluginLoader::Info::name() const'
imagepreviewview.cpp:(.text+0x23ea): undefined reference to `KIPI::Plugin::actions(QWidget*)'
CMakeFiles/digikam_bin.dir/welcomepageview.o: In function `Digikam::WelcomePageView::~WelcomePageView()':
welcomepageview.cpp:(.text+0x6b): undefined reference to `KHTMLPart::~KHTMLPart()'
welcomepageview.cpp:(.text+0x8d): undefined reference to `KHTMLPart::~KHTMLPart()'
CMakeFiles/digikam_bin.dir/welcomepageview.o: In function `Digikam::WelcomePageView::~WelcomePageView()':
welcomepageview.cpp:(.text+0x10c): undefined reference to `KHTMLPart::~KHTMLPart()'
welcomepageview.cpp:(.text+0x133): undefined reference to `KHTMLPart::~KHTMLPart()'
CMakeFiles/digikam_bin.dir/welcomepageview.o: In function `Digikam::WelcomePageView::~WelcomePageView()':
welcomepageview.cpp:(.text+0x1bc): undefined reference to `KHTMLPart::~KHTMLPart()'
CMakeFiles/digikam_bin.dir/welcomepageview.o:welcomepageview.cpp:(.text+0x1db): more undefined references to `KHTMLPart::~KHTMLPart()' follow
CMakeFiles/digikam_bin.dir/welcomepageview.o: In function `Digikam::WelcomePageView::WelcomePageView(QWidget*)':
welcomepageview.cpp:(.text+0x22d): undefined reference to `KHTMLPart::KHTMLPart(QWidget*, QObject*, KHTMLPart::GUIProfile)'
welcomepageview.cpp:(.text+0x26c): undefined reference to `KHTMLPart::setPluginsEnabled(bool)'
welcomepageview.cpp:(.text+0x276): undefined reference to `KHTMLPart::setJScriptEnabled(bool)'
welcomepageview.cpp:(.text+0x280): undefined reference to `KHTMLPart::setJavaEnabled(bool)'
welcomepageview.cpp:(.text+0x28a): undefined reference to `KHTMLPart::setMetaRefreshEnabled(bool)'
welcomepageview.cpp:(.text+0x2a2): undefined reference to `KHTMLPart::setURLCursor(QCursor const&)'
welcomepageview.cpp:(.text+0x2b2): undefined reference to `KHTMLPart::view() const'
welcomepageview.cpp:(.text+0x2c2): undefined reference to `KHTMLPart::browserExtension() const'
welcomepageview.cpp:(.text+0x342): undefined reference to `KHTMLPart::~KHTMLPart()'
CMakeFiles/digikam_bin.dir/welcomepageview.o: In function `Digikam::WelcomePageView::WelcomePageView(QWidget*)':
welcomepageview.cpp:(.text+0x36d): undefined reference to `KHTMLPart::KHTMLPart(QWidget*, QObject*, KHTMLPart::GUIProfile)'
welcomepageview.cpp:(.text+0x3b0): undefined reference to `KHTMLPart::setPluginsEnabled(bool)'
welcomepageview.cpp:(.text+0x3ba): undefined reference to `KHTMLPart::setJScriptEnabled(bool)'
welcomepageview.cpp:(.text+0x3c4): undefined reference to `KHTMLPart::setJavaEnabled(bool)'
welcomepageview.cpp:(.text+0x3ce): undefined reference to `KHTMLPart::setMetaRefreshEnabled(bool)'
welcomepageview.cpp:(.text+0x3e6): undefined reference to `KHTMLPart::setURLCursor(QCursor const&)'
welcomepageview.cpp:(.text+0x3f6): undefined reference to `KHTMLPart::view() const'
welcomepageview.cpp:(.text+0x406): undefined reference to `KHTMLPart::browserExtension() const'
welcomepageview.cpp:(.text+0x469): undefined reference to `KHTMLPart::~KHTMLPart()'
CMakeFiles/digikam_bin.dir/welcomepageview.o: In function `Digikam::WelcomePageView::slotThemeChanged()':
welcomepageview.cpp:(.text+0x3efd): undefined reference to `KHTMLPart::show()'
CMakeFiles/digikam_bin.dir/welcomepageview.o: In function `Digikam::WelcomePageView::qt_metacall(QMetaObject::Call, int, void**)':
welcomepageview.cpp:(.text+0x4421): undefined reference to `KHTMLPart::qt_metacall(QMetaObject::Call, int, void**)'
CMakeFiles/digikam_bin.dir/welcomepageview.o: In function `Digikam::WelcomePageView::qt_metacast(char const*)':
welcomepageview.cpp:(.text+0x4c7): undefined reference to `KHTMLPart::qt_metacast(char const*)'
CMakeFiles/digikam_bin.dir/welcomepageview.o:(.rodata+0x0): undefined reference to `KHTMLPart::staticMetaObject'
CMakeFiles/digikam_bin.dir/welcomepageview.o:(.rodata._ZTVN7Digikam15WelcomePageViewE[vtable for Digikam::WelcomePageView]+0x50): undefined reference to `KHTMLPart::timerEvent(QTimerEvent*)'
CMakeFiles/digikam_bin.dir/welcomepageview.o:(.rodata._ZTVN7Digikam15WelcomePageViewE[vtable for Digikam::WelcomePageView]+0x60): undefined reference to `KHTMLPart::customEvent(QEvent*)'
CMakeFiles/digikam_bin.dir/welcomepageview.o:(.rodata._ZTVN7Digikam15WelcomePageViewE[vtable for Digikam::WelcomePageView]+0xb8): undefined reference to `KHTMLPart::guiActivateEvent(KParts::GUIActivateEvent*)'
CMakeFiles/digikam_bin.dir/welcomepageview.o:(.rodata._ZTVN7Digikam15WelcomePageViewE[vtable for Digikam::WelcomePageView]+0xc0): undefined reference to `KHTMLPart::openUrl(KUrl const&)'
CMakeFiles/digikam_bin.dir/welcomepageview.o:(.rodata._ZTVN7Digikam15WelcomePageViewE[vtable for Digikam::WelcomePageView]+0xc8): undefined reference to `KHTMLPart::closeUrl()'
CMakeFiles/digikam_bin.dir/welcomepageview.o:(.rodata._ZTVN7Digikam15WelcomePageViewE[vtable for Digikam::WelcomePageView]+0xd0): undefined reference to `KHTMLPart::doOpenStream(QString const&)'
CMakeFiles/digikam_bin.dir/welcomepageview.o:(.rodata._ZTVN7Digikam15WelcomePageViewE[vtable for Digikam::WelcomePageView]+0xd8): undefined reference to `KHTMLPart::doWriteStream(QByteArray const&)'
CMakeFiles/digikam_bin.dir/welcomepageview.o:(.rodata._ZTVN7Digikam15WelcomePageViewE[vtable for Digikam::WelcomePageView]+0xe0): undefined reference to `KHTMLPart::doCloseStream()'
CMakeFiles/digikam_bin.dir/welcomepageview.o:(.rodata._ZTVN7Digikam15WelcomePageViewE[vtable for Digikam::WelcomePageView]+0xe8): undefined reference to `KHTMLPart::openFile()'
CMakeFiles/digikam_bin.dir/welcomepageview.o:(.rodata._ZTVN7Digikam15WelcomePageViewE[vtable for Digikam::WelcomePageView]+0xf0): undefined reference to `KHTMLPart::showError(KJob*)'
CMakeFiles/digikam_bin.dir/welcomepageview.o:(.rodata._ZTVN7Digikam15WelcomePageViewE[vtable for Digikam::WelcomePageView]+0xf8): undefined reference to `KHTMLPart::begin(KUrl const&, int, int)'
CMakeFiles/digikam_bin.dir/welcomepageview.o:(.rodata._ZTVN7Digikam15WelcomePageViewE[vtable for Digikam::WelcomePageView]+0x100): undefined reference to `KHTMLPart::write(char const*, int)'
CMakeFiles/digikam_bin.dir/welcomepageview.o:(.rodata._ZTVN7Digikam15WelcomePageViewE[vtable for Digikam::WelcomePageView]+0x108): undefined reference to `KHTMLPart::write(QString const&)'
CMakeFiles/digikam_bin.dir/welcomepageview.o:(.rodata._ZTVN7Digikam15WelcomePageViewE[vtable for Digikam::WelcomePageView]+0x110): undefined reference to `KHTMLPart::end()'
CMakeFiles/digikam_bin.dir/welcomepageview.o:(.rodata._ZTVN7Digikam15WelcomePageViewE[vtable for Digikam::WelcomePageView]+0x118): undefined reference to `KHTMLPart::selectedText() const'
CMakeFiles/digikam_bin.dir/welcomepageview.o:(.rodata._ZTVN7Digikam15WelcomePageViewE[vtable for Digikam::WelcomePageView]+0x120): undefined reference to `KHTMLPart::saveState(QDataStream&)'
CMakeFiles/digikam_bin.dir/welcomepageview.o:(.rodata._ZTVN7Digikam15WelcomePageViewE[vtable for Digikam::WelcomePageView]+0x128): undefined reference to `KHTMLPart::restoreState(QDataStream&)'
CMakeFiles/digikam_bin.dir/welcomepageview.o:(.rodata._ZTVN7Digikam15WelcomePageViewE[vtable for Digikam::WelcomePageView]+0x130): undefined reference to `KHTMLPart::khtmlMousePressEvent(khtml::MousePressEvent*)'
CMakeFiles/digikam_bin.dir/welcomepageview.o:(.rodata._ZTVN7Digikam15WelcomePageViewE[vtable for Digikam::WelcomePageView]+0x138): undefined reference to `KHTMLPart::khtmlMouseDoubleClickEvent(khtml::MouseDoubleClickEvent*)'
CMakeFiles/digikam_bin.dir/welcomepageview.o:(.rodata._ZTVN7Digikam15WelcomePageViewE[vtable for Digikam::WelcomePageView]+0x140): undefined reference to `KHTMLPart::khtmlMouseMoveEvent(khtml::MouseMoveEvent*)'
CMakeFiles/digikam_bin.dir/welcomepageview.o:(.rodata._ZTVN7Digikam15WelcomePageViewE[vtable for Digikam::WelcomePageView]+0x148): undefined reference to `KHTMLPart::khtmlMouseReleaseEvent(khtml::MouseReleaseEvent*)'
CMakeFiles/digikam_bin.dir/welcomepageview.o:(.rodata._ZTVN7Digikam15WelcomePageViewE[vtable for Digikam::WelcomePageView]+0x150): undefined reference to `KHTMLPart::khtmlDrawContentsEvent(khtml::DrawContentsEvent*)'
CMakeFiles/digikam_bin.dir/welcomepageview.o:(.rodata._ZTVN7Digikam15WelcomePageViewE[vtable for Digikam::WelcomePageView]+0x158): undefined reference to `KHTMLPart::urlSelected(QString const&, int, int, QString const&, KParts::OpenUrlArguments const&, KParts::BrowserArguments const&)'
CMakeFiles/digikam_bin.dir/welcomepageview.o:(.rodata._ZTVN7Digikam15WelcomePageViewE[vtable for Digikam::WelcomePageView]+0x160): undefined reference to `KHTMLPart::createPart(QWidget*, QObject*, QString const&, QString&, QStringList&, QStringList const&)'
CMakeFiles/digikam_bin.dir/welcomepageview.o:(.rodata._ZTVN7Digikam15WelcomePageViewE[vtable for Digikam::WelcomePageView]+0x168): undefined reference to `KHTMLPart::slotFinished(KJob*)'
CMakeFiles/digikam_bin.dir/welcomepageview.o:(.rodata._ZTVN7Digikam15WelcomePageViewE[vtable for Digikam::WelcomePageView]+0x178): undefined reference to `KHTMLPart::slotViewDocumentSource()'
CMakeFiles/digikam_bin.dir/welcomepageview.o:(.rodata._ZTVN7Digikam15WelcomePageViewE[vtable for Digikam::WelcomePageView]+0x180): undefined reference to `KHTMLPart::slotViewFrameSource()'
CMakeFiles/digikam_bin.dir/welcomepageview.o:(.rodata._ZTVN7Digikam15WelcomePageViewE[vtable for Digikam::WelcomePageView]+0x188): undefined reference to `KHTMLPart::slotSaveBackground()'
CMakeFiles/digikam_bin.dir/welcomepageview.o:(.rodata._ZTVN7Digikam15WelcomePageViewE[vtable for Digikam::WelcomePageView]+0x190): undefined reference to `KHTMLPart::slotSaveDocument()'
CMakeFiles/digikam_bin.dir/welcomepageview.o:(.rodata._ZTVN7Digikam15WelcomePageViewE[vtable for Digikam::WelcomePageView]+0x198): undefined reference to `KHTMLPart::slotSaveFrame()'
CMakeFiles/digikam_bin.dir/welcomepageview.o:(.rodata._ZTVN7Digikam15WelcomePageViewE[vtable for Digikam::WelcomePageView]+0x1a0): undefined reference to `KHTMLPart::slotSecurity()'
CMakeFiles/digikam_bin.dir/welcomepageview.o:(.rodata._ZTVN7Digikam15WelcomePageViewE[vtable for Digikam::WelcomePageView]+0x1a8): undefined reference to `KHTMLPart::slotSetEncoding(QString const&)'
CMakeFiles/digikam_bin.dir/welcomepageview.o:(.rodata._ZTVN7Digikam15WelcomePageViewE[vtable for Digikam::WelcomePageView]+0x1b0): undefined reference to `KHTMLPart::slotUseStylesheet()'
CMakeFiles/digikam_bin.dir/welcomepageview.o:(.rodata._ZTVN7Digikam15WelcomePageViewE[vtable for Digikam::WelcomePageView]+0x1b8): undefined reference to `KHTMLPart::slotFind()'
CMakeFiles/digikam_bin.dir/welcomepageview.o:(.rodata._ZTVN7Digikam15WelcomePageViewE[vtable for Digikam::WelcomePageView]+0x1c0): undefined reference to `KHTMLPart::slotFindDone()'
CMakeFiles/digikam_bin.dir/welcomepageview.o:(.rodata._ZTVN7Digikam15WelcomePageViewE[vtable for Digikam::WelcomePageView]+0x1c8): undefined reference to `KHTMLPart::slotFindDialogDestroyed()'
CMakeFiles/digikam_bin.dir/welcomepageview.o:(.rodata._ZTCN7Digikam15WelcomePageViewE0_9KHTMLPart[vtable for Digikam::WelcomePageView]+0x10): undefined reference to `typeinfo for KHTMLPart'
CMakeFiles/digikam_bin.dir/welcomepageview.o:(.rodata._ZTCN7Digikam15WelcomePageViewE0_9KHTMLPart[vtable for Digikam::WelcomePageView]+0x18): undefined reference to `KHTMLPart::metaObject() const'
CMakeFiles/digikam_bin.dir/welcomepageview.o:(.rodata._ZTCN7Digikam15WelcomePageViewE0_9KHTMLPart[vtable for Digikam::WelcomePageView]+0x20): undefined reference to `KHTMLPart::qt_metacast(char const*)'
CMakeFiles/digikam_bin.dir/welcomepageview.o:(.rodata._ZTCN7Digikam15WelcomePageViewE0_9KHTMLPart[vtable for Digikam::WelcomePageView]+0x28): undefined reference to `KHTMLPart::qt_metacall(QMetaObject::Call, int, void**)'
CMakeFiles/digikam_bin.dir/welcomepageview.o:(.rodata._ZTCN7Digikam15WelcomePageViewE0_9KHTMLPart[vtable for Digikam::WelcomePageView]+0x30): undefined reference to `KHTMLPart::~KHTMLPart()'
CMakeFiles/digikam_bin.dir/welcomepageview.o:(.rodata._ZTCN7Digikam15WelcomePageViewE0_9KHTMLPart[vtable for Digikam::WelcomePageView]+0x38): undefined reference to `KHTMLPart::~KHTMLPart()'
CMakeFiles/digikam_bin.dir/welcomepageview.o:(.rodata._ZTCN7Digikam15WelcomePageViewE0_9KHTMLPart[vtable for Digikam::WelcomePageView]+0x50): undefined reference to `KHTMLPart::timerEvent(QTimerEvent*)'
CMakeFiles/digikam_bin.dir/welcomepageview.o:(.rodata._ZTCN7Digikam15WelcomePageViewE0_9KHTMLPart[vtable for Digikam::WelcomePageView]+0x60): undefined reference to `KHTMLPart::customEvent(QEvent*)'
CMakeFiles/digikam_bin.dir/welcomepageview.o:(.rodata._ZTCN7Digikam15WelcomePageViewE0_9KHTMLPart[vtable for Digikam::WelcomePageView]+0xb8): undefined reference to `KHTMLPart::guiActivateEvent(KParts::GUIActivateEvent*)'
CMakeFiles/digikam_bin.dir/welcomepageview.o:(.rodata._ZTCN7Digikam15WelcomePageViewE0_9KHTMLPart[vtable for Digikam::WelcomePageView]+0xc0): undefined reference to `KHTMLPart::openUrl(KUrl const&)'
CMakeFiles/digikam_bin.dir/welcomepageview.o:(.rodata._ZTCN7Digikam15WelcomePageViewE0_9KHTMLPart[vtable for Digikam::WelcomePageView]+0xc8): undefined reference to `KHTMLPart::closeUrl()'
CMakeFiles/digikam_bin.dir/welcomepageview.o:(.rodata._ZTCN7Digikam15WelcomePageViewE0_9KHTMLPart[vtable for Digikam::WelcomePageView]+0xd0): undefined reference to `KHTMLPart::doOpenStream(QString const&)'
CMakeFiles/digikam_bin.dir/welcomepageview.o:(.rodata._ZTCN7Digikam15WelcomePageViewE0_9KHTMLPart[vtable for Digikam::WelcomePageView]+0xd8): undefined reference to `KHTMLPart::doWriteStream(QByteArray const&)'
CMakeFiles/digikam_bin.dir/welcomepageview.o:(.rodata._ZTCN7Digikam15WelcomePageViewE0_9KHTMLPart[vtable for Digikam::WelcomePageView]+0xe0): undefined reference to `KHTMLPart::doCloseStream()'
CMakeFiles/digikam_bin.dir/welcomepageview.o:(.rodata._ZTCN7Digikam15WelcomePageViewE0_9KHTMLPart[vtable for Digikam::WelcomePageView]+0xe8): undefined reference to `KHTMLPart::openFile()'
CMakeFiles/digikam_bin.dir/welcomepageview.o:(.rodata._ZTCN7Digikam15WelcomePageViewE0_9KHTMLPart[vtable for Digikam::WelcomePageView]+0xf0): undefined reference to `KHTMLPart::showError(KJob*)'
CMakeFiles/digikam_bin.dir/welcomepageview.o:(.rodata._ZTCN7Digikam15WelcomePageViewE0_9KHTMLPart[vtable for Digikam::WelcomePageView]+0xf8): undefined reference to `KHTMLPart::begin(KUrl const&, int, int)'
CMakeFiles/digikam_bin.dir/welcomepageview.o:(.rodata._ZTCN7Digikam15WelcomePageViewE0_9KHTMLPart[vtable for Digikam::WelcomePageView]+0x100): undefined reference to `KHTMLPart::write(char const*, int)'
CMakeFiles/digikam_bin.dir/welcomepageview.o:(.rodata._ZTCN7Digikam15WelcomePageViewE0_9KHTMLPart[vtable for Digikam::WelcomePageView]+0x108): undefined reference to `KHTMLPart::write(QString const&)'
CMakeFiles/digikam_bin.dir/welcomepageview.o:(.rodata._ZTCN7Digikam15WelcomePageViewE0_9KHTMLPart[vtable for Digikam::WelcomePageView]+0x110): undefined reference to `KHTMLPart::end()'
CMakeFiles/digikam_bin.dir/welcomepageview.o:(.rodata._ZTCN7Digikam15WelcomePageViewE0_9KHTMLPart[vtable for Digikam::WelcomePageView]+0x118): undefined reference to `KHTMLPart::selectedText() const'
CMakeFiles/digikam_bin.dir/welcomepageview.o:(.rodata._ZTCN7Digikam15WelcomePageViewE0_9KHTMLPart[vtable for Digikam::WelcomePageView]+0x120): undefined reference to `KHTMLPart::saveState(QDataStream&)'
CMakeFiles/digikam_bin.dir/welcomepageview.o:(.rodata._ZTCN7Digikam15WelcomePageViewE0_9KHTMLPart[vtable for Digikam::WelcomePageView]+0x128): undefined reference to `KHTMLPart::restoreState(QDataStream&)'
CMakeFiles/digikam_bin.dir/welcomepageview.o:(.rodata._ZTCN7Digikam15WelcomePageViewE0_9KHTMLPart[vtable for Digikam::WelcomePageView]+0x130): undefined reference to `KHTMLPart::khtmlMousePressEvent(khtml::MousePressEvent*)'
CMakeFiles/digikam_bin.dir/welcomepageview.o:(.rodata._ZTCN7Digikam15WelcomePageViewE0_9KHTMLPart[vtable for Digikam::WelcomePageView]+0x138): undefined reference to `KHTMLPart::khtmlMouseDoubleClickEvent(khtml::MouseDoubleClickEvent*)'
CMakeFiles/digikam_bin.dir/welcomepageview.o:(.rodata._ZTCN7Digikam15WelcomePageViewE0_9KHTMLPart[vtable for Digikam::WelcomePageView]+0x140): undefined reference to `KHTMLPart::khtmlMouseMoveEvent(khtml::MouseMoveEvent*)'
CMakeFiles/digikam_bin.dir/welcomepageview.o:(.rodata._ZTCN7Digikam15WelcomePageViewE0_9KHTMLPart[vtable for Digikam::WelcomePageView]+0x148): undefined reference to `KHTMLPart::khtmlMouseReleaseEvent(khtml::MouseReleaseEvent*)'
CMakeFiles/digikam_bin.dir/welcomepageview.o:(.rodata._ZTCN7Digikam15WelcomePageViewE0_9KHTMLPart[vtable for Digikam::WelcomePageView]+0x150): undefined reference to `KHTMLPart::khtmlDrawContentsEvent(khtml::DrawContentsEvent*)'
CMakeFiles/digikam_bin.dir/welcomepageview.o:(.rodata._ZTCN7Digikam15WelcomePageViewE0_9KHTMLPart[vtable for Digikam::WelcomePageView]+0x158): undefined reference to `KHTMLPart::urlSelected(QString const&, int, int, QString const&, KParts::OpenUrlArguments const&, KParts::BrowserArguments const&)'
CMakeFiles/digikam_bin.dir/welcomepageview.o:(.rodata._ZTCN7Digikam15WelcomePageViewE0_9KHTMLPart[vtable for Digikam::WelcomePageView]+0x160): undefined reference to `KHTMLPart::createPart(QWidget*, QObject*, QString const&, QString&, QStringList&, QStringList const&)'
CMakeFiles/digikam_bin.dir/welcomepageview.o:(.rodata._ZTCN7Digikam15WelcomePageViewE0_9KHTMLPart[vtable for Digikam::WelcomePageView]+0x168): undefined reference to `KHTMLPart::slotFinished(KJob*)'
CMakeFiles/digikam_bin.dir/welcomepageview.o:(.rodata._ZTCN7Digikam15WelcomePageViewE0_9KHTMLPart[vtable for Digikam::WelcomePageView]+0x178): undefined reference to `KHTMLPart::slotViewDocumentSource()'
CMakeFiles/digikam_bin.dir/welcomepageview.o:(.rodata._ZTCN7Digikam15WelcomePageViewE0_9KHTMLPart[vtable for Digikam::WelcomePageView]+0x180): undefined reference to `KHTMLPart::slotViewFrameSource()'
CMakeFiles/digikam_bin.dir/welcomepageview.o:(.rodata._ZTCN7Digikam15WelcomePageViewE0_9KHTMLPart[vtable for Digikam::WelcomePageView]+0x188): undefined reference to `KHTMLPart::slotSaveBackground()'
CMakeFiles/digikam_bin.dir/welcomepageview.o:(.rodata._ZTCN7Digikam15WelcomePageViewE0_9KHTMLPart[vtable for Digikam::WelcomePageView]+0x190): undefined reference to `KHTMLPart::slotSaveDocument()'
CMakeFiles/digikam_bin.dir/welcomepageview.o:(.rodata._ZTCN7Digikam15WelcomePageViewE0_9KHTMLPart[vtable for Digikam::WelcomePageView]+0x198): undefined reference to `KHTMLPart::slotSaveFrame()'
CMakeFiles/digikam_bin.dir/welcomepageview.o:(.rodata._ZTCN7Digikam15WelcomePageViewE0_9KHTMLPart[vtable for Digikam::WelcomePageView]+0x1a0): undefined reference to `KHTMLPart::slotSecurity()'
CMakeFiles/digikam_bin.dir/welcomepageview.o:(.rodata._ZTCN7Digikam15WelcomePageViewE0_9KHTMLPart[vtable for Digikam::WelcomePageView]+0x1a8): undefined reference to `KHTMLPart::slotSetEncoding(QString const&)'
CMakeFiles/digikam_bin.dir/welcomepageview.o:(.rodata._ZTCN7Digikam15WelcomePageViewE0_9KHTMLPart[vtable for Digikam::WelcomePageView]+0x1b0): undefined reference to `KHTMLPart::slotUseStylesheet()'
CMakeFiles/digikam_bin.dir/welcomepageview.o:(.rodata._ZTCN7Digikam15WelcomePageViewE0_9KHTMLPart[vtable for Digikam::WelcomePageView]+0x1b8): undefined reference to `KHTMLPart::slotFind()'
CMakeFiles/digikam_bin.dir/welcomepageview.o:(.rodata._ZTCN7Digikam15WelcomePageViewE0_9KHTMLPart[vtable for Digikam::WelcomePageView]+0x1c0): undefined reference to `KHTMLPart::slotFindDone()'
CMakeFiles/digikam_bin.dir/welcomepageview.o:(.rodata._ZTCN7Digikam15WelcomePageViewE0_9KHTMLPart[vtable for Digikam::WelcomePageView]+0x1c8): undefined reference to `KHTMLPart::slotFindDialogDestroyed()'
CMakeFiles/digikam_bin.dir/welcomepageview.o:(.rodata._ZTCN7Digikam15WelcomePageViewE0_9KHTMLPart[vtable for Digikam::WelcomePageView]+0x1e0): undefined reference to `typeinfo for KHTMLPart'
CMakeFiles/digikam_bin.dir/welcomepageview.o:(.rodata._ZTCN7Digikam15WelcomePageViewE0_9KHTMLPart[vtable for Digikam::WelcomePageView]+0x1e8): undefined reference to `non-virtual thunk to KHTMLPart::~KHTMLPart()'
CMakeFiles/digikam_bin.dir/welcomepageview.o:(.rodata._ZTCN7Digikam15WelcomePageViewE0_9KHTMLPart[vtable for Digikam::WelcomePageView]+0x1f0): undefined reference to `non-virtual thunk to KHTMLPart::~KHTMLPart()'
CMakeFiles/digikam_bin.dir/welcomepageview.o:(.rodata._ZTCN7Digikam15WelcomePageViewE0_9KHTMLPart[vtable for Digikam::WelcomePageView]+0x280): undefined reference to `typeinfo for KHTMLPart'
CMakeFiles/digikam_bin.dir/welcomepageview.o:(.rodata._ZTCN7Digikam15WelcomePageViewE0_9KHTMLPart[vtable for Digikam::WelcomePageView]+0x288): undefined reference to `virtual thunk to KHTMLPart::~KHTMLPart()'
CMakeFiles/digikam_bin.dir/welcomepageview.o:(.rodata._ZTCN7Digikam15WelcomePageViewE0_9KHTMLPart[vtable for Digikam::WelcomePageView]+0x290): undefined reference to `virtual thunk to KHTMLPart::~KHTMLPart()'
CMakeFiles/digikam_bin.dir/welcomepageview.o:(.rodata._ZTIN7Digikam15WelcomePageViewE[typeinfo for Digikam::WelcomePageView]+0x10): undefined reference to `typeinfo for KHTMLPart'
collect2: ld returned 1 exit status
make[2]: *** [digikam/digikam/digikam] Error 1
make[1]: *** [digikam/digikam/CMakeFiles/digikam_bin.dir/all] Error 2
make: *** [all] Error 2
 *
 * ERROR: media-gfx/digikam-9999 failed.
 * Call stack:
 *               ebuild.sh, line   49:  Called src_compile
 *             environment, line 3060:  Called kde4overlay-base_src_compile
 *             environment, line 2063:  Called kde4overlay-base_src_make
 *             environment, line 2096:  Called cmake-utils_src_make
 *             environment, line  748:  Called die
 * The specific snippet of code:
 *           emake "$@" || die "Make failed!";
 *  The die message:
 *   Make failed!
 *
 * If you need support, post the topmost build error, and the call stack if relevant.
 * A complete build log is located at '/var/log/portage/media-gfx:digikam-9999:20080904-140535.log'.
 * The ebuild environment file is located at '/var/tmp/portage/media-gfx/digikam-9999/temp/environment'.
 * This ebuild is from an overlay: '/usr/local/portage/layman/kdesvn-portage/'
 *

 * Messages for package media-gfx/digikam-9999:

 * WARNING! This is an experimental ebuild of the extragear/graphics KDE4 SVN tree.
 * Use at your own risk. Do _NOT_ file bugs at bugs.gentoo.org because
 * of this ebuild!
 *
 * ERROR: media-gfx/digikam-9999 failed.
 * Call stack:
 *               ebuild.sh, line   49:  Called src_compile
 *             environment, line 3060:  Called kde4overlay-base_src_compile
 *             environment, line 2063:  Called kde4overlay-base_src_make
 *             environment, line 2096:  Called cmake-utils_src_make
 *             environment, line  748:  Called die
 * The specific snippet of code:
 *           emake "$@" || die "Make failed!";
 *  The die message:
 *   Make failed!
 *
 * If you need support, post the topmost build error, and the call stack if relevant.
 * A complete build log is located at '/var/log/portage/media-gfx:digikam-9999:20080904-140535.log'.
 * The ebuild environment file is located at '/var/tmp/portage/media-gfx/digikam-9999/temp/environment'.
 * This ebuild is from an overlay: '/usr/local/portage/layman/kdesvn-portage/'


Code:

 * Portage 2.2_rc8 (default/linux/amd64/2008.0, gcc-4.3.1, glibc-2.8_p20080602-r0, 2.6.26-reiser4 x86_64)
=================================================================
System uname: Linux-2.6.26-reiser4-x86_64-Intel-R-_Core-TM-2_CPU_T7600_@_2.33GHz-with-glibc2.2.5
Timestamp of tree: Mon, 01 Sep 2008 10:00:01 +0000
ccache version 2.4 [disabled]
app-shells/bash:     3.2_p39
dev-java/java-config: 1.3.7, 2.1.6-r1
dev-lang/python:     2.5.2-r7
dev-util/ccache:     2.4-r7
sys-apps/baselayout: 2.0.0
sys-apps/openrc:     0.2.5
sys-apps/sandbox:    1.2.18.1-r3
sys-devel/autoconf:  2.13, 2.62-r1
sys-devel/automake:  1.4_p6, 1.5, 1.7.9-r1, 1.8.5-r3, 1.9.6-r2, 1.10.1-r1
sys-devel/binutils:  2.18-r3
sys-devel/gcc-config: 1.4.0-r4
sys-devel/libtool:   2.2.4
virtual/os-headers:  2.6.26
ACCEPT_KEYWORDS="amd64 ~amd64"
CBUILD="x86_64-pc-linux-gnu"
CFLAGS="-march=native -O2 -fomit-frame-pointer -pipe"
CHOST="x86_64-pc-linux-gnu"
CONFIG_PROTECT="/etc /usr/kde/3.5/env /usr/kde/3.5/share/config /usr/kde/3.5/shutdown /usr/kde/svn/env /usr/kde/svn/share/config /usr/kde/svn/shutdown /usr/share/config"
CONFIG_PROTECT_MASK="/etc/ca-certificates.conf /etc/env.d /etc/env.d/java/ /etc/fonts/fonts.conf /etc/gconf /etc/gentoo-release /etc/revdep-rebuild /etc/splash /etc/terminfo /etc/texmf/web2c /etc/udev/rules.d"
CXXFLAGS="-march=native -O2 -fomit-frame-pointer -pipe"
DISTDIR="/usr/portage/distfiles"
FEATURES="distlocks metadata-transfer parallel-fetch preserve-libs sfperms strict unmerge-orphans userfetch userpriv"
GENTOO_MIRRORS="http://gentoo.osuosl.org http://www.ibiblio.org/pub/Linux/distributions/gentoo"
LDFLAGS="-Wl,-O1 -Wl,--sort-common -Wl,--as-needed"
MAKEOPTS="-j3"
PKGDIR="/usr/portage/packages"
PORTAGE_RSYNC_OPTS="--recursive --links --safe-links --perms --times --compress --force --whole-file --delete --stats --timeout=180 --exclude=/distfiles --exclude=/local --exclude=/packages"
PORTAGE_TMPDIR="/var/tmp"
PORTDIR="/usr/portage"
PORTDIR_OVERLAY="/usr/local/portage/layman/desktop-effects /usr/local/portage/layman/kdesvn-portage /usr/local/portage /usr/local/portage/layman/kdesvn-portage /usr/local/portage/myoverlay /usr/local/portage/layman/kdesvn-portage /usr/local/portage /usr/local/portage/layman/kdesvn-portage /usr/local/portage/myoverlay"
SYNC="rsync://rsync.gentoo.org/gentoo-portage"
USE="7zip X Xaw3d a52 aac aalib acpi alsa amd64 ao aotuv archive arts artworkextra audiofile automount avahi bash-completion bittorrent bzip2 cairo calendar cddb cdio cdparanoia cdr cdrw cgraph chm cups curl cxx dbus dell dga dhcp disk-partition divx djbfft djvu dmx dri drm dts dv dvd dvdr dvdread encode esd exif expat fam ffmpeg fftw filepicker firefox flac fltk fontconfig foomaticdb ftp gcdmaster gd gdbm ggi gif gimp git glib glitz gmedia gnome gnomecd gphoto2 gpm graphviz gs gstreamer gtk hddtemp hfs iconv ieee1394 imagemagick imlib ipod irda jabber java javascript jpeg jpeg2k kde kde4 kontact lame laptop lcms libcaca libnotify libsamplerate lm_sensors lzo mad midi mikmod mmap mmx mmxext mng modplug mono motif mp3 mp3rtp mp4 mpeg mplayer msn multilib nas nautilus ncurses network-cron nls nntp nptl nptlonly nsplugin ntp ogg openal openexr opengl oscar oss paste64 pccts pda pdf plasma png povray ppds python qt3 qt3support qt4 quicktime rar rdesktop readline realmedia rtc samba sdl semantic-desktop slit sndfile sound spell srt sse sse2 sse3 ssl ssse3 subversion svg swat syslog tcl teletext tga theora tiff timidity tk toolbar toolkit-scroll-bars truetype unicode usb v4l v4l2 vcd visualization vnc vorbis wavpack wmf wmp wxwindows x264 xanim xattr xcb xcomposite xft xine xinerama xml xorg xpm xscreensaver xulrunner xv xvid zip zlib" ALSA_CARDS="hda-intel" ALSA_PCM_PLUGINS="dmix adpcm alaw asym copy dshare dsnoop empty extplug file hooks iec958 ioplug ladspa lfloat linear meter mulaw multi null plug rate route share shm softvol" APACHE2_MODULES="actions alias auth_basic auth_digest authn_anon authn_dbd authn_dbm authn_default authn_file authz_dbm authz_default authz_groupfile authz_host authz_owner authz_user autoindex cache dav dav_fs dav_lock dbd deflate dir disk_cache env expires ext_filter file_cache filter headers ident imagemap include info log_config logio mem_cache mime mime_magic negotiation proxy proxy_ajp proxy_balancer proxy_connect proxy_http rewrite setenvif so speling status unique_id userdir usertrack vhost_alias" ELIBC="glibc" INPUT_DEVICES="keyboard mouse evdev synaptics" KERNEL="linux" LCD_DEVICES="bayrad cfontz cfontz633 glk hd44780 lb216 lcdm001 mtxorb ncurses text" USERLAND="GNU" VIDEO_CARDS="nvidia nv vesa"
Unset:  CPPFLAGS, CTARGET, EMERGE_DEFAULT_OPTS, FFLAGS, INSTALL_MASK, LANG, LC_ALL, LINGUAS, PORTAGE_COMPRESS, PORTAGE_COMPRESS_FLAGS, PORTAGE_RSYNC_EXTRA_OPTS

[/code]

EDIT: It was my LDFlags in /etc/make.conf. I disabled it and it compiled fine.


Last edited by eusanpe on Fri Sep 05, 2008 3:15 pm; edited 1 time in total
Back to top
View user's profile Send private message
Jupiter1TX
Guru
Guru


Joined: 24 Feb 2006
Posts: 546
Location: 3rd Rock

PostPosted: Thu Sep 04, 2008 2:57 pm    Post subject: Reply with quote

beso_1717 wrote:

you couldn't have used portage with this overlay. this overlay works only with paludis and portage shouldn't have been able to push in anything from this overlay.


Please be careful with such statements. I have been using this overlay just fine with
sys-apps/portage-2.2_rc8. I was able to install kde-4.1.1 without any 'portage'
problems yesterday.
_________________
Core i7 920 D0 | Asus P6T DLX | Patriot Viper 1600 6GB | Antec Quattro 850W
Geforce 8800GTX OC2 768MB | Dell 22" LCD | Koolance Exos2/Swiftech GTZ
GCC 4.6.1 | 3.7.x-geek | Xorg-7.4-x | KDE-4.7.x | Compiz
Back to top
View user's profile Send private message
tgurr
Retired Dev
Retired Dev


Joined: 27 Jan 2004
Posts: 571
Location: germany

PostPosted: Thu Sep 04, 2008 4:34 pm    Post subject: Reply with quote

Jupiter1TX wrote:
beso_1717 wrote:

you couldn't have used portage with this overlay. this overlay works only with paludis and portage shouldn't have been able to push in anything from this overlay.


Please be careful with such statements. I have been using this overlay just fine with
sys-apps/portage-2.2_rc8. I was able to install kde-4.1.1 without any 'portage'
problems yesterday.


Well actually he is right, this thread is/was about the genkdesvn overlay which is only compatible with paludis. The KDE team is also working on ebuilds for KDE 4.1.1 to enter the tree soon, but that overlay isn't available via layman. The other overlay providing release/snapshot/svn ebuilds for KDE4 which are portage compatible has it's own support thread.
Back to top
View user's profile Send private message
loftwyr
l33t
l33t


Joined: 29 Dec 2004
Posts: 970
Location: 43°38'23.62"N 79°27'8.60"W

PostPosted: Thu Sep 04, 2008 5:53 pm    Post subject: Reply with quote

We should probably rename this thread (or start a new one) so that it mentions genkdesvn. Too many people are getting confused.
_________________
My emerge --info
Have you run revdep-rebuild lately? It's in gentoolkit and it's worth a shot if things don't work well.
Celebrating 5 years of Gentoo-ing.
Back to top
View user's profile Send private message
drizzt
Guru
Guru


Joined: 21 Jul 2002
Posts: 416

PostPosted: Thu Sep 04, 2008 6:37 pm    Post subject: Reply with quote

ups I'm sorry.
Maybe a title change would help to avoid confusion.
_________________
People don't have to earn my respect. I offer my respect to them, but be careful to lose my respect...
Back to top
View user's profile Send private message
earendilion
Tux's lil' helper
Tux's lil' helper


Joined: 26 Nov 2007
Posts: 115
Location: Meudon (92), France

PostPosted: Thu Sep 04, 2008 8:04 pm    Post subject: Reply with quote

Hi,

I've got a problem trying to compile from svn. I get this error when I compile plasma workspace :

Code:

[ 47%] Building CXX object plasma/dataengines/nowplaying/CMakeFiles/plasma_engine_nowplaying.dir/playercontainer.o                                             
[ 47%] Building CXX object plasma/dataengines/nowplaying/CMakeFiles/plasma_engine_nowplaying.dir/playerinterface/player.o                                       
[ 47%] Building CXX object plasma/dataengines/nowplaying/CMakeFiles/plasma_engine_nowplaying.dir/playerinterface/playerfactory.o                               
CMakeFiles/plasma_engine_places.dir/plasma_engine_places_automoc.o:(.data.rel.ro._ZTV8ModelJob[vtable for ModelJob]+0x38): undefined reference to `Plasma::ServiceJob::start()'                                                                 
collect2: ld a retourné 1 code d'état d'exécution                               
make[2]: *** [lib/plasma_engine_places.so] Erreur 1                             
make[1]: *** [plasma/dataengines/places/CMakeFiles/plasma_engine_places.dir/all] Erreur 2                                                                       
make[1]: *** Attente des tâches non terminées....                               
[ 48%] Building CXX object plasma/dataengines/nowplaying/CMakeFiles/plasma_engine_nowplaying.dir/playerinterface/dbuswatcher.o                                 
[ 48%] Building CXX object plasma/dataengines/nowplaying/CMakeFiles/plasma_engine_nowplaying.dir/playerinterface/pollingwatcher.o                               
[ 48%] Building CXX object plasma/dataengines/nowplaying/CMakeFiles/plasma_engine_nowplaying.dir/playerinterface/juk.o                                         
[ 49%] Building CXX object plasma/dataengines/nowplaying/CMakeFiles/plasma_engine_nowplaying.dir/playerinterface/mpris/mpris.o                                 
[ 49%] Building CXX object plasma/dataengines/nowplaying/CMakeFiles/plasma_engine_nowplaying.dir/playerinterface/mpris/mprisdbustypes.o
[ 49%] Building CXX object plasma/dataengines/nowplaying/CMakeFiles/plasma_engine_nowplaying.dir/juk_interface.o
[ 50%] Building CXX object plasma/dataengines/nowplaying/CMakeFiles/plasma_engine_nowplaying.dir/playerinterface/mpris/mprisplayer.o
[ 50%] Building CXX object plasma/dataengines/nowplaying/CMakeFiles/plasma_engine_nowplaying.dir/plasma_engine_nowplaying_automoc.o
Linking CXX shared module ../../../lib/plasma_engine_nowplaying.so
[ 50%] Built target plasma_engine_nowplaying
make: *** [all] Erreur 2


I tried to unmerge my whole kde previous install, and reinstalling... but I did anything... Is there a problem with plasma_engine_nowplaying ?
Has anyone reproduced this issue ?
Should I wait for this to be fixed on svn ?

Thanx for your answers !
Back to top
View user's profile Send private message
eusanpe
Tux's lil' helper
Tux's lil' helper


Joined: 06 Sep 2002
Posts: 107

PostPosted: Fri Sep 05, 2008 10:55 pm    Post subject: Reply with quote

Hello All:

Has anyone had issues with compiling Kitchensync today?

Thanks,
Tony


Code:
>>> Emerging (1 of 35) kde-base/kitchensync-9999
 * checking ebuild checksums ;-) ...                                                                                                               [ ok ]
 * checking auxfile checksums ;-) ...                                                                                                              [ ok ]
 * checking miscfile checksums ;-) ...                                                                                                             [ ok ]

 * WARNING! This is an experimental ebuild of the kdepim KDE4 SVN tree.
 * Use at your own risk. Do _NOT_ file bugs at bugs.gentoo.org because
 * of this ebuild!

>>> Unpacking source...
 * subversion update start -->
 *      repository: svn://anonsvn.kde.org/home/kde/trunk/KDE/kdepim
At revision 857640.
 *    working copy: /usr/portage/distfiles/svn-src/KDE/kdepim/kdepim

 * Exporting parts of working copy to /var/tmp/portage/kde-base/kitchensync-9999/work/kitchensync
>>> Source unpacked.
>>> Compiling source in /var/tmp/portage/kde-base/kitchensync-9999/work/kitchensync ...
-- The C compiler identification is GNU
-- The CXX compiler identification is GNU
-- Check for working C compiler: /usr/bin/x86_64-pc-linux-gnu-gcc
-- Check for working C compiler: /usr/bin/x86_64-pc-linux-gnu-gcc -- works
-- Detecting C compiler ABI info
-- Detecting C compiler ABI info - done
-- Check for working CXX compiler: /usr/bin/x86_64-pc-linux-gnu-g++
-- Check for working CXX compiler: /usr/bin/x86_64-pc-linux-gnu-g++ -- works
-- Detecting CXX compiler ABI info
-- Detecting CXX compiler ABI info - done
-- Looking for Q_WS_X11
-- Looking for Q_WS_X11 - found
-- Looking for Q_WS_WIN
-- Looking for Q_WS_WIN - not found.
-- Looking for Q_WS_QWS
-- Looking for Q_WS_QWS - not found.
-- Looking for Q_WS_MAC
-- Looking for Q_WS_MAC - not found.
-- Found Qt-Version 4.4.1 (using /usr/bin/qmake)
-- Looking for XOpenDisplay in /usr/lib64/libX11.so;/usr/lib64/libXext.so;/usr/lib64/libXft.so;/usr/lib64/libXau.so;/usr/lib64/libXdmcp.so;/usr/lib64/libXpm.so
-- Looking for XOpenDisplay in /usr/lib64/libX11.so;/usr/lib64/libXext.so;/usr/lib64/libXft.so;/usr/lib64/libXau.so;/usr/lib64/libXdmcp.so;/usr/lib64/libXpm.so - found
-- Looking for gethostbyname
-- Looking for gethostbyname - found
-- Looking for connect
-- Looking for connect - found
-- Looking for remove
-- Looking for remove - found
-- Looking for shmat
-- Looking for shmat - found
-- Looking for IceConnectionNumber in ICE
-- Looking for IceConnectionNumber in ICE - found
-- Found X11: /usr/lib64/libX11.so
-- Looking for include files CMAKE_HAVE_PTHREAD_H
-- Looking for include files CMAKE_HAVE_PTHREAD_H - found
-- Looking for pthread_create in pthreads
-- Looking for pthread_create in pthreads - not found
-- Looking for pthread_create in pthread
-- Looking for pthread_create in pthread - found
-- Found Automoc4: /usr/bin/automoc4
-- Found Perl: /usr/bin/perl
-- Performing Test _OFFT_IS_64BIT
-- Performing Test _OFFT_IS_64BIT - Success
-- Performing Test HAVE_FPIE_SUPPORT
-- Performing Test HAVE_FPIE_SUPPORT - Success
-- Performing Test __KDE_HAVE_W_OVERLOADED_VIRTUAL
-- Performing Test __KDE_HAVE_W_OVERLOADED_VIRTUAL - Success
-- Performing Test __KDE_HAVE_GCC_VISIBILITY
-- Performing Test __KDE_HAVE_GCC_VISIBILITY - Success
-- Found Phonon: /usr/lib64/libphonon.so
-- Found Phonon Includes: /usr/include/KDE;/usr/include
-- Found KDE 4.2 include dir: /usr/kde/svn/include
-- Found KDE 4.2 library dir: /usr/kde/svn/lib64
-- Found KDE4 kconfig_compiler preprocessor: /usr/kde/svn/bin/kconfig_compiler
-- Found automoc4: /usr/bin/automoc4
-- Found KDE PIM libraries
-- Boost version: 1.35.0
-- Found the following Boost libraries:
-- Found Akonadi: /usr/lib64/libakonadiprotocolinternals.so
-- Found Akonadi includes: /usr/include
-- Found Akonadi common libraries: /usr/lib64/libakonadiprotocolinternals.so
-- Found Akonadi dbus-interfaces: /usr/share/dbus-1/interfaces
-- Found ZLIB: /lib64/libz.so
-- WARNING: you are using the obsolete 'PKGCONFIG' macro use FindPkgConfig
-- Found Strigi >= 0.6.0
-- Found Strigi: /usr/lib64/libstreams.so
-- Found gpgme-config at /usr/bin/gpgme-config
-- Found gpgme v1.1.6, checking for flavours...
--  Found flavour 'vanilla', checking whether it's usable...yes
--  Found flavour 'pthread', checking whether it's usable...yes
-- Usable gpgme flavours found:  vanilla pthread
-- Found qgpgme: libraries: qgpgme;gpgme++-pthread;/usr/lib64/libgpgme-pthread.so;/usr/lib64/libpthread.so;/usr/lib64/libgpg-error.so
-- checking for one of the modules 'libopensync;>=0.38'
-- WARNING: you are using the obsolete 'PKGCONFIG' macro use FindPkgConfig
-- Found GLIB2: /usr/lib64/libglib-2.0.so
-- Found GNOKII: /usr/include
-- Found Soprano: /usr/lib64/libsoprano.so
-- Found Soprano includes: /usr/include
-- Found Soprano Index: /usr/lib64/libsopranoindex.so
-- Found Soprano Client: /usr/lib64/libsopranoclient.so
-- Found Soprano Plugins: nquadparser nquadserializer raptorparser raptorserializer redlandbackend sesame2backend
-- Found NEPOMUK: /usr/kde/svn/lib64/libnepomuk.so
-- Found libassuan-config at /usr/bin/libassuan-config
-- Found assuan v1.0.5, checking for flavours...
--  Found flavour 'vanilla', checking whether it's usable...yes
--  Found flavour 'pthread', checking whether it's usable...yes
--  Found flavour 'pth', checking whether it's usable...yes
-- Usable assuan flavours found:  vanilla pthread pth
-- Performing Test HAVE_ASSUAN_FD_T
-- Performing Test HAVE_ASSUAN_FD_T - Success
-- Looking for assuan_inquire_ext
-- Looking for assuan_inquire_ext - found
-- Performing Test HAVE_NEW_STYLE_ASSUAN_INQUIRE_EXT
-- Performing Test HAVE_NEW_STYLE_ASSUAN_INQUIRE_EXT - Success
-- Performing Test HAVE_GPG_ERR_SOURCE_KLEO
-- Performing Test HAVE_GPG_ERR_SOURCE_KLEO - Success
-- Performing Test HAVE_ASSUAN_SOCK_GET_NONCE
-- Performing Test HAVE_ASSUAN_SOCK_GET_NONCE - Success
-- Usable assuan found for Kleopatra
-- Checking whether libassuan can be linked against from DSO's
-- --> Assuming that it can. If compilation of libkleopatraclient fails on AMD64, check that libassuan is compiled with -fPIC and try again. Otherwise, pass -DBUILD_libkleopatraclient=OFF.
-- KMail support enabled.
-- KTimeTracker support enabled.
-- KMailCVT support enabled.
-- KOrganizer support enabled.
-- KPilot support enabled.
-- KitchenSync support disabled (OpenSync not found).
--
-----------------------------------------------------------------------------
-- The following external packages were located on your system.
-- This installation will have the extra features provided by these packages.
+ boost
+ gpgme
+ libXss
+ glib2
+ gnokii
+ Soprano
+ Nepomuk
+ xsltproc
+ assuan
-----------------------------------------------------------------------------
-- The following OPTIONAL packages could NOT be located on your system.
-- Consider installing them to enable more features from this software.
+ opensync, 0.38 or greater: OpenSync Development Libraries <http://www.opensync.org>
Needed to provide syncing functionality in KDE PIM applications. Necessary to compile kitchensync.
-----------------------------------------------------------------------------

-- Configuring done
-- Generating done
-- Build files have been written to: /var/tmp/portage/kde-base/kitchensync-9999/work/kitchensync_build
>>> Source compiled.
>>> Test phase [not enabled]: kde-base/kitchensync-9999

>>> Install kitchensync-9999 into /var/tmp/portage/kde-base/kitchensync-9999/image/ category kde-base
make: *** No rule to make target `install'.  Stop.
 *
 * ERROR: kde-base/kitchensync-9999 failed.
 * Call stack:
 *               ebuild.sh, line   49:  Called src_install
 *             environment, line 3066:  Called kde4overlay-meta_src_install
 *             environment, line 2383:  Called cmake-utils_src_install
 *             environment, line  739:  Called die
 * The specific snippet of code:
 *       emake install DESTDIR="${D}" || die "Make install failed";
 *  The die message:
 *   Make install failed
 *
 * If you need support, post the topmost build error, and the call stack if relevant.
 * A complete build log is located at '/var/log/portage/kde-base:kitchensync-9999:20080905-224711.log'.
 * The ebuild environment file is located at '/var/tmp/portage/kde-base/kitchensync-9999/temp/environment'.
 * This ebuild is from an overlay: '/usr/local/portage/layman/kdesvn-portage/'
 *

 * Messages for package kde-base/kitchensync-9999:

 * WARNING! This is an experimental ebuild of the kdepim KDE4 SVN tree.
 * Use at your own risk. Do _NOT_ file bugs at bugs.gentoo.org because
 * of this ebuild!
 *
 * ERROR: kde-base/kitchensync-9999 failed.
 * Call stack:
 *               ebuild.sh, line   49:  Called src_install
 *             environment, line 3066:  Called kde4overlay-meta_src_install
 *             environment, line 2383:  Called cmake-utils_src_install
 *             environment, line  739:  Called die
 * The specific snippet of code:
 *       emake install DESTDIR="${D}" || die "Make install failed";
 *  The die message:
 *   Make install failed
 *
 * If you need support, post the topmost build error, and the call stack if relevant.
 * A complete build log is located at '/var/log/portage/kde-base:kitchensync-9999:20080905-224711.log'.
 * The ebuild environment file is located at '/var/tmp/portage/kde-base/kitchensync-9999/temp/environment'.
 * This ebuild is from an overlay: '/usr/local/portage/layman/kdesvn-portage/'
 *


Code:
emerge --info

Portage 2.2_rc8 (default/linux/amd64/2008.0, gcc-4.3.1, glibc-2.8_p20080602-r0, 2.6.26-reiser4 x86_64)
=================================================================
System uname: Linux-2.6.26-reiser4-x86_64-Intel-R-_Core-TM-2_CPU_T7600_@_2.33GHz-with-glibc2.2.5
Timestamp of tree: Mon, 01 Sep 2008 10:00:01 +0000
ccache version 2.4 [disabled]
app-shells/bash:     3.2_p39
dev-java/java-config: 1.3.7, 2.1.6-r1
dev-lang/python:     2.5.2-r7
dev-util/ccache:     2.4-r7
sys-apps/baselayout: 2.0.0
sys-apps/openrc:     0.2.5
sys-apps/sandbox:    1.2.18.1-r3
sys-devel/autoconf:  2.13, 2.62-r1
sys-devel/automake:  1.4_p6, 1.5, 1.7.9-r1, 1.8.5-r3, 1.9.6-r2, 1.10.1-r1
sys-devel/binutils:  2.18-r3
sys-devel/gcc-config: 1.4.0-r4
sys-devel/libtool:   2.2.4
virtual/os-headers:  2.6.26
ACCEPT_KEYWORDS="amd64 ~amd64"
CBUILD="x86_64-pc-linux-gnu"
CFLAGS="-march=native -O2 -fomit-frame-pointer -pipe"
CHOST="x86_64-pc-linux-gnu"
CONFIG_PROTECT="/etc /usr/kde/3.5/env /usr/kde/3.5/share/config /usr/kde/3.5/shutdown /usr/kde/svn/env /usr/kde/svn/share/config /usr/kde/svn/shutdown /usr/share/config"
CONFIG_PROTECT_MASK="/etc/ca-certificates.conf /etc/env.d /etc/env.d/java/ /etc/fonts/fonts.conf /etc/gconf /etc/gentoo-release /etc/revdep-rebuild /etc/splash /etc/terminfo /etc/texmf/web2c /etc/udev/rules.d"
CXXFLAGS="-march=native -O2 -fomit-frame-pointer -pipe"
DISTDIR="/usr/portage/distfiles"
FEATURES="distlocks metadata-transfer parallel-fetch preserve-libs sfperms strict unmerge-orphans userfetch userpriv"
GENTOO_MIRRORS="http://gentoo.osuosl.org http://www.ibiblio.org/pub/Linux/distributions/gentoo"
LDFLAGS="-Wl,-O1"
MAKEOPTS="-j3"
PKGDIR="/usr/portage/packages"
PORTAGE_RSYNC_OPTS="--recursive --links --safe-links --perms --times --compress --force --whole-file --delete --stats --timeout=180 --exclude=/distfiles --exclude=/local --exclude=/packages"
PORTAGE_TMPDIR="/var/tmp"
PORTDIR="/usr/portage"
PORTDIR_OVERLAY="/usr/local/portage/layman/desktop-effects /usr/local/portage/layman/kdesvn-portage /usr/local/portage /usr/local/portage/layman/kdesvn-portage /usr/local/portage/myoverlay /usr/local/portage/layman/kdesvn-portage /usr/local/portage /usr/local/portage/layman/kdesvn-portage /usr/local/portage/myoverlay"
SYNC="rsync://rsync.gentoo.org/gentoo-portage"
USE="7zip X Xaw3d a52 aac aalib acpi alsa amd64 ao aotuv archive arts artworkextra audiofile automount avahi bash-completion bittorrent bzip2 cairo calendar cddb cdio cdparanoia cdr cdrw cgraph chm cups curl cxx dbus dell dga dhcp disk-partition divx djbfft djvu dmx dri drm dts dv dvd dvdr dvdread encode esd exif expat fam ffmpeg fftw filepicker firefox flac fltk fontconfig foomaticdb ftp gcdmaster gd gdbm ggi gif gimp git glib glitz gmedia gnome gnomecd gphoto2 gpm graphviz gs gstreamer gtk hddtemp hfs iconv ieee1394 imagemagick imlib ipod irda jabber java javascript jpeg jpeg2k kde kde4 kontact lame laptop lcms libcaca libnotify libsamplerate lm_sensors lzo mad midi mikmod mmap mmx mmxext mng modplug mono motif mp3 mp3rtp mp4 mpeg mplayer msn multilib nas nautilus ncurses network-cron nls nntp nptl nptlonly nsplugin ntp ogg openal openexr opengl oscar oss paste64 pccts pda pdf plasma png povray ppds python qt3 qt3support qt4 quicktime rar rdesktop readline realmedia rtc samba sdl semantic-desktop slit sndfile sound spell srt sse sse2 sse3 ssl ssse3 subversion svg swat syslog tcl teletext tga theora tiff timidity tk toolbar toolkit-scroll-bars truetype unicode usb v4l v4l2 vcd visualization vnc vorbis wavpack wmf wmp wxwindows x264 xanim xattr xcb xcomposite xft xine xinerama xml xorg xpm xscreensaver xulrunner xv xvid zip zlib" ALSA_CARDS="hda-intel" ALSA_PCM_PLUGINS="dmix adpcm alaw asym copy dshare dsnoop empty extplug file hooks iec958 ioplug ladspa lfloat linear meter mulaw multi null plug rate route share shm softvol" APACHE2_MODULES="actions alias auth_basic auth_digest authn_anon authn_dbd authn_dbm authn_default authn_file authz_dbm authz_default authz_groupfile authz_host authz_owner authz_user autoindex cache dav dav_fs dav_lock dbd deflate dir disk_cache env expires ext_filter file_cache filter headers ident imagemap include info log_config logio mem_cache mime mime_magic negotiation proxy proxy_ajp proxy_balancer proxy_connect proxy_http rewrite setenvif so speling status unique_id userdir usertrack vhost_alias" ELIBC="glibc" INPUT_DEVICES="keyboard mouse evdev synaptics" KERNEL="linux" LCD_DEVICES="bayrad cfontz cfontz633 glk hd44780 lb216 lcdm001 mtxorb ncurses text" USERLAND="GNU" VIDEO_CARDS="nvidia nv vesa"
Unset:  CPPFLAGS, CTARGET, EMERGE_DEFAULT_OPTS, FFLAGS, INSTALL_MASK, LANG, LC_ALL, LINGUAS, PORTAGE_COMPRESS, PORTAGE_COMPRESS_FLAGS, PORTAGE_RSYNC_EXTRA_OPTS
Back to top
View user's profile Send private message
OkeyMor57
n00b
n00b


Joined: 28 Feb 2003
Posts: 45
Location: FortWorth

PostPosted: Sat Sep 06, 2008 1:18 pm    Post subject: kde-l10n-4.1.64:4.2 does not exist Reply with quote

I am not really crazy about internalization so how can I turn off attempting to install kde-l10n and I am stumped I need help.
When I try to rebuild world, I get
Quote:
Query error:
* In program /usr/bin/paludis -i world -p:
* When performing install action from command line:
* When executing install task:
* When building dependency list:
* When adding NamedSetDepSpec 'world':
* When adding PackageDepSpec 'kde-base/kde-meta':
* When adding package 'kde-base/kde-meta-4.1.64:4.2::kde4-overlay':
* When adding run dependencies as post dependencies:
* When adding PackageDepSpec '>=kde-base/kde-l10n-4.1.64:4.2':

* No unread news items found
* No versions of '>=kde-base/kde-l10n-4.1.64:4.2' are available.


I have removed in re-fetch kdesvn-portage overlay, same problem.
Back to top
View user's profile Send private message
Display posts from previous:   
This topic is locked: you cannot edit posts or make replies.    Gentoo Forums Forum Index Unsupported Software All times are GMT
Goto page Previous  1, 2, 3 ... 23, 24, 25, 26, 27, 28  Next
Page 24 of 28

 
Jump to:  
You cannot post new topics in this forum
You cannot reply to topics in this forum
You cannot edit your posts in this forum
You cannot delete your posts in this forum
You cannot vote in polls in this forum