Gentoo Forums
Gentoo Forums
Gentoo Forums
Quick Search: in
KDE 4.1 portage
View unanswered posts
View posts from last 24 hours

Goto page Previous  1, 2, 3, 4, 5, 6 ... 28, 29, 30  Next  
This topic is locked: you cannot edit posts or make replies.    Gentoo Forums Forum Index Unsupported Software
View previous topic :: View next topic  
Author Message
Bloodsurfer
Guru
Guru


Joined: 07 Dec 2005
Posts: 361
Location: Wolfstein, Germany (Rhineland-Palatinate)

PostPosted: Mon Jun 16, 2008 10:27 am    Post subject: Reply with quote

playground-plasma fails for me all the time. :(

Since the last sync it now fails with:

Code:
[ 18%] Built target plasma_applet_spacer                                                           
[ 19%] [ 19%] Building CXX object applets/grid/CMakeFiles/plasma_containment_grid.dir/plasma_containment_grid_automoc.o                                                                                 
Building CXX object applets/grid/CMakeFiles/plasma_containment_grid.dir/grid.o                     
[ 19%] Building CXX object applets/weather/CMakeFiles/plasma_applet_weather.dir/plasma_applet_weather_automoc.o                                                                                         
Linking CXX shared module ../../lib/plasma_applet_weather.so                                       
/usr/portage/tmp/portage/kde-misc/playground-plasma-9999/work/playground-plasma-9999/applets/grid/grid.cpp:274: warning: unused parameter ‘contentsRect’                                               
[ 19%] Built target plasma_applet_weather                                                           
Linking CXX shared module ../../lib/plasma_containment_grid.so                                     
[ 19%] Built target plasma_containment_grid                                                         
make: *** [all] Error 2                                                                             
 *                                                                                                 
 * ERROR: kde-misc/playground-plasma-9999 failed.                                                   
 * Call stack:                                                                                     
 *               ebuild.sh, line   49:  Called src_compile                                         
 *             environment, line 3038:  Called kde4overlay-base_src_compile                         
 *             environment, line 2087:  Called kde4overlay-base_src_make                           
 *             environment, line 2120:  Called cmake-utils_src_make                                 
 *             environment, line  763:  Called die                                                 
 * The specific snippet of code:                                                                   
 *           emake "$@" || die "Make failed!";                                                     
 *  The die message:                                                                               
 *   Make failed!   


Before that sync it always failed at building the news applet, but now it doesn't even come that far.



And - the font in my taskbar is suddenly black! Very nice readability, black font on black background :D I don't find a setting anywhere to change that - suggestions?



I'm said, the versions I compiled five or six days ago worked all perfectly fine, why oh why did I make another update? :(



Amarok fails to, seems also plasma-related:

Code:
[ 18%] Building CXX object amarok/src/context/CMakeFiles/amarokplasma.dir/plasma/widgets/icon.o     
[ 18%] Building CXX object amarok/src/context/CMakeFiles/amarokplasma.dir/plasma/widgets/label.o   
[ 18%] Building CXX object amarok/src/context/CMakeFiles/amarokplasma.dir/plasma/widgets/lineedit.o
[ 18%] [ 19%] Building CXX object amarok/src/context/CMakeFiles/amarokplasma.dir/plasma/widgets/meter.o                                                                                                 
Building CXX object amarok/src/context/CMakeFiles/amarokplasma.dir/plasma/widgets/pushbutton.o     
[ 19%] [ 19%] Building CXX object amarok/src/context/CMakeFiles/amarokplasma.dir/plasma/widgets/signalplotter.o                                                                                         
Building CXX object amarok/src/context/CMakeFiles/amarokplasma.dir/plasma/widgets/radiobutton.o     
[ 19%] Building CXX object amarok/src/context/CMakeFiles/amarokplasma.dir/plasma/widgets/textedit.o
[ 19%] Building CXX object amarok/src/context/CMakeFiles/amarokplasma.dir/plasma/widgets/webcontent.o                                                                                                   
[ 20%] Building CXX object amarok/src/context/CMakeFiles/amarokplasma.dir/plasma/glapplet.o         
[ 20%] Building CXX object amarok/src/context/CMakeFiles/amarokplasma.dir/amarokplasma_automoc.o   
Linking CXX shared library ../../../lib/libamarokplasma.so                                         
[ 20%] Built target amarokplasma                                                                   
make: *** [all] Error 2                                                                             
 *                                                                                                 
 * ERROR: media-sound/amarok-9999 failed.                                                           
 * Call stack:                                                                                     
 *               ebuild.sh, line   49:  Called src_compile                                         
 *             environment, line 3100:  Called kde4overlay-meta_src_compile                         
 *             environment, line 2356:  Called kde4overlay-meta_src_make                           
 *             environment, line 2405:  Called kde4overlay-base_src_make                           
 *             environment, line 2120:  Called cmake-utils_src_make                                 
 *             environment, line  763:  Called die                                                 
 * The specific snippet of code:                                                                   
 *           emake "$@" || die "Make failed!";                                                     
 *  The die message:                                                                               
 *   Make failed!

_________________
SiberianSniper: my girlfriend's name ends with .c
Clete2: Uber geek! W00t! I'd rather have it end in .cpp... <insert name>.cpp
Dralnu: ...why not <name>.o? Then she's ready for linking...
SiberianSniper: or <name>.ko, so she's ready for insertion?
Back to top
View user's profile Send private message
s.hase
Apprentice
Apprentice


Joined: 19 Nov 2004
Posts: 293

PostPosted: Mon Jun 16, 2008 12:09 pm    Post subject: Reply with quote

Bloodsurfer wrote:

And - the font in my taskbar is suddenly black! Very nice readability, black font on black background :D I don't find a setting anywhere to change that - suggestions?

Logout, delete your .kdesvn directory and on the next login the font is white again. That was my solution.

edit: playground-plasma and amarok compiles fine for me, but not k3b. kftpgrabber compiles, but crashes at start.


Last edited by s.hase on Mon Jun 16, 2008 12:45 pm; edited 1 time in total
Back to top
View user's profile Send private message
pehop
n00b
n00b


Joined: 16 Oct 2005
Posts: 50
Location: Oxford, UK

PostPosted: Mon Jun 16, 2008 12:20 pm    Post subject: Reply with quote

Can't compile okular:
Code:
Linking CXX shared module ../../../lib/okularGenerator_dvi.so                                                                 
[ 83%] Built target okularGenerator_dvi                                                                                       
make: *** [all] Error 2                                                                                                       
 *                                                                                                                           
 * ERROR: kde-base/okular-4.0.82 failed.                                                                                     
 * Call stack:                                                                                                               
 *               ebuild.sh, line   49:  Called src_compile                                                                   
 *             environment, line 2968:  Called kde4overlay-meta_src_compile                                                   
 *             environment, line 2310:  Called kde4overlay-meta_src_make                                                     
 *             environment, line 2359:  Called kde4overlay-base_src_make                                                     
 *             environment, line 2074:  Called cmake-utils_src_make                                                           
 *             environment, line  717:  Called die                                                                           
 * The specific snippet of code:                                                                                             
 *           emake "$@" || die "Make failed!";                                                                               
 *  The die message:
 *   Make failed!
 


and kaddressbook:
Code:
Linking CXX shared module ../../lib/kaddrbk_cardview.so                                                                       
[ 74%] Built target kaddrbk_cardview                                                                                         
make: *** [all] Error 2                                                                                                       
 *                                                                                                                           
 * ERROR: kde-base/kaddressbook-4.0.82 failed.                                                                               
 * Call stack:                                                                                                               
 *               ebuild.sh, line   49:  Called src_compile                                                                   
 *             environment, line 2963:  Called kde4overlay-meta_src_compile                                                   
 *             environment, line 2315:  Called kde4overlay-meta_src_make                                                     
 *             environment, line 2364:  Called kde4overlay-base_src_make                                                     
 *             environment, line 2079:  Called cmake-utils_src_make                                                           
 *             environment, line  722:  Called die                                                                           
 * The specific snippet of code:                                                                                             
 *           emake "$@" || die "Make failed!";                                                                               
 *  The die message:                                                                                                         
 *   Make failed!                                                                                                             
 

and systemsettings:
Code:
[ 79%] Building CXX object kcontrol/autostart/CMakeFiles/kcm_autostart.dir/kcm_autostart_automoc.o                           
Linking CXX shared module ../../lib/kcm_autostart.so                                                                         
[ 79%] Built target kcm_autostart                                                                                             
make: *** [all] Error 2                                                                                                       
 *                                                                                                                           
 * ERROR: kde-base/systemsettings-4.0.82 failed.                                                                             
 * Call stack:                                                                                                               
 *               ebuild.sh, line   49:  Called src_compile                                                                   
 *             environment, line 2966:  Called kde4overlay-meta_src_compile                                                   
 *             environment, line 2314:  Called kde4overlay-meta_src_make                                                     
 *             environment, line 2363:  Called kde4overlay-base_src_make                                                     
 *             environment, line 2078:  Called cmake-utils_src_make                                                           
 *             environment, line  721:  Called die                                                                           
 * The specific snippet of code:                                                                                             
 *           emake "$@" || die "Make failed!";                                                                               
 *  The die message:
 *   Make failed!
 

Use flags are:
Code:
[ebuild     U ] kde-base/kaddressbook-4.0.82 [4.0.80] USE="htmlhandbook kontact -debug -gnokii" 0 kB [1]
[ebuild     U ] kde-base/systemsettings-4.0.82 [4.0.80] USE="htmlhandbook opengl usb xinerama -debug" 0 kB [1]
[ebuild     U ] kde-base/korganizer-4.0.82 [4.0.80] USE="htmlhandbook kontact -debug" 0 kB [1]
[ebuild     U ] kde-base/okular-4.0.82 [4.0.80] USE="chm crypt djvu htmlhandbook jpeg pdf ps tiff -debug" 0 kB [1]


Does anyone has a suggestion what should I do?
Back to top
View user's profile Send private message
TheCat
Tux's lil' helper
Tux's lil' helper


Joined: 20 Feb 2004
Posts: 139
Location: Belarus

PostPosted: Mon Jun 16, 2008 1:23 pm    Post subject: Reply with quote

show few more lines before
Back to top
View user's profile Send private message
pehop
n00b
n00b


Joined: 16 Oct 2005
Posts: 50
Location: Oxford, UK

PostPosted: Mon Jun 16, 2008 3:30 pm    Post subject: Reply with quote

kadressbook:
Code:
[ 63%] Building CXX object kaddressbook/CMakeFiles/kaddressbookprivate.dir/kaddressbookprivate_automoc.o                     
Linking CXX shared library ../lib/libkaddressbookprivate.so                                                                   
[ 63%] Built target kaddressbookprivate                                                                                       
[ 64%] Generating cryptowidget.moc                                                                                           
[ 65%] Generating kaddressbookpartadaptor.cpp, kaddressbookpartadaptor.h                                                     
Generating kaddressbookadaptor.cpp, kaddressbookadaptor.h                                                                     
Generating kaddressbook_part.moc                                                                                             
Generating kaddressbookmain.moc                                                                                               
Scanning dependencies of target kaddrbk_cryptosettings                                                                       
[ 65%] Generating kaddressbookpartadaptor.moc                                                                                 
[ 66%] Generating kaddressbookadaptor.moc                                                                                     
Scanning dependencies of target kaddressbookpart                                                                             
Scanning dependencies of target kaddressbook_bin                                                                             
[ 67%] Building CXX object kaddressbook/editors/CMakeFiles/kaddrbk_cryptosettings.dir/cryptowidget.o                         
[ 68%] Building CXX object kaddressbook/CMakeFiles/kaddressbookpart.dir/kaddressbook_part.o                                   
[ 69%] Building CXX object kaddressbook/CMakeFiles/kaddressbook_bin.dir/main.o                                               
[ 70%] Building CXX object kaddressbook/CMakeFiles/kaddressbook_bin.dir/kaddressbookmain.o                                   
[ 70%] Building CXX object kaddressbook/editors/CMakeFiles/kaddrbk_cryptosettings.dir/kaddrbk_cryptosettings_automoc.o       
Linking CXX shared module ../../lib/kaddrbk_cryptosettings.so                                                                 
[ 71%] Building CXX object kaddressbook/CMakeFiles/kaddressbookpart.dir/kaddressbookpartadaptor.o                             
[ 71%] Built target kaddrbk_cryptosettings                                                                                   
make[2]: *** No rule to make target `/usr/lib64/qt4/libphonon.so', needed by `kaddressbook/kaddressbook'.  Stop.             
make[2]: *** Waiting for unfinished jobs....                                                                                 
[ 71%] Building CXX object kaddressbook/CMakeFiles/kaddressbook_bin.dir/kaddressbookadaptor.o                                 
Generating cardview.moc                                                                                         
Generating kaddressbookcardview.moc                                                                                           
Generating configurecardviewdialog.moc                                                                                       
[ 71%] Building CXX object kaddressbook/CMakeFiles/kaddressbookpart.dir/kaddressbookpart_automoc.o                           
Linking CXX shared module ../lib/kaddressbookpart.so                                                                         
Scanning dependencies of target kaddrbk_cardview                                                                             
[ 71%] Built target kaddressbookpart                                                                                         
make[1]: *** [kaddressbook/CMakeFiles/kaddressbook_bin.dir/all] Error 2                                                       
make[1]: *** Waiting for unfinished jobs....                                                                                 
[ 71%] Building CXX object kaddressbook/views/CMakeFiles/kaddrbk_cardview.dir/cardview.o                                     
[ 72%] [ 73%] Building CXX object kaddressbook/views/CMakeFiles/kaddrbk_cardview.dir/configurecardviewdialog.o               
Building CXX object kaddressbook/views/CMakeFiles/kaddrbk_cardview.dir/kaddressbookcardview.o                                 
In file included from /var/tmp/portage/kde-base/kaddressbook-4.0.82/work/kaddressbook-4.0.82/kaddressbook/views/cardview.cpp:47:                                                                                                                           
/usr/include/qt4/Qt3Support/q3scrollview.h:226: warning: 'virtual void Q3ScrollView::drawContents(QPainter*)' was hidden     
/var/tmp/portage/kde-base/kaddressbook-4.0.82/work/kaddressbook-4.0.82/kaddressbook/views/cardview.h:524: warning:   by 'virtual void CardView::drawContents(QPainter*, int, int, int, int)'                                                               
In file included from /var/tmp/portage/kde-base/kaddressbook-4.0.82/work/kaddressbook-4.0.82/kaddressbook/views/kaddressbookcardview.h:30,                                                                                                                 
                 from /var/tmp/portage/kde-base/kaddressbook-4.0.82/work/kaddressbook-4.0.82/kaddressbook/views/kaddressbookcardview.cpp:43:                                                                                                               
/usr/include/qt4/Qt3Support/q3scrollview.h:226: warning: 'virtual void Q3ScrollView::drawContents(QPainter*)' was hidden     
/var/tmp/portage/kde-base/kaddressbook-4.0.82/work/kaddressbook-4.0.82/kaddressbook/views/cardview.h:524: warning:   by 'virtual void CardView::drawContents(QPainter*, int, int, int, int)'                                                               
[ 74%] Building CXX object kaddressbook/views/CMakeFiles/kaddrbk_cardview.dir/kaddrbk_cardview_automoc.o                     
Linking CXX shared module ../../lib/kaddrbk_cardview.so                                                                       
[ 74%] Built target kaddrbk_cardview                                                                                         
make: *** [all] Error 2                                                                                                       
 *                                                                                                                           
 * ERROR: kde-base/kaddressbook-4.0.82 failed.                                                                               
 * Call stack:                                                                                                               
 *               ebuild.sh, line   49:  Called src_compile                                                                   
 *             environment, line 2963:  Called kde4overlay-meta_src_compile                                                   
 *             environment, line 2315:  Called kde4overlay-meta_src_make                                                     
 *             environment, line 2364:  Called kde4overlay-base_src_make                                                     
 *             environment, line 2079:  Called cmake-utils_src_make                                                           
 *             environment, line  722:  Called die                                                                           
 * The specific snippet of code:                                                                                             
 *           emake "$@" || die "Make failed!";                                                                               
 *  The die message:                                                                                                         
 *   Make failed!                                         


okular:
Code:
[ 67%] Building CXX object okular/CMakeFiles/okularpart.dir/ui/side_reviews.o                                                 
In file included from /var/tmp/portage/kde-base/okular-4.0.82/work/okular-4.0.82/okular/generators/dvi/dviRenderer.h:19,     
                 from /var/tmp/portage/kde-base/okular-4.0.82/work/okular-4.0.82/okular/generators/dvi/dviRenderer_dr.cpp:15:
/var/tmp/portage/kde-base/okular-4.0.82/work/okular-4.0.82/okular/generators/dvi/simplePageSize.h:63: warning: 'virtual void SimplePageSize::setPageSize(const Length&, const Length&)' was hidden                                                         
/var/tmp/portage/kde-base/okular-4.0.82/work/okular-4.0.82/okular/generators/dvi/pageSize.h:144: warning:   by 'pageSize::setPageSize'                                                                                                                     
[ 67%] Building CXX object okular/generators/dvi/CMakeFiles/okularGenerator_dvi.dir/special.o                                 
[ 68%] Building CXX object okular/CMakeFiles/okularpart.dir/ui/thumbnaillist.o                                               
In file included from /var/tmp/portage/kde-base/okular-4.0.82/work/okular-4.0.82/okular/generators/dvi/dviRenderer.h:19,     
                 from /var/tmp/portage/kde-base/okular-4.0.82/work/okular-4.0.82/okular/generators/dvi/special.cpp:13:       
/var/tmp/portage/kde-base/okular-4.0.82/work/okular-4.0.82/okular/generators/dvi/simplePageSize.h:63: warning: 'virtual void SimplePageSize::setPageSize(const Length&, const Length&)' was hidden                                                         
/var/tmp/portage/kde-base/okular-4.0.82/work/okular-4.0.82/okular/generators/dvi/pageSize.h:144: warning:   by 'pageSize::setPageSize'                                                                                                                     
[ 69%] Building CXX object okular/CMakeFiles/okularpart.dir/ui/toc.o                                                         
/usr/include/qt4/QtCore/qvector.h: In member function 'void dviRenderer::TPIC_addPath_special(const QString&)':               
/usr/include/qt4/QtCore/qvector.h:315: warning: assuming signed overflow does not occur when assuming that (X + c) >= X is always true                                                                                                                     
[ 69%] Building CXX object okular/CMakeFiles/okularpart.dir/ui/tocmodel.o                                                     
[ 70%] Building CXX object okular/CMakeFiles/okularpart.dir/ui/toolaction.o                                                   
[ 71%] Building CXX object okular/generators/dvi/CMakeFiles/okularGenerator_dvi.dir/dviFile.o                                 
[ 71%] Building CXX object okular/CMakeFiles/okularpart.dir/ui/tts.o                                                         
In file included from /var/tmp/portage/kde-base/okular-4.0.82/work/okular-4.0.82/okular/generators/dvi/dviFile.cpp:59:       
/var/tmp/portage/kde-base/okular-4.0.82/work/okular-4.0.82/okular/generators/dvi/simplePageSize.h:63: warning: 'virtual void SimplePageSize::setPageSize(const Length&, const Length&)' was hidden                                                         
/var/tmp/portage/kde-base/okular-4.0.82/work/okular-4.0.82/okular/generators/dvi/pageSize.h:144: warning:   by 'pageSize::setPageSize'                                                                                                                     
[ 72%] Building CXX object okular/CMakeFiles/okularpart.dir/kspeechinterface.o                                               
[ 72%] Building CXX object okular/generators/dvi/CMakeFiles/okularGenerator_dvi.dir/dviPageInfo.o                             
[ 73%] Building CXX object okular/generators/dvi/CMakeFiles/okularGenerator_dvi.dir/psgs.o                                   
[ 73%] Building CXX object okular/CMakeFiles/okularpart.dir/okularpart_automoc.o                                             
[ 74%] Building CXX object okular/generators/dvi/CMakeFiles/okularGenerator_dvi.dir/glyph.o                                   
[ 74%] Building CXX object okular/generators/dvi/CMakeFiles/okularGenerator_dvi.dir/TeXFont.o                                 
Linking CXX shared module ../lib/okularpart.so                                                                               
[ 75%] Building CXX object okular/generators/dvi/CMakeFiles/okularGenerator_dvi.dir/TeXFontDefinition.o                       
[ 75%] Building CXX object okular/generators/dvi/CMakeFiles/okularGenerator_dvi.dir/vf.o                                     
[ 75%] Built target okularpart                                                                                               
[ 76%] Building CXX object okular/generators/dvi/CMakeFiles/okularGenerator_dvi.dir/TeXFont_PFB.o                             
In file included from /var/tmp/portage/kde-base/okular-4.0.82/work/okular-4.0.82/okular/generators/dvi/dviRenderer.h:19,     
                 from /var/tmp/portage/kde-base/okular-4.0.82/work/okular-4.0.82/okular/generators/dvi/TeXFontDefinition.cpp:5:                                                                                                                             
/var/tmp/portage/kde-base/okular-4.0.82/work/okular-4.0.82/okular/generators/dvi/simplePageSize.h:63: warning: 'virtual void SimplePageSize::setPageSize(const Length&, const Length&)' was hidden                                                         
/var/tmp/portage/kde-base/okular-4.0.82/work/okular-4.0.82/okular/generators/dvi/pageSize.h:144: warning:   by 'pageSize::setPageSize'                                                                                                                     
In file included from /var/tmp/portage/kde-base/okular-4.0.82/work/okular-4.0.82/okular/generators/dvi/dviRenderer.h:19,     
                 from /var/tmp/portage/kde-base/okular-4.0.82/work/okular-4.0.82/okular/generators/dvi/vf.cpp:30:             
/var/tmp/portage/kde-base/okular-4.0.82/work/okular-4.0.82/okular/generators/dvi/simplePageSize.h:63: warning: 'virtual void SimplePageSize::setPageSize(const Length&, const Length&)' was hidden                                                         
/var/tmp/portage/kde-base/okular-4.0.82/work/okular-4.0.82/okular/generators/dvi/pageSize.h:144: warning:   by 'pageSize::setPageSize'                                                                                                                     
[ 76%] Building CXX object okular/generators/dvi/CMakeFiles/okularGenerator_dvi.dir/TeXFont_PK.o                             
[ 77%] Building CXX object okular/generators/dvi/CMakeFiles/okularGenerator_dvi.dir/TeXFont_TFM.o                             
[ 77%] Building CXX object okular/generators/dvi/CMakeFiles/okularGenerator_dvi.dir/util.o                                   
[ 78%] Building CXX object okular/generators/dvi/CMakeFiles/okularGenerator_dvi.dir/pageSize.o                               
[ 79%] Building CXX object okular/generators/dvi/CMakeFiles/okularGenerator_dvi.dir/simplePageSize.o                         
In file included from /var/tmp/portage/kde-base/okular-4.0.82/work/okular-4.0.82/okular/generators/dvi/pageSize.cpp:11:       
/var/tmp/portage/kde-base/okular-4.0.82/work/okular-4.0.82/okular/generators/dvi/simplePageSize.h:63: warning: 'virtual void SimplePageSize::setPageSize(const Length&, const Length&)' was hidden                                                         
/var/tmp/portage/kde-base/okular-4.0.82/work/okular-4.0.82/okular/generators/dvi/pageSize.h:144: warning:   by 'pageSize::setPageSize'                                                                                                                     
[ 79%] Building CXX object okular/generators/dvi/CMakeFiles/okularGenerator_dvi.dir/length.o                                 
[ 80%] Building CXX object okular/generators/dvi/CMakeFiles/okularGenerator_dvi.dir/fontEncoding.o                           
[ 80%] Building CXX object okular/generators/dvi/CMakeFiles/okularGenerator_dvi.dir/fontEncodingPool.o                       
[ 81%] Building CXX object okular/generators/dvi/CMakeFiles/okularGenerator_dvi.dir/fontMap.o                                 
[ 81%] Building CXX object okular/generators/dvi/CMakeFiles/okularGenerator_dvi.dir/fontpool.o                               
[ 82%] Building CXX object okular/generators/dvi/CMakeFiles/okularGenerator_dvi.dir/fontprogress.o                           
[ 83%] Building CXX object okular/generators/dvi/CMakeFiles/okularGenerator_dvi.dir/dvisourcesplitter.o                       
[ 83%] Building CXX object okular/generators/dvi/CMakeFiles/okularGenerator_dvi.dir/dviexport.o                               
[ 83%] Building CXX object okular/generators/dvi/CMakeFiles/okularGenerator_dvi.dir/okularGenerator_dvi_automoc.o             
In file included from /var/tmp/portage/kde-base/okular-4.0.82/work/okular-4.0.82/okular/generators/dvi/dviRenderer.h:19,     
                 from /var/tmp/portage/kde-base/okular-4.0.82/work/okular-4.0.82/okular/generators/dvi/dviexport.cpp:25:     
/var/tmp/portage/kde-base/okular-4.0.82/work/okular-4.0.82/okular/generators/dvi/simplePageSize.h:63: warning: 'virtual void SimplePageSize::setPageSize(const Length&, const Length&)' was hidden                                                         
/var/tmp/portage/kde-base/okular-4.0.82/work/okular-4.0.82/okular/generators/dvi/pageSize.h:144: warning:   by 'pageSize::setPageSize'                                                                                                                     
Linking CXX shared module ../../../lib/okularGenerator_dvi.so                                                                 
[ 83%] Built target okularGenerator_dvi                                                                                       
make: *** [all] Error 2                                                                                                       
 *                                                                                                                           
 * ERROR: kde-base/okular-4.0.82 failed.                                                                                     
 * Call stack:                                                                                                               
 *               ebuild.sh, line   49:  Called src_compile                                                                   
 *             environment, line 2968:  Called kde4overlay-meta_src_compile                                                   
 *             environment, line 2310:  Called kde4overlay-meta_src_make                                                     
 *             environment, line 2359:  Called kde4overlay-base_src_make                                                     
 *             environment, line 2074:  Called cmake-utils_src_make                                                           
 *             environment, line  717:  Called die                                                                           
 * The specific snippet of code:                                                                                             
 *           emake "$@" || die "Make failed!";                                                                               
 *  The die message:
 *   Make failed!
 


systemsettings:
Code:
Generating kaccess.moc                                                                                                       
[ 71%] Built target kcm_display                                                                                               
Generating kcmaccess.moc                                                                                                     
[ 72%] Building CXX object kcontrol/hardware/joystick/CMakeFiles/kcm_joystick.dir/joystick.o                                 
Scanning dependencies of target kdeinit_kaccess                                                                               
Scanning dependencies of target kcm_access                                                                                   
[ 72%] Building CXX object kcontrol/hardware/joystick/CMakeFiles/kcm_joystick.dir/joywidget.o                                 
[ 73%] Building CXX object kcontrol/access/CMakeFiles/kdeinit_kaccess.dir/kaccess.o                                           
make[2]: *** [ 74%] No rule to make target `/usr/lib64/qt4/libphonon.so', needed by `lib/kcm_access.so'.  Stop.               
make[2]: *** Waiting for unfinished jobs....                                                                                 
Building CXX object kcontrol/access/CMakeFiles/kcm_access.dir/kcmaccess.o                                                     
/var/tmp/portage/kde-base/systemsettings-4.0.82/work/systemsettings-4.0.82/kcontrol/access/kaccess.cpp:441:2: warning: #warning is this the best way to invert a pixmap?                                                                                   
/var/tmp/portage/kde-base/systemsettings-4.0.82/work/systemsettings-4.0.82/kcontrol/access/kaccess.cpp:590:2: warning: #warning "kde4 fixme"                                                                                                               
/var/tmp/portage/kde-base/systemsettings-4.0.82/work/systemsettings-4.0.82/kcontrol/access/kcmaccess.cpp:777:2: warning: #warning "kde4: dbus port: need to test it"                                                                                       
/var/tmp/portage/kde-base/systemsettings-4.0.82/work/systemsettings-4.0.82/kcontrol/access/kaccess.cpp: In member function 'void KAccessApp::initMasks()':                                                                                                 
/var/tmp/portage/kde-base/systemsettings-4.0.82/work/systemsettings-4.0.82/kcontrol/access/kaccess.cpp:318: warning: suggest explicit braces to avoid ambiguous 'else'                                                                                     
[ 75%] Building CXX object kcontrol/hardware/joystick/CMakeFiles/kcm_joystick.dir/poswidget.o                                 
/var/tmp/portage/kde-base/systemsettings-4.0.82/work/systemsettings-4.0.82/kcontrol/access/kcmaccess.cpp: In member function 'void ExtendedIntNumInput::setRange(int, int, int, bool)':                                                                     
/var/tmp/portage/kde-base/systemsettings-4.0.82/work/systemsettings-4.0.82/kcontrol/access/kcmaccess.cpp:60: warning: 'void KIntNumInput::setRange(int, int, int, bool)' is deprecated (declared at /usr/kde/4.1/include/knuminput.h:271)                   
/var/tmp/portage/kde-base/systemsettings-4.0.82/work/systemsettings-4.0.82/kcontrol/access/kcmaccess.cpp: At global scope:   
/var/tmp/portage/kde-base/systemsettings-4.0.82/work/systemsettings-4.0.82/kcontrol/access/kcmaccess.cpp:110: warning: unused parameter 'config'                                                                                                           
/var/tmp/portage/kde-base/systemsettings-4.0.82/work/systemsettings-4.0.82/kcontrol/access/kcmaccess.cpp: In constructor 'KAccessConfig::KAccessConfig(QWidget*, const QStringList&)':                                                                     
/var/tmp/portage/kde-base/systemsettings-4.0.82/work/systemsettings-4.0.82/kcontrol/access/kcmaccess.cpp:232: warning: 'KCModule::KCModule(const KComponentData&, QWidget*, const QStringList&)' is deprecated (declared at /usr/kde/4.1/include/kcmodule.h:117)                                                                                                                         
[ 75%] Building CXX object kcontrol/hardware/joystick/CMakeFiles/kcm_joystick.dir/joydevice.o                                 
[ 75%] Building CXX object kcontrol/access/CMakeFiles/kdeinit_kaccess.dir/main.o                                             
[ 75%] Building CXX object kcontrol/hardware/joystick/CMakeFiles/kcm_joystick.dir/caldialog.o                                 
[ 75%] Building CXX object kcontrol/access/CMakeFiles/kdeinit_kaccess.dir/kdeinit_kaccess_automoc.o                           
Linking CXX shared library ../../lib/libkdeinit4_kaccess.so                                                                   
[ 75%] Built target kdeinit_kaccess                                                                                           
[ 75%] Generating ui_autostartconfig.h                                                                                       
Generating addscriptdialog.moc                                                                                               
Generating autostart.moc                                                                                                     
Generating advanceddialog.moc                                                                                                 
Generating autostartitem.moc                                                                                                 
/var/tmp/portage/kde-base/systemsettings-4.0.82/work/systemsettings-4.0.82/kcontrol/autostart/autostartitem.h:0: Warning: No relevant classes found. No output generated.                                                                                   
[ 75%] Building CXX object kcontrol/hardware/joystick/CMakeFiles/kcm_joystick.dir/kcm_joystick_automoc.o                     
Linking CXX shared module ../../../lib/kcm_joystick.so                                                                       
[ 75%] Built target kcm_joystick                                                                                             
make[1]: *** [kcontrol/access/CMakeFiles/kcm_access.dir/all] Error 2                                                         
make[1]: *** Waiting for unfinished jobs....                                                                                 
Scanning dependencies of target kcm_autostart                                                                                 
[ 76%] Building CXX object kcontrol/autostart/CMakeFiles/kcm_autostart.dir/autostartitem.o                                   
[ 76%] Building CXX object kcontrol/autostart/CMakeFiles/kcm_autostart.dir/addscriptdialog.o                                 
Scanning dependencies of target kfontinst                                                                                     
[ 76%] Building CXX object kcontrol/kfontinst/lib/CMakeFiles/kfontinst.dir/Misc.o                                             
[ 77%] Building CXX object kcontrol/autostart/CMakeFiles/kcm_autostart.dir/advanceddialog.o                                   
[ 78%] Building CXX object kcontrol/kfontinst/lib/CMakeFiles/kfontinst.dir/DisabledFonts.o                                   
[ 78%] Building CXX object kcontrol/kfontinst/lib/CMakeFiles/kfontinst.dir/Fc.o                                               
[ 78%] Building CXX object kcontrol/autostart/CMakeFiles/kcm_autostart.dir/autostart.o                                       
[ 79%] Building CXX object kcontrol/kfontinst/lib/CMakeFiles/kfontinst.dir/kfontinst_automoc.o                               
Linking CXX shared library ../../../lib/libkfontinst.so                                                                       
[ 79%] Built target kfontinst                                                                                                 
[ 79%] Building CXX object kcontrol/autostart/CMakeFiles/kcm_autostart.dir/kcm_autostart_automoc.o                           
Linking CXX shared module ../../lib/kcm_autostart.so                                                                         
[ 79%] Built target kcm_autostart                                                                                             
make: *** [all] Error 2                                                                                                       
 *                                                                                                                           
 * ERROR: kde-base/systemsettings-4.0.82 failed.                                                                             
 * Call stack:                                                                                                               
 *               ebuild.sh, line   49:  Called src_compile                                                                   
 *             environment, line 2966:  Called kde4overlay-meta_src_compile                                                   
 *             environment, line 2314:  Called kde4overlay-meta_src_make                                                     
 *             environment, line 2363:  Called kde4overlay-base_src_make                                                     
 *             environment, line 2078:  Called cmake-utils_src_make                                                           
 *             environment, line  721:  Called die                                                                           
 * The specific snippet of code:                                                                                             
 *           emake "$@" || die "Make failed!";                                                                               
 *  The die message:
 *   Make failed!
 
Back to top
View user's profile Send private message
TheCat
Tux's lil' helper
Tux's lil' helper


Joined: 20 Feb 2004
Posts: 139
Location: Belarus

PostPosted: Mon Jun 16, 2008 3:52 pm    Post subject: Reply with quote

looks like you need to install x11-libs/qt-phonon for kadressbook and systemsettings
because:
Quote:
make[2]: *** [ 74%] No rule to make target `/usr/lib64/qt4/libphonon.so', needed by `lib/kcm_access.so'. Stop.

and:
Quote:
# qlist qt-phonon
/usr/lib64/qt4/libphonon.so.4.1.0
/usr/lib64/qt4/libphonon.la
/usr/lib64/qt4/libphonon.so
/usr/lib64/qt4/libphonon.so.4.1
/usr/lib64/qt4/libphonon.so.4
/usr/lib64/qt4/libphonon.prl
Back to top
View user's profile Send private message
pehop
n00b
n00b


Joined: 16 Oct 2005
Posts: 50
Location: Oxford, UK

PostPosted: Mon Jun 16, 2008 3:56 pm    Post subject: Reply with quote

but to install phonon-xine I had to uninstall x11-libs/qt-phonon...
I am a little bit confused :?
Back to top
View user's profile Send private message
TheCat
Tux's lil' helper
Tux's lil' helper


Joined: 20 Feb 2004
Posts: 139
Location: Belarus

PostPosted: Mon Jun 16, 2008 4:03 pm    Post subject: Reply with quote

ArtSh wrote:
Ivanich_ wrote:
Phonon-xine-4.0.82 fails to compile :cry: :


You must uninstall x11-libs/qt-phonon, and install media-sound/phonon

but what about:
Quote:
# qlist qt-phonon
/usr/lib64/qt4/libphonon.so.4.1.0
/usr/lib64/qt4/libphonon.la
/usr/lib64/qt4/libphonon.so
/usr/lib64/qt4/libphonon.so.4.1
/usr/lib64/qt4/libphonon.so.4

it's still needed by few packages.
Back to top
View user's profile Send private message
TheCat
Tux's lil' helper
Tux's lil' helper


Joined: 20 Feb 2004
Posts: 139
Location: Belarus

PostPosted: Mon Jun 16, 2008 4:04 pm    Post subject: Reply with quote

pehop wrote:
but to install phonon-xine I had to uninstall x11-libs/qt-phonon...
I am a little bit confused :?

me too. looks like we should wait till 4.0.84 :)
Back to top
View user's profile Send private message
TheCat
Tux's lil' helper
Tux's lil' helper


Joined: 20 Feb 2004
Posts: 139
Location: Belarus

PostPosted: Mon Jun 16, 2008 4:09 pm    Post subject: Reply with quote

BTW.
I've compiled kdebase-meta:kde-4.1 (4.0.82) but when I'm trying to start it i'm getting only splash screen with boot progress then just black workspace.
I can run programs by alt+f2 but I don't see taskbar, no kdemenu. nothing. just black screen.
anyone had same problem?
4.0.80 worked perfect. I've recompiled 4.0.82 from scratch but no luck...
Back to top
View user's profile Send private message
pehop
n00b
n00b


Joined: 16 Oct 2005
Posts: 50
Location: Oxford, UK

PostPosted: Mon Jun 16, 2008 4:10 pm    Post subject: Reply with quote

with x11-libs/qt-phonon kaddressbook build crashes even earlier:
Code:
[ 49%] Building CXX object kaddressbook/CMakeFiles/kaddressbookprivate.dir/secrecywidget.o                                   
[ 50%] Building CXX object kaddressbook/CMakeFiles/kaddressbookprivate.dir/soundwidget.o                                     
/var/tmp/portage/kde-base/kaddressbook-4.0.82/work/kaddressbook-4.0.82/kaddressbook/soundwidget.cpp:32:30: error: Phonon/MediaObject: No such file or directory                                                                                             
[ 51%] Building CXX object kaddressbook/CMakeFiles/kaddressbookprivate.dir/viewconfigurefieldspage.o                         
[ 51%] Building CXX object kaddressbook/CMakeFiles/kaddressbookprivate.dir/viewconfigurefilterpage.o                         
/var/tmp/portage/kde-base/kaddressbook-4.0.82/work/kaddressbook-4.0.82/kaddressbook/soundwidget.cpp: In member function 'void SoundWidget::playSound()':                                                                                                   
/var/tmp/portage/kde-base/kaddressbook-4.0.82/work/kaddressbook-4.0.82/kaddressbook/soundwidget.cpp:131: error: 'Phonon' has not been declared                                                                                                             
/var/tmp/portage/kde-base/kaddressbook-4.0.82/work/kaddressbook-4.0.82/kaddressbook/soundwidget.cpp:131: error: 'player' was not declared in this scope                                                                                                     
/var/tmp/portage/kde-base/kaddressbook-4.0.82/work/kaddressbook-4.0.82/kaddressbook/soundwidget.cpp:131: error: 'Phonon' has not been declared                                                                                                             
/var/tmp/portage/kde-base/kaddressbook-4.0.82/work/kaddressbook-4.0.82/kaddressbook/soundwidget.cpp:131: error: 'Phonon' has not been declared                                                                                                             
make[2]: *** [kaddressbook/CMakeFiles/kaddressbookprivate.dir/soundwidget.o] Error 1                                         
make[2]: *** Waiting for unfinished jobs....                                                                                 
make[1]: *** [kaddressbook/CMakeFiles/kaddressbookprivate.dir/all] Error 2                                                   
make: *** [all] Error 2                                                                                                       
 *                                                                                                                           
 * ERROR: kde-base/kaddressbook-4.0.82 failed.                                                                               
 * Call stack:                                                                                                               
 *               ebuild.sh, line   49:  Called src_compile                                                                   
 *             environment, line 2963:  Called kde4overlay-meta_src_compile                                                   
 *             environment, line 2315:  Called kde4overlay-meta_src_make                                                     
 *             environment, line 2364:  Called kde4overlay-base_src_make                                                     
 *             environment, line 2079:  Called cmake-utils_src_make                                                           
 *             environment, line  722:  Called die                                                                           
 * The specific snippet of code:                                                                                             
 *           emake "$@" || die "Make failed!";                                                                               
 *  The die message:
 *   Make failed!
 
Back to top
View user's profile Send private message
cruzki123
Apprentice
Apprentice


Joined: 16 May 2008
Posts: 249

PostPosted: Mon Jun 16, 2008 4:53 pm    Post subject: Reply with quote

TheCat wrote:
BTW.
I've compiled kdebase-meta:kde-4.1 (4.0.82) but when I'm trying to start it i'm getting only splash screen with boot progress then just black workspace.
I can run programs by alt+f2 but I don't see taskbar, no kdemenu. nothing. just black screen.
anyone had same problem?
4.0.80 worked perfect. I've recompiled 4.0.82 from scratch but no luck...


I have the same problem. This is a trace of run plasma from a konsole

Code:

cruzki@artemisa ~ $ plasma
Plasma crashed, attempting to automatically recover
plasma(2559): Communication problem with  "plasma" , it probably crashed.
Error message was:  "org.freedesktop.DBus.Error.NoReply" : " "Message did not receive a reply (timeout by message bus)" "

cruzki@artemisa ~ $ KCrash: Application 'plasma' crashing...
sock_file=/home/cruzki/.kde/socket-artemisa/kdeinit4__0
KCrash cannot reach kdeinit, launching directly.
KCrash failed to exec(), errno = 2
plasma(2563): Communication problem with  "plasma" , it probably crashed.
Error message was:  "org.freedesktop.DBus.Error.NoReply" : " "Message did not receive a reply (timeout by message bus)" "


My emerge --info

Code:

cruzki@artemisa ~ $ emerge --info
Portage 2.2_pre8 (default-linux/amd64/2007.0/no-multilib, gcc-4.3.1, glibc-2.8_p20080602-r0, 2.6.25-gentoo-r4 x86_64)
=================================================================
System uname: Linux-2.6.25-gentoo-r4-x86_64-Intel-R-_Core-TM-2_Duo_CPU_T7100_@_1.80GHz-with-glibc2.2.5
Timestamp of tree: Mon, 16 Jun 2008 12:45:02 +0000
distcc 2.18.3 x86_64-pc-linux-gnu (protocols 1 and 2) (default port 3632) [enabled]
ccache version 2.4 [enabled]
app-shells/bash:     3.2_p39
dev-java/java-config: 1.3.7, 2.1.6
dev-lang/python:     2.5.2-r4
dev-util/ccache:     2.4-r7
sys-apps/baselayout: 2.0.0
sys-apps/openrc:     0.2.5
sys-apps/sandbox:    1.2.18.1-r2
sys-devel/autoconf:  2.13, 2.62
sys-devel/automake:  1.5, 1.7.9-r1, 1.9.6-r2, 1.10.1-r1
sys-devel/binutils:  2.18-r1
sys-devel/gcc-config: 1.4.0-r4
sys-devel/libtool:   2.2.4
virtual/os-headers:  2.6.25-r4
ACCEPT_KEYWORDS="amd64 ~amd64"
CBUILD="x86_64-pc-linux-gnu"
CFLAGS="-march=core2 -O2 -pipe"
CHOST="x86_64-pc-linux-gnu"
CONFIG_PROTECT="/etc /usr/kde/4.1/env /usr/kde/4.1/share/config /usr/kde/4.1/shutdown /usr/share/config /var/lib/hsqldb"
CONFIG_PROTECT_MASK="/etc/ca-certificates.conf /etc/env.d /etc/env.d/java/ /etc/fonts/fonts.conf /etc/gconf /etc/gentoo-release /etc/revdep-rebuild /etc/terminfo /etc/texmf/web2c /etc/udev/rules.d"
CXXFLAGS="-march=core2 -O2 -pipe"
DISTDIR="/home/portage/distfiles"
FEATURES="ccache distcc distlocks parallel-fetch preserve-libs sandbox sfperms strict unmerge-orphans userfetch userpriv usersandbox"
GENTOO_MIRRORS="http://gentoo.osuosl.org/"
LANG="es_ES"
LC_ALL="es_ES@euro"
LDFLAGS="-Wl,-O1 -Wl,--as-needed -Wl,-znow -Wl,--hash-style=gnu"
LINGUAS="es"
MAKEOPTS="-j5"
PKGDIR="/usr/portage/packages"
PORTAGE_RSYNC_OPTS="--recursive --links --safe-links --perms --times --compress --force --whole-file --delete --stats --timeout=180 --exclude=/distfiles --exclude=/local --exclude=/packages"
PORTAGE_TMPDIR="/home/portage"
PORTDIR="/usr/portage"
PORTDIR_OVERLAY="/usr/local/portage/layman/kdesvn-portage /usr/local/portage/overlay"
SYNC="rsync://kassandra/gentoo-portage"
USE="X a52 aac alsa amd64 avi berkdb branding bzip2 cdr cjk cli cracklib crypt cups dbus dri dts dvd dvdr dvdread encode exif fbcon ffmpeg flac fortran ftp gif glitz gmp gpm hal iconv icq imagemagick isdnlog ithreads java javascript jpeg kde kontact lame laptop latex lm_sensors matroska midi mikmod mmx modplug mp3 mp4 mpeg mplayer mudflap musepack ncurses network nls nptl nptlonly nsl nsplugin ogg oggvorbis opengl openmp pam pcre pdf perl pic pie plasma png pppd python qt3 qt4 readline reflection session smp spell spl sse sse2 ssl ssse3 svg symlink tcpd threads tiff truetype unicode usb vorbis x264 xcb xcomposite xine xinerama xml xorg xv xvid xvmc zlib" ALSA_CARDS="hda-intel" ALSA_PCM_PLUGINS="adpcm alaw asym copy dmix dshare dsnoop empty extplug file hooks iec958 ioplug ladspa lfloat linear meter mulaw multi null plug rate route share shm softvol" APACHE2_MODULES="actions alias auth_basic authn_alias authn_anon authn_dbm authn_default authn_file authz_dbm authz_default authz_groupfile authz_host authz_owner authz_user autoindex cache dav dav_fs dav_lock deflate dir disk_cache env expires ext_filter file_cache filter headers include info log_config logio mem_cache mime mime_magic negotiation rewrite setenvif speling status unique_id userdir usertrack vhost_alias" ELIBC="glibc" INPUT_DEVICES="keyboard mouse" KERNEL="linux" LCD_DEVICES="bayrad cfontz cfontz633 glk hd44780 lb216 lcdm001 mtxorb ncurses text" LINGUAS="es" USERLAND="GNU" VIDEO_CARDS="i810"
Unset:  CPPFLAGS, CTARGET, EMERGE_DEFAULT_OPTS, INSTALL_MASK, PORTAGE_COMPRESS, PORTAGE_COMPRESS_FLAGS, PORTAGE_RSYNC_EXTRA_OPTS


any idea? 4.0.80 works... crash as a hell, but works.

PS: I forgot to say that I am trying to recompile plasma and kdelibs. Run revdep-rebuild and things like that. I'm going to do a emerge --system now.
Back to top
View user's profile Send private message
Bloodsurfer
Guru
Guru


Joined: 07 Dec 2005
Posts: 361
Location: Wolfstein, Germany (Rhineland-Palatinate)

PostPosted: Mon Jun 16, 2008 5:23 pm    Post subject: Reply with quote

s.hase wrote:
Bloodsurfer wrote:

And - the font in my taskbar is suddenly black! Very nice readability, black font on black background :D I don't find a setting anywhere to change that - suggestions?

Logout, delete your .kdesvn directory and on the next login the font is white again. That was my solution.


Ha, I didn't want to delete everything, so I did a little grepping and found the exact file where the setting is stored:
~/.kdesvn/share/apps/kthememanager/themes/original/original.xml
Either delete that or change the font setting in it. Now my gool old white font is back :)
_________________
SiberianSniper: my girlfriend's name ends with .c
Clete2: Uber geek! W00t! I'd rather have it end in .cpp... <insert name>.cpp
Dralnu: ...why not <name>.o? Then she's ready for linking...
SiberianSniper: or <name>.ko, so she's ready for insertion?
Back to top
View user's profile Send private message
kmare
l33t
l33t


Joined: 20 Nov 2004
Posts: 619
Location: Thessaloniki, Greece

PostPosted: Mon Jun 16, 2008 5:55 pm    Post subject: Reply with quote

Quote:

And - the font in my taskbar is suddenly black! Very nice readability, black font on black background :D I don't find a setting anywhere to change that - suggestions?

just right click on the desktop -> "desktop settings" and setting Desktop Theme to anything did it for me..
btw, did anyone notice that dolphin freezes for a few seconds every time you hover files (like it's reading the whole file for indexing or something)?
_________________
Never argue with an idiot. They will only pull you down to their level, then beat you with experience.
Back to top
View user's profile Send private message
drescherjm
Advocate
Advocate


Joined: 05 Jun 2004
Posts: 2779
Location: Pittsburgh, PA, USA

PostPosted: Mon Jun 16, 2008 7:57 pm    Post subject: Reply with quote

Quote:
BTW.
I've compiled kdebase-meta:kde-4.1 (4.0.82) but when I'm trying to start it i'm getting only splash screen with boot progress then just black workspace.
I can run programs by alt+f2 but I don't see taskbar, no kdemenu. nothing. just black screen.


Same here with 4.0.82. I believe some of the time I get a crash handler dialog and a grey screen for a few seconds.
_________________
John

My gentoo overlay
Instructons for overlay
Back to top
View user's profile Send private message
IamtheOne
Apprentice
Apprentice


Joined: 27 Sep 2002
Posts: 158
Location: Iowa

PostPosted: Tue Jun 17, 2008 3:13 am    Post subject: Reply with quote

s.hase wrote:
Bloodsurfer wrote:

And - the font in my taskbar is suddenly black! Very nice readability, black font on black background :D I don't find a setting anywhere to change that - suggestions?

Logout, delete your .kdesvn directory and on the next login the font is white again. That was my solution.

edit: playground-plasma and amarok compiles fine for me, but not k3b. kftpgrabber compiles, but crashes at start.


This is due to Amarok svn, and there are several better work arounds. Including right clicking the desktop and selecting "Desktop Settings..." and reseting the theme to default. But, next time you run Amarok, you will have to do it again.

http://bugs.kde.org/show_bug.cgi?id=163158
Back to top
View user's profile Send private message
TheCat
Tux's lil' helper
Tux's lil' helper


Joined: 20 Feb 2004
Posts: 139
Location: Belarus

PostPosted: Tue Jun 17, 2008 10:12 am    Post subject: Reply with quote

drescherjm wrote:
Quote:
BTW.
I've compiled kdebase-meta:kde-4.1 (4.0.82) but when I'm trying to start it i'm getting only splash screen with boot progress then just black workspace.
I can run programs by alt+f2 but I don't see taskbar, no kdemenu. nothing. just black screen.


Same here with 4.0.82. I believe some of the time I get a crash handler dialog and a grey screen for a few seconds.

got it working using this:
https://bugs.kde.org/attachment.cgi?id=25273&action=view

ebuild /usr/portage/local/layman/kdesvn-portage/kde-base/plasma/plasma-4.0.82.ebuild unpack
manually removing lines described in patch and then
ebuild /usr/portage/local/layman/kdesvn-portage/kde-base/plasma/plasma-4.0.82.ebuild merge

and by removing ~/.kde4/share/config/plasma-appletsrc

could someone create a patch and insert it in ebuild?
Back to top
View user's profile Send private message
drescherjm
Advocate
Advocate


Joined: 05 Jun 2004
Posts: 2779
Location: Pittsburgh, PA, USA

PostPosted: Tue Jun 17, 2008 10:30 am    Post subject: Reply with quote

Thanks I will take a look at that. I was not entirely sure that this had to do with the folderview bug because the kde crash helper did not mention that.
_________________
John

My gentoo overlay
Instructons for overlay
Back to top
View user's profile Send private message
TheCat
Tux's lil' helper
Tux's lil' helper


Joined: 20 Feb 2004
Posts: 139
Location: Belarus

PostPosted: Tue Jun 17, 2008 10:35 am    Post subject: Reply with quote

drescherjm wrote:
Thanks I will take a look at that. I was not entirely sure that this had to do with the folderview bug because the kde crash helper did not mention that.

check this:
https://bugs.kde.org/show_bug.cgi?id=163531
Back to top
View user's profile Send private message
drescherjm
Advocate
Advocate


Joined: 05 Jun 2004
Posts: 2779
Location: Pittsburgh, PA, USA

PostPosted: Tue Jun 17, 2008 11:08 am    Post subject: Reply with quote

That worked.

Lets assume

/usr/local/portage is listed as an overlay in my /etc/make.conf

I created a /usr/local/portage/kde-base/plasma
I named that patch plasma-4.0.82-folderview.patch and put it in the /usr/local/portage/kde-base/plasma/files

Then the diff for the ebuild

Code:
# diff -u /usr/portage/local/layman/kdesvn-portage/kde-base/plasma plasma-4.0.82.ebuild
--- /usr/portage/local/layman/kdesvn-portage/kde-base/plasma/plasma-4.0.82.ebuild       2008-06-14 11:21:39.000000000 -0400
+++ plasma-4.0.82.ebuild        2008-06-17 06:43:33.000000000 -0400
@@ -43,6 +43,9 @@
 }

 src_compile() {
+
+       epatch ${FILESDIR}/plasma-4.0.82-folderview.patch
+
        # Remove this if a patch has been applied upstream.
        sed -i -e 's/plasmapkg plasma/plasmapkg ${KDE4_KIO_LIBS} plasma/'\
                "${S}"/plasma/tools/plasmapkg/CMakeLists.txt || die "sed failed."


Then the usual third party ebuild digest:

ebuild plasma-4.0.82.ebuild digest
_________________
John

My gentoo overlay
Instructons for overlay
Back to top
View user's profile Send private message
ar_it
Apprentice
Apprentice


Joined: 25 Feb 2006
Posts: 211
Location: Poland/Warsaw

PostPosted: Tue Jun 17, 2008 11:29 am    Post subject: Reply with quote

Hi
In kdesvn-portega i finded kde-l10n-4.0.82.ebuild, but I use *-9999 ebuild. Can some one write ebuild to kde-l10n-9999?
_________________
ar_it
http://www.teamquest.pl/
https://pozyskajdane.pl
Back to top
View user's profile Send private message
TheCat
Tux's lil' helper
Tux's lil' helper


Joined: 20 Feb 2004
Posts: 139
Location: Belarus

PostPosted: Tue Jun 17, 2008 12:55 pm    Post subject: Reply with quote

ar_it wrote:
Hi
In kdesvn-portega i finded kde-l10n-4.0.82.ebuild, but I use *-9999 ebuild. Can some one write ebuild to kde-l10n-9999?

try to just copy kde-l10n-4.0.82.ebuild to kde-l10n-9999.ebuild and then make
ebuild kde-l10n-9999.ebuild digest
Back to top
View user's profile Send private message
ar_it
Apprentice
Apprentice


Joined: 25 Feb 2006
Posts: 211
Location: Poland/Warsaw

PostPosted: Tue Jun 17, 2008 1:25 pm    Post subject: Reply with quote

TheCat wrote:
ar_it wrote:
Hi
In kdesvn-portega i finded kde-l10n-4.0.82.ebuild, but I use *-9999 ebuild. Can some one write ebuild to kde-l10n-9999?

try to just copy kde-l10n-4.0.82.ebuild to kde-l10n-9999.ebuild and then make
ebuild kde-l10n-9999.ebuild digest


Code:

ebuild ./kde-l10n-9999.ebuild manifest
 *
 * ERROR: kde-base/kde-l10n-9999 failed.
 * Call stack:
 *                 ebuild.sh, line 1692:  Called source '/usr/portage/local/layman/kdesvn-portage/kde-base/kde-l10n/kde-l10n-9999.ebuild'
 *      kde-l10n-9999.ebuild, line    8:  Called inherit 'kde4overlay-base'
 *                 ebuild.sh, line 1206:  Called qa_source '/usr/portage/local/layman/kdesvn-portage/eclass/kde4overlay-base.eclass'
 *                 ebuild.sh, line   37:  Called source '/usr/portage/local/layman/kdesvn-portage/eclass/kde4overlay-base.eclass'
 *   kde4overlay-base.eclass, line  143:  Called die
 * The specific snippet of code:
 *                                      die "NEED_KDE=latest not supported for PV=${PV}"
 *  The die message:
 *   NEED_KDE=latest not supported for PV=9999
 *
 * If you need support, post the topmost build error, and the call stack if relevant.
 * The ebuild environment file is located at '/mnt/dane/portage/portage/kde-base/kde-l10n-9999/temp/die.env'.

_________________
ar_it
http://www.teamquest.pl/
https://pozyskajdane.pl
Back to top
View user's profile Send private message
waltercool
n00b
n00b


Joined: 27 Jan 2008
Posts: 38
Location: Chile

PostPosted: Tue Jun 17, 2008 2:25 pm    Post subject: Reply with quote

Bloodsurfer wrote:
s.hase wrote:
Bloodsurfer wrote:

And - the font in my taskbar is suddenly black! Very nice readability, black font on black background :D I don't find a setting anywhere to change that - suggestions?

Logout, delete your .kdesvn directory and on the next login the font is white again. That was my solution.


Ha, I didn't want to delete everything, so I did a little grepping and found the exact file where the setting is stored:
~/.kdesvn/share/apps/kthememanager/themes/original/original.xml
Either delete that or change the font setting in it. Now my gool old white font is back :)


LOOL!!!

You can solve it going into desktop settings and change your desktop theme :D

Assasins!! Killing your .kdesvn folder!
_________________
- WalterCool
Back to top
View user's profile Send private message
Bloodsurfer
Guru
Guru


Joined: 07 Dec 2005
Posts: 361
Location: Wolfstein, Germany (Rhineland-Palatinate)

PostPosted: Tue Jun 17, 2008 4:02 pm    Post subject: Reply with quote

waltercool wrote:
Assasins!! Killing your .kdesvn folder!

Not me, I solved it in the elegant way by just killing one file :D
_________________
SiberianSniper: my girlfriend's name ends with .c
Clete2: Uber geek! W00t! I'd rather have it end in .cpp... <insert name>.cpp
Dralnu: ...why not <name>.o? Then she's ready for linking...
SiberianSniper: or <name>.ko, so she's ready for insertion?
Back to top
View user's profile Send private message
Display posts from previous:   
This topic is locked: you cannot edit posts or make replies.    Gentoo Forums Forum Index Unsupported Software All times are GMT
Goto page Previous  1, 2, 3, 4, 5, 6 ... 28, 29, 30  Next
Page 5 of 30

 
Jump to:  
You cannot post new topics in this forum
You cannot reply to topics in this forum
You cannot edit your posts in this forum
You cannot delete your posts in this forum
You cannot vote in polls in this forum