Gentoo Forums
Gentoo Forums
Gentoo Forums
Quick Search: in
KDE 4.1 portage
View unanswered posts
View posts from last 24 hours

Goto page Previous  1, 2, 3 ... 6, 7, 8 ... 28, 29, 30  Next  
This topic is locked: you cannot edit posts or make replies.    Gentoo Forums Forum Index Unsupported Software
View previous topic :: View next topic  
Author Message
TheCat
Tux's lil' helper
Tux's lil' helper


Joined: 20 Feb 2004
Posts: 139
Location: Belarus

PostPosted: Thu Jun 26, 2008 11:23 am    Post subject: Reply with quote

Bloodsurfer wrote:
With my yesterday compiled version of KDE 4.1 I can't startup KDE anymore. It just gives me a black screen after the splash, nothing happens after that. No kwin, no plasma. I can start/restart them via krunner, but the black screen doesn't go away... So I'm back with KDE 3.5 for now :(

check this:
https://forums.gentoo.org/viewtopic-p-5123410.html#5123410
and answers
Back to top
View user's profile Send private message
Strayer
Tux's lil' helper
Tux's lil' helper


Joined: 11 Nov 2003
Posts: 75
Location: Germany

PostPosted: Thu Jun 26, 2008 11:33 am    Post subject: Reply with quote

Hmm, eix doesn't work with the overlay for me...
Code:
layer home # update-eix
Reading Portage settings ..
Building database (/var/cache/eix) ..
[0] "gentoo" /usr/portage/ (cache: metadata)
     Reading 100%
[1] "berkano" /usr/local/portage/layman/berkano (cache: parse|ebuild*)
     Reading 100%
[2] "kde4-overlay" /usr/local/portage/layman/kdesvn-portage (cache: parse|ebuild*)
     Reading  47%


It just hangs there :/ Any suggestions?
Back to top
View user's profile Send private message
Boccaccio
Apprentice
Apprentice


Joined: 19 Jul 2005
Posts: 282

PostPosted: Thu Jun 26, 2008 11:42 am    Post subject: Reply with quote

I had the same problem here. You just have to wait long enough (even with a C2D T7300).
Back to top
View user's profile Send private message
Strayer
Tux's lil' helper
Tux's lil' helper


Joined: 11 Nov 2003
Posts: 75
Location: Germany

PostPosted: Thu Jun 26, 2008 11:55 am    Post subject: Reply with quote

Worked, thanks! :D

Code:
layer home # time update-eix
Reading Portage settings ..
Building database (/var/cache/eix) ..
[0] "gentoo" /usr/portage/ (cache: metadata)
     Reading 100%
[1] "berkano" /usr/local/portage/layman/berkano (cache: parse|ebuild*)
     Reading 100%
[2] "kde4-overlay" /usr/local/portage/layman/kdesvn-portage (cache: parse|ebuild*)
     Reading 100%
[3] "local" /usr/local/portage (cache: parse|ebuild*)
     Reading 100%
Applying masks ..
Calculating hash tables ..
Writing database file /var/cache/eix ..
Database contains 12834 packages in 151 categories.

real    7m41.557s
user    5m22.186s
sys     2m21.529s
Back to top
View user's profile Send private message
drescherjm
Advocate
Advocate


Joined: 05 Jun 2004
Posts: 2779
Location: Pittsburgh, PA, USA

PostPosted: Thu Jun 26, 2008 1:00 pm    Post subject: Reply with quote

TheCat wrote:
Bloodsurfer wrote:
With my yesterday compiled version of KDE 4.1 I can't startup KDE anymore. It just gives me a black screen after the splash, nothing happens after that. No kwin, no plasma. I can start/restart them via krunner, but the black screen doesn't go away... So I'm back with KDE 3.5 for now :(

check this:
https://forums.gentoo.org/viewtopic-p-5123410.html#5123410
and answers


Bloodsurfer did you resync your overlays recently?

plasma-4.0.82-r2.ebuild should have fixed the problem as it applies the patch that the link above talks about.
_________________
John

My gentoo overlay
Instructons for overlay
Back to top
View user's profile Send private message
Bloodsurfer
Guru
Guru


Joined: 07 Dec 2005
Posts: 361
Location: Wolfstein, Germany (Rhineland-Palatinate)

PostPosted: Thu Jun 26, 2008 1:17 pm    Post subject: Reply with quote

drescherjm wrote:
Bloodsurfer did you resync your overlays recently?

plasma-4.0.82-r2.ebuild should have fixed the problem as it applies the patch that the link above talks about.

Ah, thanks. Yes, I do sync it regular, but I was using the 9999 versions, so it seems the patch is missing there...
Btw, are there ebuilds for the 83 snapshot coming or are the 82 ones somehow changed to use the newer snapshot?
_________________
SiberianSniper: my girlfriend's name ends with .c
Clete2: Uber geek! W00t! I'd rather have it end in .cpp... <insert name>.cpp
Dralnu: ...why not <name>.o? Then she's ready for linking...
SiberianSniper: or <name>.ko, so she's ready for insertion?
Back to top
View user's profile Send private message
Boccaccio
Apprentice
Apprentice


Joined: 19 Jul 2005
Posts: 282

PostPosted: Thu Jun 26, 2008 1:20 pm    Post subject: Reply with quote

I synced this morning, got the 83 and am now happily compiling.
Back to top
View user's profile Send private message
Bloodsurfer
Guru
Guru


Joined: 07 Dec 2005
Posts: 361
Location: Wolfstein, Germany (Rhineland-Palatinate)

PostPosted: Thu Jun 26, 2008 2:40 pm    Post subject: Reply with quote

OK, then my last sync was too early - I'll just try again :D
_________________
SiberianSniper: my girlfriend's name ends with .c
Clete2: Uber geek! W00t! I'd rather have it end in .cpp... <insert name>.cpp
Dralnu: ...why not <name>.o? Then she's ready for linking...
SiberianSniper: or <name>.ko, so she's ready for insertion?
Back to top
View user's profile Send private message
Bloodsurfer
Guru
Guru


Joined: 07 Dec 2005
Posts: 361
Location: Wolfstein, Germany (Rhineland-Palatinate)

PostPosted: Thu Jun 26, 2008 4:37 pm    Post subject: Reply with quote

Finished compiling 4.0.83. Still failing packages:

Code:
/usr/portage/tmp/portage/kde-base/kmix-4.0.83/work/kmix-4.0.83/kmix/mixer.cpp: In member function »virtual void Mixer::decreaseVolume(const QString&)«:
/usr/portage/tmp/portage/kde-base/kmix-4.0.83/work/kmix-4.0.83/kmix/mixer.cpp:601: Warnung: Variable »volC« wird nicht verwendet
/usr/portage/tmp/portage/kde-base/kmix-4.0.83/work/kmix-4.0.83/kmix/kmixdockwidget.cpp:45:30: Fehler: Phonon/MediaObject: Datei oder Verzeichnis nicht gefunden
[ 38%] Building CXX object kmix/CMakeFiles/kdeinit_kmixctrl.dir/mixdevice.o
[ 40%] Building CXX object kmix/tests/CMakeFiles/profiletest.dir/usr/portage/tmp/portage/kde-base/kmix-4.0.83/work/kmix-4.0.83/kmix/mixer_backend.o
/usr/portage/tmp/portage/kde-base/kmix-4.0.83/work/kmix-4.0.83/kmix/kmixdockwidget.cpp: In destructor »virtual KMixDockWidget::~KMixDockWidget()«:
/usr/portage/tmp/portage/kde-base/kmix-4.0.83/work/kmix-4.0.83/kmix/kmixdockwidget.cpp:72: Warnung: mögliches Problem bei Aufruf des »delete«-Operators erkannt
/usr/portage/tmp/portage/kde-base/kmix-4.0.83/work/kmix-4.0.83/kmix/kmixdockwidget.cpp:72: Warnung: invalid use of incomplete type »struct Phonon::MediaObject«
/usr/portage/tmp/portage/kde-base/kmix-4.0.83/work/kmix-4.0.83/kmix/kmixdockwidget.h:38: Warnung: forward declaration of »struct Phonon::MediaObject«
/usr/portage/tmp/portage/kde-base/kmix-4.0.83/work/kmix-4.0.83/kmix/kmixdockwidget.cpp:72: Anmerkung: weder der Destruktor noch der klassenspezifische Operator »delete« wird aufgerufen, auch wenn sie bei der Klassendefinition deklariert werden
/usr/portage/tmp/portage/kde-base/kmix-4.0.83/work/kmix-4.0.83/kmix/kmixdockwidget.cpp: In member function »void KMixDockWidget::createActions()«:
/usr/portage/tmp/portage/kde-base/kmix-4.0.83/work/kmix-4.0.83/kmix/kmixdockwidget.cpp:98: Fehler: »createPlayer« ist kein Element von »Phonon«
/usr/portage/tmp/portage/kde-base/kmix-4.0.83/work/kmix-4.0.83/kmix/kmixdockwidget.cpp:98: Fehler: »MusicCategory« ist kein Element von »Phonon«
/usr/portage/tmp/portage/kde-base/kmix-4.0.83/work/kmix-4.0.83/kmix/kmixdockwidget.cpp:99: Fehler: invalid use of incomplete type »struct Phonon::MediaObject«
/usr/portage/tmp/portage/kde-base/kmix-4.0.83/work/kmix-4.0.83/kmix/kmixdockwidget.h:38: Fehler: forward declaration of »struct Phonon::MediaObject«
make[2]: *** [kmix/CMakeFiles/kdeinit_kmix.dir/kmixdockwidget.o] Fehler 1
[ 41%] make[2]: *** Warte auf noch nicht beendete Prozesse...
Building CXX object kmix/CMakeFiles/kdeinit_kmixctrl.dir/volume.o
[ 43%] Building CXX object kmix/CMakeFiles/kdeinit_kmixctrl.dir/mixertoolbox.o
make[1]: *** [kmix/CMakeFiles/kdeinit_kmix.dir/all] Fehler 2
make[1]: *** Warte auf noch nicht beendete Prozesse...
[ 45%] Building CXX object kmix/tests/CMakeFiles/profiletest.dir/usr/portage/tmp/portage/kde-base/kmix-4.0.83/work/kmix-4.0.83/kmix/mixset.o
[ 46%] [ 48%] Building CXX object kmix/CMakeFiles/kdeinit_kmixctrl.dir/mixer_backend.o
Building CXX object kmix/tests/CMakeFiles/profiletest.dir/usr/portage/tmp/portage/kde-base/kmix-4.0.83/work/kmix-4.0.83/kmix/kmixdevicemanager.o
[ 50%] Building CXX object kmix/CMakeFiles/kdeinit_kmixctrl.dir/kmixdevicemanager.o
[ 51%] Building CXX object kmix/CMakeFiles/kdeinit_kmixctrl.dir/guiprofile.o
[ 53%] Building CXX object kmix/tests/CMakeFiles/profiletest.dir/kmixadaptor.o
[ 55%] Building CXX object kmix/tests/CMakeFiles/profiletest.dir/profiletest_automoc.o
[ 56%] Building CXX object kmix/CMakeFiles/kdeinit_kmixctrl.dir/kdeinit_kmixctrl_automoc.o
Linking CXX executable profiletest
Linking CXX shared library ../lib/libkdeinit4_kmixctrl.so
[ 56%] Built target profiletest
[ 56%] Built target kdeinit_kmixctrl
make: *** [all] Fehler 2
 *
 * ERROR: kde-base/kmix-4.0.83 failed.


Code:
[ 72%] Building CXX object kcontrol/screensaver/CMakeFiles/kcm_screensaver.dir/kcm_screensaver_automoc.o
Linking CXX shared module ../../lib/kcm_screensaver.so
Scanning dependencies of target kcm_joystick
[ 72%] Built target kcm_screensaver
Scanning dependencies of target kcm_access
Scanning dependencies of target kdeinit_kaccess
Scanning dependencies of target kcm_autostart
[ 72%] Building CXX object kcontrol/access/CMakeFiles/kcm_access.dir/kcmaccess.o
[ 72%] Building CXX object kcontrol/hardware/joystick/CMakeFiles/kcm_joystick.dir/joystick.o
[ 72%] Building CXX object kcontrol/access/CMakeFiles/kdeinit_kaccess.dir/kaccess.o
/usr/portage/tmp/portage/kde-base/systemsettings-4.0.83/work/systemsettings-4.0.83/kcontrol/access/kcmaccess.cpp:777:2: Warnung: #warning "kde4: dbus port: need to test it"
In Datei, eingefügt von /usr/portage/tmp/portage/kde-base/systemsettings-4.0.83/work/systemsettings_build/kcontrol/access/kaccess.moc:10Scanning dependencies of target kfontinst
,
                 von /usr/portage/tmp/portage/kde-base/systemsettings-4.0.83/work/systemsettings-4.0.83/kcontrol/access/kaccess.cpp:33:
/usr/portage/tmp/portage/kde-base/systemsettings-4.0.83/work/systemsettings_build/kcontrol/access/../../../systemsettings-4.0.83/kcontrol/access/kaccess.h:15:30: Fehler: Phonon/MediaObject: Datei oder Verzeichnis nicht gefunden
/usr/portage/tmp/portage/kde-base/systemsettings-4.0.83/work/systemsettings-4.0.83/kcontrol/access/kaccess.cpp:441:2: Warnung: #warning is this the best way to invert a pixmap?
/usr/portage/tmp/portage/kde-base/systemsettings-4.0.83/work/systemsettings-4.0.83/kcontrol/access/kaccess.cpp:590:2: Warnung: #warning "kde4 fixme"
[ 72%] Building CXX object kcontrol/autostart/CMakeFiles/kcm_autostart.dir/autostartitem.o
[ 72%] Building CXX object kcontrol/kfontinst/lib/CMakeFiles/kfontinst.dir/Misc.o
[ 73%] Building CXX object kcontrol/hardware/joystick/CMakeFiles/kcm_joystick.dir/joywidget.o
In file included from /usr/portage/tmp/portage/kde-base/systemsettings-4.0.83/work/systemsettings_build/kcontrol/access/kaccess.moc:10,
                 from /usr/portage/tmp/portage/kde-base/systemsettings-4.0.83/work/systemsettings-4.0.83/kcontrol/access/kaccess.cpp:33:
/usr/portage/tmp/portage/kde-base/systemsettings-4.0.83/work/systemsettings_build/kcontrol/access/../../../systemsettings-4.0.83/kcontrol/access/kaccess.h:76: Fehler: »Phonon« wurde nicht deklariert
/usr/portage/tmp/portage/kde-base/systemsettings-4.0.83/work/systemsettings_build/kcontrol/access/../../../systemsettings-4.0.83/kcontrol/access/kaccess.h:76: Fehler: ISO-C++ verbietet Deklaration von »MediaObject« ohne Typ
/usr/portage/tmp/portage/kde-base/systemsettings-4.0.83/work/systemsettings_build/kcontrol/access/../../../systemsettings-4.0.83/kcontrol/access/kaccess.h:76: Fehler: expected »;« before »*« token
/usr/portage/tmp/portage/kde-base/systemsettings-4.0.83/work/systemsettings-4.0.83/kcontrol/access/kaccess.cpp: In constructor »KAccessApp::KAccessApp(bool, bool)«:
/usr/portage/tmp/portage/kde-base/systemsettings-4.0.83/work/systemsettings-4.0.83/kcontrol/access/kaccess.cpp:100: Fehler: Klasse »KAccessApp« hat keinen Feldnamen »_player«
/usr/portage/tmp/portage/kde-base/systemsettings-4.0.83/work/systemsettings-4.0.83/kcontrol/access/kaccess.cpp: In member function »void KAccessApp::initMasks()«:
/usr/portage/tmp/portage/kde-base/systemsettings-4.0.83/work/systemsettings-4.0.83/kcontrol/access/kaccess.cpp:318: Warnung: es wird empfohlen, explizite geschweifte Klammern zu setzen, um mehrdeutiges »else« zu vermeiden
/usr/portage/tmp/portage/kde-base/systemsettings-4.0.83/work/systemsettings-4.0.83/kcontrol/access/kaccess.cpp: In member function »void KAccessApp::xkbBellNotify(XkbBellNotifyEvent*)«:
/usr/portage/tmp/portage/kde-base/systemsettings-4.0.83/work/systemsettings-4.0.83/kcontrol/access/kaccess.cpp:471: Fehler: »_player« wurde in diesem Gültigkeitsbereich nicht definiert
/usr/portage/tmp/portage/kde-base/systemsettings-4.0.83/work/systemsettings-4.0.83/kcontrol/access/kaccess.cpp:472: Fehler: »Phonon« wurde nicht deklariert
/usr/portage/tmp/portage/kde-base/systemsettings-4.0.83/work/systemsettings-4.0.83/kcontrol/access/kaccess.cpp:472: Fehler: »Phonon« wurde nicht deklariert
/usr/portage/tmp/portage/kde-base/systemsettings-4.0.83/work/systemsettings-4.0.83/kcontrol/access/kaccess.cpp:476: Fehler: »_player« wurde in diesem Gültigkeitsbereich nicht definiert
make[2]: *** [kcontrol/access/CMakeFiles/kdeinit_kaccess.dir/kaccess.o] Fehler 1
make[1]: *** [kcontrol/access/CMakeFiles/kdeinit_kaccess.dir/all] Fehler 2
make[1]: *** Warte auf noch nicht beendete Prozesse...
[ 73%] [ 73%] Building CXX object kcontrol/kfontinst/lib/CMakeFiles/kfontinst.dir/DisabledFonts.o
Building CXX object kcontrol/hardware/joystick/CMakeFiles/kcm_joystick.dir/poswidget.o
[ 74%] Building CXX object kcontrol/autostart/CMakeFiles/kcm_autostart.dir/addscriptdialog.o
/usr/portage/tmp/portage/kde-base/systemsettings-4.0.83/work/systemsettings-4.0.83/kcontrol/access/kcmaccess.cpp: In member function »void ExtendedIntNumInput::setRange(int, int, int, bool)«:
/usr/portage/tmp/portage/kde-base/systemsettings-4.0.83/work/systemsettings-4.0.83/kcontrol/access/kcmaccess.cpp:60: Warnung: »void KIntNumInput::setRange(int, int, int, bool)« ist veraltet (deklariert bei /usr/kde/4.1/include/knuminput.h:271)
/usr/portage/tmp/portage/kde-base/systemsettings-4.0.83/work/systemsettings-4.0.83/kcontrol/access/kcmaccess.cpp: At global scope:
/usr/portage/tmp/portage/kde-base/systemsettings-4.0.83/work/systemsettings-4.0.83/kcontrol/access/kcmaccess.cpp:110: Warnung: unbenutzter Parameter »config«
/usr/portage/tmp/portage/kde-base/systemsettings-4.0.83/work/systemsettings-4.0.83/kcontrol/access/kcmaccess.cpp: In constructor »KAccessConfig::KAccessConfig(QWidget*, const QStringList&)«:
/usr/portage/tmp/portage/kde-base/systemsettings-4.0.83/work/systemsettings-4.0.83/kcontrol/access/kcmaccess.cpp:232: Warnung: »KCModule::KCModule(const KComponentData&, QWidget*, const QStringList&)« ist veraltet (deklariert bei /usr/kde/4.1/include/kcmodule.h:117)
[ 75%] Building CXX object kcontrol/kfontinst/lib/CMakeFiles/kfontinst.dir/Fc.o
[ 75%] Building CXX object kcontrol/autostart/CMakeFiles/kcm_autostart.dir/advanceddialog.o
[ 76%] Building CXX object kcontrol/autostart/CMakeFiles/kcm_autostart.dir/autostart.o
[ 77%] Building CXX object kcontrol/hardware/joystick/CMakeFiles/kcm_joystick.dir/joydevice.o
[ 77%] Building CXX object kcontrol/hardware/joystick/CMakeFiles/kcm_joystick.dir/caldialog.o
[ 78%] Building CXX object kcontrol/kfontinst/lib/CMakeFiles/kfontinst.dir/kfontinst_automoc.o
Linking CXX shared library ../../../lib/libkfontinst.so
[ 78%] Building CXX object kcontrol/hardware/joystick/CMakeFiles/kcm_joystick.dir/kcm_joystick_automoc.o
[ 78%] Built target kfontinst
[ 78%] Building CXX object kcontrol/access/CMakeFiles/kcm_access.dir/kcm_access_automoc.o
Linking CXX shared module ../../lib/kcm_access.so
Linking CXX shared module ../../../lib/kcm_joystick.so
[ 78%] Built target kcm_joystick
[ 78%] Built target kcm_access
[ 78%] Building CXX object kcontrol/autostart/CMakeFiles/kcm_autostart.dir/kcm_autostart_automoc.o
Linking CXX shared module ../../lib/kcm_autostart.so
[ 78%] Built target kcm_autostart
make: *** [all] Fehler 2
 *
 * ERROR: kde-base/systemsettings-4.0.83 failed.


Code:
[ 16%] Building C object libkcompactdisc/CMakeFiles/kcompactdisc.dir/wmlib/cdda.o
/usr/portage/tmp/portage/kde-base/libkcompactdisc-4.0.83/work/libkcompactdisc-4.0.83/libkcompactdisc/phonon_interface.cpp:27:25: Fehler: Phonon/Global: Datei oder Verzeichnis nicht gefunden
/usr/portage/tmp/portage/kde-base/libkcompactdisc-4.0.83/work/libkcompactdisc-4.0.83/libkcompactdisc/phonon_interface.cpp:28:30: Fehler: Phonon/MediaObject: Datei oder Verzeichnis nicht gefunden
/usr/portage/tmp/portage/kde-base/libkcompactdisc-4.0.83/work/libkcompactdisc-4.0.83/libkcompactdisc/phonon_interface.cpp:29:30: Fehler: Phonon/AudioOutput: Datei oder Verzeichnis nicht gefunden
/usr/portage/tmp/portage/kde-base/libkcompactdisc-4.0.83/work/libkcompactdisc-4.0.83/libkcompactdisc/phonon_interface.cpp:30:23: Fehler: Phonon/Path: Datei oder Verzeichnis nicht gefunden
/usr/portage/tmp/portage/kde-base/libkcompactdisc-4.0.83/work/libkcompactdisc-4.0.83/libkcompactdisc/phonon_interface.cpp:31:34: Fehler: Phonon/MediaController: Datei oder Verzeichnis nicht gefunden
[ 20%] /usr/portage/tmp/portage/kde-base/libkcompactdisc-4.0.83/work/libkcompactdisc-4.0.83/libkcompactdisc/phonon_interface.cpp:50: Fehler: ISO-C++ verbietet Deklaration von »MediaObject« ohne TypBuilding C object libkcompactdisc/CMakeFiles/kcompactdisc.dir/wmlib/cddb.o

/usr/portage/tmp/portage/kde-base/libkcompactdisc-4.0.83/work/libkcompactdisc-4.0.83/libkcompactdisc/phonon_interface.cpp:50: Fehler: expected »;« before »*« token
/usr/portage/tmp/portage/kde-base/libkcompactdisc-4.0.83/work/libkcompactdisc-4.0.83/libkcompactdisc/phonon_interface.cpp:51: Fehler: ISO-C++ verbietet Deklaration von »AudioOutput« ohne Typ
/usr/portage/tmp/portage/kde-base/libkcompactdisc-4.0.83/work/libkcompactdisc-4.0.83/libkcompactdisc/phonon_interface.cpp:51: Fehler: expected »;« before »*« token
/usr/portage/tmp/portage/kde-base/libkcompactdisc-4.0.83/work/libkcompactdisc-4.0.83/libkcompactdisc/phonon_interface.cpp:52: Fehler: ISO-C++ verbietet Deklaration von »MediaController« ohne Typ
/usr/portage/tmp/portage/kde-base/libkcompactdisc-4.0.83/work/libkcompactdisc-4.0.83/libkcompactdisc/phonon_interface.cpp:52: Fehler: expected »;« before »*« token
/usr/portage/tmp/portage/kde-base/libkcompactdisc-4.0.83/work/libkcompactdisc-4.0.83/libkcompactdisc/phonon_interface.cpp: In constructor »ProducerWidget::ProducerWidget(KPhononCompactDiscPrivate*, const QString&)«:
/usr/portage/tmp/portage/kde-base/libkcompactdisc-4.0.83/work/libkcompactdisc-4.0.83/libkcompactdisc/phonon_interface.cpp:56: Fehler: Klasse »ProducerWidget« hat keinen Feldnamen »m_media«
/usr/portage/tmp/portage/kde-base/libkcompactdisc-4.0.83/work/libkcompactdisc-4.0.83/libkcompactdisc/phonon_interface.cpp:57: Fehler: Klasse »ProducerWidget« hat keinen Feldnamen »m_output«
/usr/portage/tmp/portage/kde-base/libkcompactdisc-4.0.83/work/libkcompactdisc-4.0.83/libkcompactdisc/phonon_interface.cpp:58: Fehler: Klasse »ProducerWidget« hat keinen Feldnamen »m_mediaController«
/usr/portage/tmp/portage/kde-base/libkcompactdisc-4.0.83/work/libkcompactdisc-4.0.83/libkcompactdisc/phonon_interface.cpp:60: Fehler: »m_media« wurde in diesem Gültigkeitsbereich nicht definiert
/usr/portage/tmp/portage/kde-base/libkcompactdisc-4.0.83/work/libkcompactdisc-4.0.83/libkcompactdisc/phonon_interface.cpp:60: Fehler: expected type-specifier before »MediaObject«
/usr/portage/tmp/portage/kde-base/libkcompactdisc-4.0.83/work/libkcompactdisc-4.0.83/libkcompactdisc/phonon_interface.cpp:60: Fehler: expected `;' before »MediaObject«
/usr/portage/tmp/portage/kde-base/libkcompactdisc-4.0.83/work/libkcompactdisc-4.0.83/libkcompactdisc/phonon_interface.cpp:64: Fehler: »m_output« wurde in diesem Gültigkeitsbereich nicht definiert
/usr/portage/tmp/portage/kde-base/libkcompactdisc-4.0.83/work/libkcompactdisc-4.0.83/libkcompactdisc/phonon_interface.cpp:64: Fehler: expected type-specifier before »AudioOutput«
/usr/portage/tmp/portage/kde-base/libkcompactdisc-4.0.83/work/libkcompactdisc-4.0.83/libkcompactdisc/phonon_interface.cpp:64: Fehler: expected `;' before »AudioOutput«
/usr/portage/tmp/portage/kde-base/libkcompactdisc-4.0.83/work/libkcompactdisc-4.0.83/libkcompactdisc/phonon_interface.cpp:65: Fehler: »createPath« ist kein Element von »Phonon«
/usr/portage/tmp/portage/kde-base/libkcompactdisc-4.0.83/work/libkcompactdisc-4.0.83/libkcompactdisc/phonon_interface.cpp:72: Fehler: »MediaSource« wurde in diesem Gültigkeitsbereich nicht definiert
/usr/portage/tmp/portage/kde-base/libkcompactdisc-4.0.83/work/libkcompactdisc-4.0.83/libkcompactdisc/phonon_interface.cpp:72: Fehler: »m_mediaSource« wurde in diesem Gültigkeitsbereich nicht definiert
/usr/portage/tmp/portage/kde-base/libkcompactdisc-4.0.83/work/libkcompactdisc-4.0.83/libkcompactdisc/phonon_interface.cpp:72: Fehler: expected type-specifier before »MediaSource«
/usr/portage/tmp/portage/kde-base/libkcompactdisc-4.0.83/work/libkcompactdisc-4.0.83/libkcompactdisc/phonon_interface.cpp:72: Fehler: expected `;' before »MediaSource«
/usr/portage/tmp/portage/kde-base/libkcompactdisc-4.0.83/work/libkcompactdisc-4.0.83/libkcompactdisc/phonon_interface.cpp:75: Fehler: »m_mediaController« wurde in diesem Gültigkeitsbereich nicht definiert
/usr/portage/tmp/portage/kde-base/libkcompactdisc-4.0.83/work/libkcompactdisc-4.0.83/libkcompactdisc/phonon_interface.cpp:75: Fehler: expected type-specifier before »MediaController«
/usr/portage/tmp/portage/kde-base/libkcompactdisc-4.0.83/work/libkcompactdisc-4.0.83/libkcompactdisc/phonon_interface.cpp:75: Fehler: expected `;' before »MediaController«
/usr/portage/tmp/portage/kde-base/libkcompactdisc-4.0.83/work/libkcompactdisc-4.0.83/libkcompactdisc/phonon_interface.cpp: At global scope:
/usr/portage/tmp/portage/kde-base/libkcompactdisc-4.0.83/work/libkcompactdisc-4.0.83/libkcompactdisc/phonon_interface.cpp:55: Warnung: unbenutzter Parameter »Udi«
/usr/portage/tmp/portage/kde-base/libkcompactdisc-4.0.83/work/libkcompactdisc-4.0.83/libkcompactdisc/phonon_interface.cpp: In destructor »virtual ProducerWidget::~ProducerWidget()«:
/usr/portage/tmp/portage/kde-base/libkcompactdisc-4.0.83/work/libkcompactdisc-4.0.83/libkcompactdisc/phonon_interface.cpp:80: Fehler: »m_mediaController« wurde in diesem Gültigkeitsbereich nicht definiert
/usr/portage/tmp/portage/kde-base/libkcompactdisc-4.0.83/work/libkcompactdisc-4.0.83/libkcompactdisc/phonon_interface.cpp:81: Fehler: »m_output« wurde in diesem Gültigkeitsbereich nicht definiert
/usr/portage/tmp/portage/kde-base/libkcompactdisc-4.0.83/work/libkcompactdisc-4.0.83/libkcompactdisc/phonon_interface.cpp:82: Fehler: »m_media« wurde in diesem Gültigkeitsbereich nicht definiert
/usr/portage/tmp/portage/kde-base/libkcompactdisc-4.0.83/work/libkcompactdisc-4.0.83/libkcompactdisc/phonon_interface.cpp: In member function »virtual unsigned int KPhononCompactDiscPrivate::trackLength(unsigned int)«:
/usr/portage/tmp/portage/kde-base/libkcompactdisc-4.0.83/work/libkcompactdisc-4.0.83/libkcompactdisc/phonon_interface.cpp:142: Fehler: »class ProducerWidget« hat kein Element namens »m_mediaController«
/usr/portage/tmp/portage/kde-base/libkcompactdisc-4.0.83/work/libkcompactdisc-4.0.83/libkcompactdisc/phonon_interface.cpp:145: Fehler: »class ProducerWidget« hat kein Element namens »m_media«
/usr/portage/tmp/portage/kde-base/libkcompactdisc-4.0.83/work/libkcompactdisc-4.0.83/libkcompactdisc/phonon_interface.cpp: In member function »virtual void KPhononCompactDiscPrivate::playTrackPosition(unsigned int, unsigned int)«:
/usr/portage/tmp/portage/kde-base/libkcompactdisc-4.0.83/work/libkcompactdisc-4.0.83/libkcompactdisc/phonon_interface.cpp:160: Fehler: »class ProducerWidget« hat kein Element namens »m_mediaController«
/usr/portage/tmp/portage/kde-base/libkcompactdisc-4.0.83/work/libkcompactdisc-4.0.83/libkcompactdisc/phonon_interface.cpp:161: Fehler: »class ProducerWidget« hat kein Element namens »m_media«
/usr/portage/tmp/portage/kde-base/libkcompactdisc-4.0.83/work/libkcompactdisc-4.0.83/libkcompactdisc/phonon_interface.cpp:162: Fehler: »class ProducerWidget« hat kein Element namens »m_media«
/usr/portage/tmp/portage/kde-base/libkcompactdisc-4.0.83/work/libkcompactdisc-4.0.83/libkcompactdisc/phonon_interface.cpp: In member function »virtual void KPhononCompactDiscPrivate::pause()«:
/usr/portage/tmp/portage/kde-base/libkcompactdisc-4.0.83/work/libkcompactdisc-4.0.83/libkcompactdisc/phonon_interface.cpp:170: Fehler: »class ProducerWidget« hat kein Element namens »m_media«
/usr/portage/tmp/portage/kde-base/libkcompactdisc-4.0.83/work/libkcompactdisc-4.0.83/libkcompactdisc/phonon_interface.cpp: In member function »virtual void KPhononCompactDiscPrivate::stop()«:
/usr/portage/tmp/portage/kde-base/libkcompactdisc-4.0.83/work/libkcompactdisc-4.0.83/libkcompactdisc/phonon_interface.cpp:178: Fehler: »class ProducerWidget« hat kein Element namens »m_media«
/usr/portage/tmp/portage/kde-base/libkcompactdisc-4.0.83/work/libkcompactdisc-4.0.83/libkcompactdisc/phonon_interface.cpp: In member function »virtual void KPhononCompactDiscPrivate::setVolume(unsigned int)«:
/usr/portage/tmp/portage/kde-base/libkcompactdisc-4.0.83/work/libkcompactdisc-4.0.83/libkcompactdisc/phonon_interface.cpp:211: Fehler: »class ProducerWidget« hat kein Element namens »m_output«
/usr/portage/tmp/portage/kde-base/libkcompactdisc-4.0.83/work/libkcompactdisc-4.0.83/libkcompactdisc/phonon_interface.cpp: In member function »virtual unsigned int KPhononCompactDiscPrivate::volume()«:
/usr/portage/tmp/portage/kde-base/libkcompactdisc-4.0.83/work/libkcompactdisc-4.0.83/libkcompactdisc/phonon_interface.cpp:223: Fehler: »class ProducerWidget« hat kein Element namens »m_output«
/usr/portage/tmp/portage/kde-base/libkcompactdisc-4.0.83/work/libkcompactdisc-4.0.83/libkcompactdisc/phonon_interface.cpp: In member function »virtual void KPhononCompactDiscPrivate::queryMetadata()«:
/usr/portage/tmp/portage/kde-base/libkcompactdisc-4.0.83/work/libkcompactdisc-4.0.83/libkcompactdisc/phonon_interface.cpp:238: Fehler: »class ProducerWidget« hat kein Element namens »m_media«
/usr/portage/tmp/portage/kde-base/libkcompactdisc-4.0.83/work/libkcompactdisc-4.0.83/libkcompactdisc/phonon_interface.cpp: In member function »void KPhononCompactDiscPrivate::tick(qint64)«:
/usr/portage/tmp/portage/kde-base/libkcompactdisc-4.0.83/work/libkcompactdisc-4.0.83/libkcompactdisc/phonon_interface.cpp:275: Fehler: »class ProducerWidget« hat kein Element namens »m_mediaController«
/usr/portage/tmp/portage/kde-base/libkcompactdisc-4.0.83/work/libkcompactdisc-4.0.83/libkcompactdisc/phonon_interface.cpp: In member function »void KPhononCompactDiscPrivate::stateChanged(Phonon::State, Phonon::State)«:
/usr/portage/tmp/portage/kde-base/libkcompactdisc-4.0.83/work/libkcompactdisc-4.0.83/libkcompactdisc/phonon_interface.cpp:323: Fehler: »class ProducerWidget« hat kein Element namens »m_mediaController«
make[2]: *** [libkcompactdisc/CMakeFiles/kcompactdisc.dir/phonon_interface.o] Fehler 1
make[2]: *** Warte auf noch nicht beendete Prozesse...
make[1]: *** [libkcompactdisc/CMakeFiles/kcompactdisc.dir/all] Fehler 2
make: *** [all] Fehler 2
 *
 * ERROR: kde-base/libkcompactdisc-4.0.83 failed.


Code:
[  1%] Generating ui_chooseenginewidget.h
Generating document.moc
Generating textdocumentgenerator.moc
Generating generator.moc
Generating rotationjob_p.moc
Generating audioplayer.moc
Generating pagecontroller_p.moc
Generating generator_p.moc
Generating bookmarkmanager.moc
Scanning dependencies of target okular
[  2%] [  3%] Building CXX object okular/shell/CMakeFiles/okular.dir/main.o
Building CXX object okular/shell/CMakeFiles/okular.dir/shell.o
Scanning dependencies of target okularcore
[  3%] Building CXX object okular/shell/CMakeFiles/okular.dir/okular_automoc.o
Linking CXX executable okular
[  4%] Building CXX object okular/CMakeFiles/okularcore.dir/core/action.o
[  4%] Building CXX object okular/CMakeFiles/okularcore.dir/core/annotations.o
[  5%] Building CXX object okular/CMakeFiles/okularcore.dir/core/area.o
[  6%] Building CXX object okular/CMakeFiles/okularcore.dir/core/audioplayer.o
/usr/portage/tmp/portage/kde-base/okular-4.0.83/work/okular-4.0.83/okular/core/audioplayer.cpp:18:23: Fehler: Phonon/Path: Datei oder Verzeichnis nicht gefunden
[  6%] Built target okular
[  6%] Building CXX object okular/CMakeFiles/okularcore.dir/core/bookmarkmanager.o
make[2]: *** [okular/CMakeFiles/okularcore.dir/core/audioplayer.o] Fehler 1
make[2]: *** Warte auf noch nicht beendete Prozesse...
make[1]: *** [okular/CMakeFiles/okularcore.dir/all] Fehler 2
make: *** [all] Fehler 2
 *
 * ERROR: kde-base/okular-4.0.83 failed.


Code:
[ 57%] Building CXX object ktouch/src/CMakeFiles/ktouch.dir/ktouchkeyboardwidget.o
[ 60%] Building CXX object ktouch/src/CMakeFiles/ktouch.dir/ktouchkeyconnector.o
[ 63%] Building CXX object ktouch/src/CMakeFiles/ktouch.dir/ktouchkey.o
/usr/portage/tmp/portage/kde-base/ktouch-4.0.83/work/ktouch-4.0.83/ktouch/src/ktouchkeyboard.cpp:72: Warnung: unbenutzter Parameter »msg«
[ 65%] /usr/portage/tmp/portage/kde-base/ktouch-4.0.83/work/ktouch-4.0.83/ktouch/src/ktouchkeyboard.cpp:259: Warnung: unbenutzter Parameter »warnings«
Building CXX object ktouch/src/CMakeFiles/ktouch.dir/ktouchlecture.o
/usr/portage/tmp/portage/kde-base/ktouch-4.0.83/work/ktouch-4.0.83/ktouch/src/ktouchkey.cpp: In member function »virtual void KTouchKey::paint(QPainter*, const QStyleOptionGraphicsItem*, QWidget*)«:
/usr/portage/tmp/portage/kde-base/ktouch-4.0.83/work/ktouch-4.0.83/ktouch/src/ktouchkey.cpp:191: Warnung: Aufzählungswert »ModifierState« wird nicht von switch behandelt
[ 68%] Building CXX object ktouch/src/CMakeFiles/ktouch.dir/ktouchleveldata.o
[ 71%] [ 73%] Building CXX object ktouch/src/CMakeFiles/ktouch.dir/ktouchlevelsummarydialog.o
[ 76%] Building CXX object ktouch/src/CMakeFiles/ktouch.dir/ktouchtextlinewidget.o
Building CXX object ktouch/src/CMakeFiles/ktouch.dir/ktouchstatisticsdialog.o
[ 78%] [ 81%] Building CXX object ktouch/src/CMakeFiles/ktouch.dir/ktouchstatuswidget.o
Building CXX object ktouch/src/CMakeFiles/ktouch.dir/ktouchstatisticsdata.o
[ 84%] Building CXX object ktouch/src/CMakeFiles/ktouch.dir/ktouchtrainer.o
In Datei, eingefügt von /usr/portage/tmp/portage/kde-base/ktouch-4.0.83/work/ktouch-4.0.83/ktouch/src/ktouchtrainer.cpp:13:
/usr/portage/tmp/portage/kde-base/ktouch-4.0.83/work/ktouch-4.0.83/ktouch/src/ktouchtrainer.h:17:30: Fehler: Phonon/MediaObject: Datei oder Verzeichnis nicht gefunden
/usr/portage/tmp/portage/kde-base/ktouch-4.0.83/work/ktouch-4.0.83/ktouch/src/ktouchlevelsummarydialog.cpp: In member function »void KTouchLevelSummaryDialog::showInfo(bool&, bool&, const KTouchLevelStats&)«:
/usr/portage/tmp/portage/kde-base/ktouch-4.0.83/work/ktouch-4.0.83/ktouch/src/ktouchlevelsummarydialog.cpp:42: Warnung: Variable »userList« wird nicht verwendet
/usr/portage/tmp/portage/kde-base/ktouch-4.0.83/work/ktouch-4.0.83/ktouch/src/ktouchlevelsummarydialog.cpp: At global scope:
/usr/portage/tmp/portage/kde-base/ktouch-4.0.83/work/ktouch-4.0.83/ktouch/src/ktouchlevelsummarydialog.cpp:37: Warnung: unbenutzter Parameter »decreaseLevel«
[ 86%] Building CXX object ktouch/src/CMakeFiles/ktouch.dir/ktouchusersetupdialog.o
In file included from /usr/portage/tmp/portage/kde-base/ktouch-4.0.83/work/ktouch-4.0.83/ktouch/src/ktouchtrainer.cpp:13:
/usr/portage/tmp/portage/kde-base/ktouch-4.0.83/work/ktouch-4.0.83/ktouch/src/ktouchtrainer.h:162: Fehler: »Phonon« wurde nicht deklariert
/usr/portage/tmp/portage/kde-base/ktouch-4.0.83/work/ktouch-4.0.83/ktouch/src/ktouchtrainer.h:162: Fehler: ISO-C++ verbietet Deklaration von »MediaObject« ohne Typ
/usr/portage/tmp/portage/kde-base/ktouch-4.0.83/work/ktouch-4.0.83/ktouch/src/ktouchtrainer.h:162: Fehler: expected »;« before »*« token
[ 89%] Building CXX object ktouch/src/CMakeFiles/ktouch.dir/ktouchutils.o
/usr/portage/tmp/portage/kde-base/ktouch-4.0.83/work/ktouch-4.0.83/ktouch/src/ktouchtrainer.cpp: In constructor »KTouchTrainer::KTouchTrainer(KTouchStatusWidget*, KTouchTextLineWidget*, KTouchKeyboardWidget*, KTouchLecture*)«:
/usr/portage/tmp/portage/kde-base/ktouch-4.0.83/work/ktouch-4.0.83/ktouch/src/ktouchtrainer.cpp:52: Fehler: »m_player« wurde in diesem Gültigkeitsbereich nicht definiert
/usr/portage/tmp/portage/kde-base/ktouch-4.0.83/work/ktouch-4.0.83/ktouch/src/ktouchtrainer.cpp:52: Fehler: »Phonon« wurde nicht deklariert
/usr/portage/tmp/portage/kde-base/ktouch-4.0.83/work/ktouch-4.0.83/ktouch/src/ktouchtrainer.cpp:52: Fehler: »Phonon« wurde nicht deklariert
/usr/portage/tmp/portage/kde-base/ktouch-4.0.83/work/ktouch-4.0.83/ktouch/src/ktouchtrainer.cpp: In member function »void KTouchTrainer::keyPressed(QChar)«:
/usr/portage/tmp/portage/kde-base/ktouch-4.0.83/work/ktouch-4.0.83/ktouch/src/ktouchtrainer.cpp:88: Fehler: »m_player« wurde in diesem Gültigkeitsbereich nicht definiert
/usr/portage/tmp/portage/kde-base/ktouch-4.0.83/work/ktouch-4.0.83/ktouch/src/ktouchtrainer.cpp: In member function »void KTouchTrainer::backspacePressed()«:
/usr/portage/tmp/portage/kde-base/ktouch-4.0.83/work/ktouch-4.0.83/ktouch/src/ktouchtrainer.cpp:141: Fehler: »m_player« wurde in diesem Gültigkeitsbereich nicht definiert
/usr/portage/tmp/portage/kde-base/ktouch-4.0.83/work/ktouch-4.0.83/ktouch/src/ktouchtrainer.cpp: In member function »void KTouchTrainer::enterPressed()«:
/usr/portage/tmp/portage/kde-base/ktouch-4.0.83/work/ktouch-4.0.83/ktouch/src/ktouchtrainer.cpp:172: Fehler: »m_player« wurde in diesem Gültigkeitsbereich nicht definiert
/usr/portage/tmp/portage/kde-base/ktouch-4.0.83/work/ktouch-4.0.83/ktouch/src/ktouchtrainer.cpp: In member function »void KTouchTrainer::levelUp()«:
/usr/portage/tmp/portage/kde-base/ktouch-4.0.83/work/ktouch-4.0.83/ktouch/src/ktouchtrainer.cpp:378: Fehler: »m_player« wurde in diesem Gültigkeitsbereich nicht definiert
/usr/portage/tmp/portage/kde-base/ktouch-4.0.83/work/ktouch-4.0.83/ktouch/src/ktouchtrainer.cpp: In member function »void KTouchTrainer::levelDown()«:
/usr/portage/tmp/portage/kde-base/ktouch-4.0.83/work/ktouch-4.0.83/ktouch/src/ktouchtrainer.cpp:403: Fehler: »m_player« wurde in diesem Gültigkeitsbereich nicht definiert
[ 92%] Building CXX object ktouch/src/CMakeFiles/ktouch.dir/ktouch.o
make[2]: *** [ktouch/src/CMakeFiles/ktouch.dir/ktouchtrainer.o] Fehler 1
make[2]: *** Warte auf noch nicht beendete Prozesse...
In Datei, eingefügt von /usr/portage/tmp/portage/kde-base/ktouch-4.0.83/work/ktouch-4.0.83/ktouch/src/ktouch.cpp:41:
/usr/portage/tmp/portage/kde-base/ktouch-4.0.83/work/ktouch-4.0.83/ktouch/src/ktouchtrainer.h:17:30: Fehler: Phonon/MediaObject: Datei oder Verzeichnis nicht gefunden
In file included from /usr/portage/tmp/portage/kde-base/ktouch-4.0.83/work/ktouch-4.0.83/ktouch/src/ktouch.cpp:41:
/usr/portage/tmp/portage/kde-base/ktouch-4.0.83/work/ktouch-4.0.83/ktouch/src/ktouchtrainer.h:162: Fehler: »Phonon« wurde nicht deklariert
/usr/portage/tmp/portage/kde-base/ktouch-4.0.83/work/ktouch-4.0.83/ktouch/src/ktouchtrainer.h:162: Fehler: ISO-C++ verbietet Deklaration von »MediaObject« ohne Typ
/usr/portage/tmp/portage/kde-base/ktouch-4.0.83/work/ktouch-4.0.83/ktouch/src/ktouchtrainer.h:162: Fehler: expected »;« before »*« token
make[2]: *** [ktouch/src/CMakeFiles/ktouch.dir/ktouch.o] Fehler 1
make[1]: *** [ktouch/src/CMakeFiles/ktouch.dir/all] Fehler 2
make: *** [all] Fehler 2
 *
 * ERROR: kde-base/ktouch-4.0.83 failed.



All those seem to be related to phonon somehow. Did I miss anything there? Do I need something specific?


Code:
root@fangthane - bloodsurfer # eix phonon
* kde-base/phonon
     Available versions:  (kde-4)  {M}(~)4.0.4 {M}(~)4.0.5
        {debug xcb}
     Homepage:            http://www.kde.org/
     Description:         KDE multimedia API

* kde-base/phonon-xine [1]
     Available versions:
        (kde-4.1)       (**)4.0.82 (**)4.0.83
        (kde-svn)       (**)9999
        {debug xcb}
     Homepage:            http://www.kde.org/
     Description:         KDE Phonon Xine backend

[I] media-sound/phonon [1]
     Available versions:  (**)2008.06.13 (**)9999 {debug gstreamer}
     Installed versions:  9999(12:29:58 26.06.2008)(gstreamer -debug)
     Description:         KDE multimedia API

[I] x11-libs/qt-phonon
     Available versions:  (4)  {M}(~)4.4.0
        {dbus debug pch}
     Installed versions:  4.4.0(4)(15:19:17 25.06.2008)(dbus -debug -pch)
     Homepage:            http://www.trolltech.com/
     Description:         The Phonon module for the Qt toolkit.

[1] "kde4-overlay" /usr/portage/local/layman/kdesvn-portage

Found 4 matches.



The rest of 4.0.83 compiled fine.
_________________
SiberianSniper: my girlfriend's name ends with .c
Clete2: Uber geek! W00t! I'd rather have it end in .cpp... <insert name>.cpp
Dralnu: ...why not <name>.o? Then she's ready for linking...
SiberianSniper: or <name>.ko, so she's ready for insertion?
Back to top
View user's profile Send private message
Boccaccio
Apprentice
Apprentice


Joined: 19 Jul 2005
Posts: 282

PostPosted: Thu Jun 26, 2008 5:11 pm    Post subject: Reply with quote

For me, everything compiled nicely. Concerning phonon, I have the following installed:

Code:

* kde-base/phonon
     Available versions:  (kde-4)  [M]~4.0.4 [M]~4.0.5
        {debug xcb}
     Homepage:            http://www.kde.org/
     Description:         KDE multimedia API

[I] kde-base/phonon-xine [1]
     Available versions:
        (kde-4.1)       **4.0.82 (**)4.0.83
        (kde-svn)       **9999
        {+xcb debug}
     Installed versions:  4.0.83(kde-4.1)(15:25:53 26.06.2008)(xcb -debug)
     Homepage:            http://www.kde.org/
     Description:         KDE Phonon Xine backend

[I] media-sound/phonon [1]
     Available versions:  (**)2008.06.13 (**)9999 {debug gstreamer}
     Installed versions:  9999(14:47:27 16.06.2008)(gstreamer -debug)
     Description:         KDE multimedia API

* x11-libs/qt-phonon
     Available versions:  (4)  {M}(~)4.4.0
        {dbus debug pch}
     Homepage:            http://www.trolltech.com/
     Description:         The Phonon module for the Qt toolkit.
Back to top
View user's profile Send private message
Strayer
Tux's lil' helper
Tux's lil' helper


Joined: 11 Nov 2003
Posts: 75
Location: Germany

PostPosted: Thu Jun 26, 2008 7:03 pm    Post subject: Reply with quote

Okay, apart from the kdnssd everything compiled correctly.
KDE 4.1 is looking good :)

Only thing is... It feels a little bit slow somehow... For example the System settings... the blue colored hover thingy takes 1 or 2 seconds to appear under the part I'm currently pointing at, cycling through the windows and well... everything kind of feels like that :(
When I enable the composite effects it get's even worse. Resizing in composite mode is just unusable...

Maybe I'm missing something here?

emerge --info
xorg.conf
kernel .config

Hardware:
Dell Vostro 1500 (ICH8 Chipset)
Intel(R) Core(TM)2 Duo CPU T7250 @ 2.00GHz
Nvidia Geforce 8600M GT 256MB
Back to top
View user's profile Send private message
coolsnowmen
Veteran
Veteran


Joined: 30 Jun 2004
Posts: 1479
Location: No.VA

PostPosted: Thu Jun 26, 2008 9:02 pm    Post subject: Reply with quote

Strayer wrote:
Hmm, eix doesn't work with the overlay for me...
Code:
layer home # update-eix
Reading Portage settings ..
Building database (/var/cache/eix) ..
[0] "gentoo" /usr/portage/ (cache: metadata)
     Reading 100%
[1] "berkano" /usr/local/portage/layman/berkano (cache: parse|ebuild*)
     Reading 100%
[2] "kde4-overlay" /usr/local/portage/layman/kdesvn-portage (cache: parse|ebuild*)
     Reading  47%


It just hangs there :/ Any suggestions?


try:
Code:
OVERLAY_CACHE_METHOD=parse update-eix

_________________
emerge: there are no ebuilds to satisfy "moo"
Back to top
View user's profile Send private message
Bloodsurfer
Guru
Guru


Joined: 07 Dec 2005
Posts: 361
Location: Wolfstein, Germany (Rhineland-Palatinate)

PostPosted: Thu Jun 26, 2008 10:07 pm    Post subject: Reply with quote

Hm, I unmerged qt-phonon and then remerged phonon and could emerge phonon-xine. That one failed earlier when I had qt-phonon installed.

With that kmix, okular and libkcompactdisc do compile now, but systemsettings still fails, only later in the build:

Code:
[ 72%] [ 72%] Building CXX object kcontrol/hardware/joystick/CMakeFiles/kcm_joystick.dir/poswidget.o                                                           
make[2]: *** No rule to make target `/usr/lib64/qt4/libphonon.so', needed by `lib/kcm_access.so'.  Stop.                                                       
make[2]: *** Waiting for unfinished jobs....                                   
Building CXX object kcontrol/access/CMakeFiles/kcm_access.dir/kcmaccess.o       
[ 73%] Building CXX object kcontrol/access/CMakeFiles/kdeinit_kaccess.dir/main.o
/usr/portage/tmp/portage/kde-base/systemsettings-4.0.83/work/systemsettings-4.0.83/kcontrol/access/kcmaccess.cpp:777:2: warning: #warning "kde4: dbus port: need to test it"                                                                   
/usr/portage/tmp/portage/kde-base/systemsettings-4.0.83/work/systemsettings-4.0.83/kcontrol/access/kaccess.cpp: In member function ‘void KAccessApp::initMasks()’:                                                                             
/usr/portage/tmp/portage/kde-base/systemsettings-4.0.83/work/systemsettings-4.0.83/kcontrol/access/kaccess.cpp:318: warning: suggest explicit braces to avoid ambiguous ‘else’                                                                 
[ 74%] Building CXX object kcontrol/hardware/joystick/CMakeFiles/kcm_joystick.dir/joydevice.o                                                                   
[ 74%] Building CXX object kcontrol/hardware/joystick/CMakeFiles/kcm_joystick.dir/caldialog.o                                                                   
[ 74%] Generating ui_autostartconfig.h                                         
[ 75%] [ 76%] Building CXX object kcontrol/access/CMakeFiles/kdeinit_kaccess.dir/kdeinit_kaccess_automoc.o                                                     
Generating advanceddialog.moc                                                   
Building CXX object kcontrol/screensaver/CMakeFiles/kcm_screensaver.dir/kcm_screensaver_automoc.o                                                               
Linking CXX shared library ../../lib/libkdeinit4_kaccess.so                     
Generating autostartitem.moc                                                   
Generating addscriptdialog.moc                                                 
Generating autostart.moc                                                       
Linking CXX shared module ../../lib/kcm_screensaver.so                         
/usr/portage/tmp/portage/kde-base/systemsettings-4.0.83/work/systemsettings-4.0.83/kcontrol/autostart/autostartitem.h:0: Warning: No relevant classes found. No output generated.                                                               
[ 76%] Built target kdeinit_kaccess                                             
/usr/portage/tmp/portage/kde-base/systemsettings-4.0.83/work/systemsettings-4.0.83/kcontrol/access/kcmaccess.cpp: In member function ‘void ExtendedIntNumInput::setRange(int, int, int, bool)’:                                                 
/usr/portage/tmp/portage/kde-base/systemsettings-4.0.83/work/systemsettings-4.0.83/kcontrol/access/kcmaccess.cpp:60: warning: ‘void KIntNumInput::setRange(int, int, int, bool)’ is deprecated (declared at /usr/kde/4.1/include/knuminput.h:271)                                                                               
/usr/portage/tmp/portage/kde-base/systemsettings-4.0.83/work/systemsettings-4.0.83/kcontrol/access/kcmaccess.cpp: At global scope:                             
/usr/portage/tmp/portage/kde-base/systemsettings-4.0.83/work/systemsettings-4.0.83/kcontrol/access/kcmaccess.cpp:110: warning: unused parameter ‘config’       
/usr/portage/tmp/portage/kde-base/systemsettings-4.0.83/work/systemsettings-4.0.83/kcontrol/access/kcmaccess.cpp: In constructor ‘KAccessConfig::KAccessConfig(QWidget*, const QStringList&)’:                                                 
/usr/portage/tmp/portage/kde-base/systemsettings-4.0.83/work/systemsettings-4.0.83/kcontrol/access/kcmaccess.cpp:232: warning: ‘KCModule::KCModule(const KComponentData&, QWidget*, const QStringList&)’ is deprecated (declared at /usr/kde/4.1/include/kcmodule.h:117)                                                       
[ 76%] Building CXX object kcontrol/hardware/joystick/CMakeFiles/kcm_joystick.dir/kcm_joystick_automoc.o                                                       
Linking CXX shared module ../../../lib/kcm_joystick.so                         
[ 76%] Built target kcm_screensaver                                             
Scanning dependencies of target kxkb                                           
[ 76%] Building CXX object kcontrol/kxkb/CMakeFiles/kxkb.dir/kxkb_dummy.o       
Linking CXX executable kxkb                                                     
Scanning dependencies of target kcm_autostart                                   
[ 76%] Built target kcm_joystick                                               
Scanning dependencies of target kaccess                                         
[ 77%] Building CXX object kcontrol/access/CMakeFiles/kaccess.dir/kaccess_dummy.o                                                                               
Scanning dependencies of target kfontinst                                       
Linking CXX executable kaccess                                                 
[ 77%] Building CXX object kcontrol/kfontinst/lib/CMakeFiles/kfontinst.dir/Misc.o                                                                               
[ 77%] Built target kxkb                                                       
[ 77%] Building CXX object kcontrol/kfontinst/lib/CMakeFiles/kfontinst.dir/DisabledFonts.o                                                                     
[ 77%] Building CXX object kcontrol/autostart/CMakeFiles/kcm_autostart.dir/autostartitem.o                                                                     
[ 77%] Built target kaccess                                                     
[ 78%] Building CXX object kcontrol/kfontinst/lib/CMakeFiles/kfontinst.dir/Fc.o
[ 79%] Building CXX object kcontrol/kfontinst/lib/CMakeFiles/kfontinst.dir/kfontinst_automoc.o                                                                 
make[1]: *** [kcontrol/access/CMakeFiles/kcm_access.dir/all] Error 2           
[ 80%] make[1]: *** Waiting for unfinished jobs....                             
Building CXX object kcontrol/autostart/CMakeFiles/kcm_autostart.dir/addscriptdialog.o                                                                           
[ 80%] [ 81%] Building CXX object kcontrol/autostart/CMakeFiles/kcm_autostart.dir/advanceddialog.o                                                             
Building CXX object kcontrol/autostart/CMakeFiles/kcm_autostart.dir/autostart.o
[ 81%] Building CXX object kcontrol/autostart/CMakeFiles/kcm_autostart.dir/kcm_autostart_automoc.o                                                             
Linking CXX shared library ../../../lib/libkfontinst.so                         
[ 81%] Built target kfontinst                                                   
Linking CXX shared module ../../lib/kcm_autostart.so                           
[ 81%] Built target kcm_autostart                                               
make: *** [all] Error 2                                                         
 *                                                                             
 * ERROR: kde-base/systemsettings-4.0.83 failed.


Some make target seems to be missing?
_________________
SiberianSniper: my girlfriend's name ends with .c
Clete2: Uber geek! W00t! I'd rather have it end in .cpp... <insert name>.cpp
Dralnu: ...why not <name>.o? Then she's ready for linking...
SiberianSniper: or <name>.ko, so she's ready for insertion?
Back to top
View user's profile Send private message
drescherjm
Advocate
Advocate


Joined: 05 Jun 2004
Posts: 2779
Location: Pittsburgh, PA, USA

PostPosted: Thu Jun 26, 2008 10:54 pm    Post subject: Reply with quote

I just installed 4.0.83 and it appears that plasma still needs the folderview patch since its back to the blank screen. I tried to activate the patch from 4.0.82 but that did not apply cleanly. I have no time to look at this at the moment but I will try to investigate this later..

[EDIT]Originally I thought that patch was needed but deleting my ~.kde4.1 fixed the problem. Perhaps this is the same fix for plasma-9999. [/EDIT]
_________________
John

My gentoo overlay
Instructons for overlay
Back to top
View user's profile Send private message
cruzki123
Apprentice
Apprentice


Joined: 16 May 2008
Posts: 249

PostPosted: Fri Jun 27, 2008 9:55 am    Post subject: Reply with quote

Strayer wrote:

Hardware:
Dell Vostro 1500 (ICH8 Chipset)
Intel(R) Core(TM)2 Duo CPU T7250 @ 2.00GHz
Nvidia Geforce 8600M GT 256MB


It is know that certain nvidia harware using closed source driver is pretty slow with kde.
Back to top
View user's profile Send private message
Boccaccio
Apprentice
Apprentice


Joined: 19 Jul 2005
Posts: 282

PostPosted: Fri Jun 27, 2008 10:00 am    Post subject: Reply with quote

Well, I have the ACER 5920G with the 8600M GT 256 MB and using nvidia-drivers-173.14.09 everything works quite nicely.
Back to top
View user's profile Send private message
Dagger
Retired Dev
Retired Dev


Joined: 11 Jun 2003
Posts: 765
Location: UK

PostPosted: Fri Jun 27, 2008 12:00 pm    Post subject: Reply with quote

Same here. Asus G1S, C2D 7500, 4GB, GF 8600M GT 256 and kde-svn. Works like a charm. With composite enabled resizing transparent console is SLOW, but all other resizing is fine (dolphin, konqueror, others).
_________________
95% of all computer errors occur between chair and keyboard (TM)
Join the FSF as an Associate Member!
Post under CC license.
Back to top
View user's profile Send private message
Strayer
Tux's lil' helper
Tux's lil' helper


Joined: 11 Nov 2003
Posts: 75
Location: Germany

PostPosted: Fri Jun 27, 2008 12:03 pm    Post subject: Reply with quote

cruzki123 wrote:
It is know that certain nvidia harware using closed source driver is pretty slow with kde.


I just found out about this and already read some forum posts of Nvidia officials and other users... very sad :(
My old laptop had an ATi card and that time, fglrx was the "bad" driver. Because of that I switched to Nvidia. Seems it's the other way around now... :roll:
Back to top
View user's profile Send private message
Wyatt
n00b
n00b


Joined: 02 Mar 2007
Posts: 15
Location: Columbus,OH,USA

PostPosted: Fri Jun 27, 2008 12:36 pm    Post subject: Reply with quote

IBM Thinkpad T43, Dothan 2.0 GHz, 512 MB, X300 Mobile, kde-svn
Most things appear nominal, though amarok dies and is fat now. Thank god for distcc.

NVidia drivers really are still better than fglrx in my experience. KDE seems a special case:
"Performance problems on NVidia chips remain, but we are confident that those will be solved by the teams over at NVidia in one of the next releases of their graphics driver."
( http://dot.kde.org/1214311382/ )

Thought I read that KDE is actually working pretty close with KDE on this one.
Back to top
View user's profile Send private message
skiera
Tux's lil' helper
Tux's lil' helper


Joined: 08 Mar 2004
Posts: 134
Location: Poland -> Wałcz

PostPosted: Fri Jun 27, 2008 2:45 pm    Post subject: Reply with quote

Strayer wrote:

When I enable the composite effects it get's even worse. Resizing in composite mode is just unusable...


Have you tried to set:
Code:
nvidia-settings -a InitialPixmapPlacement=2 -a GlyphCache=1

For me it boosted resizing and overall graphic performance. Here is more info but in polish ;)
Back to top
View user's profile Send private message
Bloodsurfer
Guru
Guru


Joined: 07 Dec 2005
Posts: 361
Location: Wolfstein, Germany (Rhineland-Palatinate)

PostPosted: Fri Jun 27, 2008 4:48 pm    Post subject: Reply with quote

Resizing is terribly slow for me too, but I don't have nvidia-settings - do I have to emerge that extra?

Also does noone have any idea how to solve the phonon/systemsettings issue? I can't handle it.

If I have qt-phonon installed systemsettings fails with a lot of errors like

Code:
In file included from /usr/portage/tmp/portage/kde-base/systemsettings-4.0.83/work/systemsettings_build/kcontrol/access/kaccess.moc:10,                         
                 from /usr/portage/tmp/portage/kde-base/systemsettings-4.0.83/work/systemsettings-4.0.83/kcontrol/access/kaccess.cpp:33:                       
/usr/portage/tmp/portage/kde-base/systemsettings-4.0.83/work/systemsettings_build/kcontrol/access/../../../systemsettings-4.0.83/kcontrol/access/kaccess.h:76: error: ‘Phonon’ has not been declared                                           
/usr/portage/tmp/portage/kde-base/systemsettings-4.0.83/work/systemsettings_build/kcontrol/access/../../../systemsettings-4.0.83/kcontrol/access/kaccess.h:76: error: ISO C++ forbids declaration of ‘MediaObject’ with no type                 
/usr/portage/tmp/portage/kde-base/systemsettings-4.0.83/work/systemsettings_build/kcontrol/access/../../../systemsettings-4.0.83/kcontrol/access/kaccess.h:76: error: expected ‘;’ before ‘*’ token                                             
/usr/portage/tmp/portage/kde-base/systemsettings-4.0.83/work/systemsettings-4.0.83/kcontrol/access/kaccess.cpp: In constructor ‘KAccessApp::KAccessApp(bool, bool)’:                                                                           
/usr/portage/tmp/portage/kde-base/systemsettings-4.0.83/work/systemsettings-4.0.83/kcontrol/access/kaccess.cpp:100: error: class ‘KAccessApp’ does not have any field named ‘_player’                                                           
/usr/portage/tmp/portage/kde-base/systemsettings-4.0.83/work/systemsettings-4.0.83/kcontrol/access/kaccess.cpp: In member function ‘void KAccessApp::initMasks()’:                                                                             
/usr/portage/tmp/portage/kde-base/systemsettings-4.0.83/work/systemsettings-4.0.83/kcontrol/access/kaccess.cpp:318: warning: suggest explicit braces to avoid ambiguous ‘else’                                                                 
/usr/portage/tmp/portage/kde-base/systemsettings-4.0.83/work/systemsettings-4.0.83/kcontrol/access/kaccess.cpp: In member function ‘void KAccessApp::xkbBellNotify(XkbBellNotifyEvent*)’:                                                       
/usr/portage/tmp/portage/kde-base/systemsettings-4.0.83/work/systemsettings-4.0.83/kcontrol/access/kaccess.cpp:471: error: ‘_player’ was not declared in this scope                                                                             
/usr/portage/tmp/portage/kde-base/systemsettings-4.0.83/work/systemsettings-4.0.83/kcontrol/access/kaccess.cpp:472: error: ‘Phonon’ has not been declared       
/usr/portage/tmp/portage/kde-base/systemsettings-4.0.83/work/systemsettings-4.0.83/kcontrol/access/kaccess.cpp:472: error: ‘Phonon’ has not been declared       
/usr/portage/tmp/portage/kde-base/systemsettings-4.0.83/work/systemsettings-4.0.83/kcontrol/access/kaccess.cpp:476: error: ‘_player’ was not declared in this scope   


If I don't have qt-phonon, it fails with the error I posted a few postings earlier. What can I do? Is no one else having that problem? I can't configure my KDE 4.1 :(
_________________
SiberianSniper: my girlfriend's name ends with .c
Clete2: Uber geek! W00t! I'd rather have it end in .cpp... <insert name>.cpp
Dralnu: ...why not <name>.o? Then she's ready for linking...
SiberianSniper: or <name>.ko, so she's ready for insertion?
Back to top
View user's profile Send private message
skiera
Tux's lil' helper
Tux's lil' helper


Joined: 08 Mar 2004
Posts: 134
Location: Poland -> Wałcz

PostPosted: Fri Jun 27, 2008 5:09 pm    Post subject: Reply with quote

Bloodsurfer wrote:
Resizing is terribly slow for me too, but I don't have nvidia-settings - do I have to emerge that extra?


media-video/nvidia-settings
Back to top
View user's profile Send private message
laughinggnome
n00b
n00b


Joined: 07 Mar 2006
Posts: 45

PostPosted: Fri Jun 27, 2008 5:26 pm    Post subject: Reply with quote

Bloodsurfer wrote:

If I don't have qt-phonon, it fails with the error I posted a few postings earlier. What can I do? Is no one else having that problem? I can't configure my KDE 4.1 :(


I had that problem as well. Try rebuilding kdelibs.
Back to top
View user's profile Send private message
Bloodsurfer
Guru
Guru


Joined: 07 Dec 2005
Posts: 361
Location: Wolfstein, Germany (Rhineland-Palatinate)

PostPosted: Fri Jun 27, 2008 5:32 pm    Post subject: Reply with quote

laughinggnome wrote:
I had that problem as well. Try rebuilding kdelibs.

With or without qt-phonon?
_________________
SiberianSniper: my girlfriend's name ends with .c
Clete2: Uber geek! W00t! I'd rather have it end in .cpp... <insert name>.cpp
Dralnu: ...why not <name>.o? Then she's ready for linking...
SiberianSniper: or <name>.ko, so she's ready for insertion?
Back to top
View user's profile Send private message
laughinggnome
n00b
n00b


Joined: 07 Mar 2006
Posts: 45

PostPosted: Fri Jun 27, 2008 5:55 pm    Post subject: Reply with quote

Bloodsurfer wrote:
laughinggnome wrote:
I had that problem as well. Try rebuilding kdelibs.

With or without qt-phonon?


Without. I removed qt-phonon, rebuilt kdelibs, and then systemsettings would compile. At least I think that's what I did!
Back to top
View user's profile Send private message
Display posts from previous:   
This topic is locked: you cannot edit posts or make replies.    Gentoo Forums Forum Index Unsupported Software All times are GMT
Goto page Previous  1, 2, 3 ... 6, 7, 8 ... 28, 29, 30  Next
Page 7 of 30

 
Jump to:  
You cannot post new topics in this forum
You cannot reply to topics in this forum
You cannot edit your posts in this forum
You cannot delete your posts in this forum
You cannot vote in polls in this forum