Gentoo Forums
Gentoo Forums
Gentoo Forums
Quick Search: in
KDE 4.1 portage
View unanswered posts
View posts from last 24 hours

Goto page Previous  1, 2, 3, ... 28, 29, 30  Next  
This topic is locked: you cannot edit posts or make replies.    Gentoo Forums Forum Index Unsupported Software
View previous topic :: View next topic  
Author Message
Matteo Azzali
Retired Dev
Retired Dev


Joined: 23 Sep 2004
Posts: 1133

PostPosted: Tue Jun 03, 2008 7:37 pm    Post subject: Reply with quote

a bit of feedback for okular-4.0.80 too:
Code:

emerge: there are no ebuilds to satisfy "app-doc/chmlib".
(dependency required by "kde-base/okular-4.0.80" [ebuild])


and no epub generator supported (requires ebook-tools package)
_________________
Every day a new distro comes to birth. Every day a distro "eats" another.
If you're born distro, no matter what, start to run.
---- http://www.linuxprinting.org/ ---- http://tuxmobil.org/
Back to top
View user's profile Send private message
smorg
n00b
n00b


Joined: 03 Apr 2006
Posts: 40
Location: Germany

PostPosted: Tue Jun 03, 2008 8:58 pm    Post subject: Reply with quote

Matteo Azzali wrote:
a bit of feedback for okular-4.0.80 too:
Code:

emerge: there are no ebuilds to satisfy "app-doc/chmlib".
(dependency required by "kde-base/okular-4.0.80" [ebuild])



"emerge -s chimlib" reveals a package dev-libs/chmlib, the changelog of that package says that is was moved from app-doc to dev-libs on May 13th.
Back to top
View user's profile Send private message
i4dnf
Apprentice
Apprentice


Joined: 18 Sep 2005
Posts: 265
Location: Bucharest, Romania

PostPosted: Tue Jun 03, 2008 10:31 pm    Post subject: Reply with quote

here libplasma fails with the folowing:
Code:

[ 33%] Building CXX object libs/plasma/CMakeFiles/plasma.dir/datacontainer.o
/var/tmp/portage/kde-base/libplasma-4.0.80/work/libplasma-4.0.80/libs/plasma/applet.h: In member function ‘Plasma::Containment* Plasma::Corona::Private::addContainment(const QString&, const QVariantList&, uint, bool)’:
/var/tmp/portage/kde-base/libplasma-4.0.80/work/libplasma-4.0.80/libs/plasma/applet.h:579: error: ‘void Plasma::Applet::setFailedToLaunch(bool, const QString&)’ is protected
/var/tmp/portage/kde-base/libplasma-4.0.80/work/libplasma-4.0.80/libs/plasma/corona.cpp:153: error: within this context
/var/tmp/portage/kde-base/libplasma-4.0.80/work/libplasma-4.0.80/libs/plasma/applet.h:625: error: ‘void Plasma::Applet::setIsContainment(bool)’ is protected
/var/tmp/portage/kde-base/libplasma-4.0.80/work/libplasma-4.0.80/libs/plasma/corona.cpp:157: error: within this context
make[2]: *** [libs/plasma/CMakeFiles/plasma.dir/corona.o] Error 1
make[2]: *** Waiting for unfinished jobs....
/var/tmp/portage/kde-base/libplasma-4.0.80/work/libplasma-4.0.80/libs/plasma/containment.cpp: In member function ‘QPoint Plasma::Containment::effectiveScreenPos() const’:
/var/tmp/portage/kde-base/libplasma-4.0.80/work/libplasma-4.0.80/libs/plasma/containment.cpp:604: warning: passing ‘qreal’ for argument 1 to ‘QPoint::QPoint(int, int)’
/var/tmp/portage/kde-base/libplasma-4.0.80/work/libplasma-4.0.80/libs/plasma/containment.cpp:607: warning: passing ‘qreal’ for argument 1 to ‘QPoint::QPoint(int, int)’
/var/tmp/portage/kde-base/libplasma-4.0.80/work/libplasma-4.0.80/libs/plasma/containment.cpp:607: warning: passing ‘qreal’ for argument 2 to ‘QPoint::QPoint(int, int)’
/var/tmp/portage/kde-base/libplasma-4.0.80/work/libplasma-4.0.80/libs/plasma/containment.cpp:610: warning: passing ‘qreal’ for argument 2 to ‘QPoint::QPoint(int, int)’
/var/tmp/portage/kde-base/libplasma-4.0.80/work/libplasma-4.0.80/libs/plasma/containment.cpp:613: warning: passing ‘qreal’ for argument 1 to ‘QPoint::QPoint(int, int)’
/var/tmp/portage/kde-base/libplasma-4.0.80/work/libplasma-4.0.80/libs/plasma/containment.cpp:613: warning: passing ‘qreal’ for argument 2 to ‘QPoint::QPoint(int, int)’
/var/tmp/portage/kde-base/libplasma-4.0.80/work/libplasma-4.0.80/libs/plasma/applet.h: In member function ‘KActionCollection& Plasma::Containment::Private::actions()’:
/var/tmp/portage/kde-base/libplasma-4.0.80/work/libplasma-4.0.80/libs/plasma/applet.h:724: error: ‘Plasma::Applet::Private* const Plasma::Applet::d’ is private
/var/tmp/portage/kde-base/libplasma-4.0.80/work/libplasma-4.0.80/libs/plasma/containment.cpp:871: error: within this context
/var/tmp/portage/kde-base/libplasma-4.0.80/work/libplasma-4.0.80/libs/plasma/containment.cpp: In member function ‘void Plasma::Containment::Private::positionContainment()’:
/var/tmp/portage/kde-base/libplasma-4.0.80/work/libplasma-4.0.80/libs/plasma/containment.cpp:1283: warning: passing ‘qreal’ for argument 2 to ‘QPoint::QPoint(int, int)’
make[2]: *** [libs/plasma/CMakeFiles/plasma.dir/containment.o] Error 1
make[1]: *** [libs/plasma/CMakeFiles/plasma.dir/all] Error 2
make: *** [all] Error 2

_________________
"The only difference between me and a madman is that I am not MAD" (SALVATOR DALI)
Back to top
View user's profile Send private message
mrsaccess
n00b
n00b


Joined: 03 Sep 2005
Posts: 29
Location: Greece

PostPosted: Tue Jun 03, 2008 10:42 pm    Post subject: Reply with quote

It's a svn version. Try in a couple of hours and it will propably work. :wink:
_________________
Hardware: The parts of your pc you can kick.
Back to top
View user's profile Send private message
lancelott
Apprentice
Apprentice


Joined: 29 Mar 2005
Posts: 152

PostPosted: Tue Jun 03, 2008 10:51 pm    Post subject: Reply with quote

How can I easily unmask the kde-4.1 slotted builds?
_________________
Desktop: AMD Athlon 64 3000+ @ 2.15GHz | 7600GT 256MB | 320GB + 250GB SATA 3.0 | Creative X-Fi XtremeGamer | Gentoo Linux amd64
Server: Intel Pentium 2 MMX 350MHz | 30GB HDD | Gentoo Linux x86
Back to top
View user's profile Send private message
aitch
Tux's lil' helper
Tux's lil' helper


Joined: 26 Sep 2005
Posts: 88
Location: New Zealand

PostPosted: Wed Jun 04, 2008 12:40 am    Post subject: Reply with quote

hey trying to compile kde-meta-9999 from kdesvn-portage, but it's failing on akonadi with this error:
Code:
CMake Error: This project requires some variables to be set,
and cmake can not find them.
Please set the following variables:
QT_QTSQL_LIBRARY (ADVANCED)


any ideas on how to resolve?
Back to top
View user's profile Send private message
aliquid
n00b
n00b


Joined: 14 Mar 2008
Posts: 37

PostPosted: Wed Jun 04, 2008 3:20 am    Post subject: Reply with quote

aitch wrote:
hey trying to compile kde-meta-9999 from kdesvn-portage, but it's failing on akonadi with this error:
Code:
CMake Error: This project requires some variables to be set,
and cmake can not find them.
Please set the following variables:
QT_QTSQL_LIBRARY (ADVANCED)


any ideas on how to resolve?


You have to emerge qt-sql to get it compile.
Back to top
View user's profile Send private message
maggu2810
n00b
n00b


Joined: 27 Sep 2005
Posts: 20

PostPosted: Wed Jun 04, 2008 9:07 am    Post subject: Reply with quote

I prepared to compile the following meta packages version 4.0.80
kde-base/kdebase-meta kde-base/kdeaddons-meta kde-base/kdegraphics-meta kde-base/kdemultimedia-meta kde-base/kdenetwork-meta kde-base/kdepim-meta kde-base/kdeutils-meta

I got an error with kde-base/gwenview:
Code:
[ 81%] Building CXX object gwenview/app/CMakeFiles/gwenview.dir/infocontextmanageritem.o                                                                     
[ 82%] Building CXX object gwenview/app/CMakeFiles/gwenview.dir/imagemetainfodialog.o                                                                       
[ 83%] Building CXX object gwenview/app/CMakeFiles/gwenview.dir/imageopscontextmanageritem.o                                                                 
[ 84%] Building CXX object gwenview/app/CMakeFiles/gwenview.dir/fileopscontextmanageritem.o                                                                 
[ 85%] Building CXX object gwenview/app/CMakeFiles/gwenview.dir/main.o                                                                                       
[ 87%] Building CXX object gwenview/app/CMakeFiles/gwenview.dir/mainwindow.o                                                                                 
[ 88%] Building CXX object gwenview/app/CMakeFiles/gwenview.dir/preloader.o                                                                                 
[ 89%] Building CXX object gwenview/app/CMakeFiles/gwenview.dir/savebar.o                                                                                   
In file included from /usr/include/libkipi/interface.h:38,                                                                                                   
                 from /var/tmp/portage/kde-base/gwenview-4.0.80/work/gwenview-4.0.80/gwenview/app/kipiinterface.h:24,                                       
                 from /var/tmp/portage/kde-base/gwenview-4.0.80/work/gwenview-4.0.80/gwenview/app/mainwindow.cpp:65:                                         
/usr/include/libkipi/imagecollection.h:53: error: ‘KURL’ has not been declared                                                                               
/usr/include/libkipi/imagecollection.h:53: error: expected ‘;’ before ‘images’                                                                               
/usr/include/libkipi/imagecollection.h:54: error: ‘KURL’ does not name a type                                                                               
/usr/include/libkipi/imagecollection.h:55: error: ‘KURL’ does not name a type                                                                               
/usr/include/libkipi/imagecollection.h:56: error: ‘KURL’ does not name a type                                                                               
In file included from /usr/include/libkipi/interface.h:39,                                                                                                   
                 from /var/tmp/portage/kde-base/gwenview-4.0.80/work/gwenview-4.0.80/gwenview/app/kipiinterface.h:24,                                       
                 from /var/tmp/portage/kde-base/gwenview-4.0.80/work/gwenview-4.0.80/gwenview/app/mainwindow.cpp:65:                                         
/usr/include/libkipi/imageinfo.h:54: error: ‘KURL’ does not name a type                                                                                     
In file included from /var/tmp/portage/kde-base/gwenview-4.0.80/work/gwenview-4.0.80/gwenview/app/kipiinterface.h:24,                                       
                 from /var/tmp/portage/kde-base/gwenview-4.0.80/work/gwenview-4.0.80/gwenview/app/mainwindow.cpp:65:                                         
/usr/include/libkipi/interface.h:69: error: ‘QValueList’ declared as a ‘virtual’ field                                                                       
/usr/include/libkipi/interface.h:69: error: expected ‘;’ before ‘<’ token                                                                                   
/usr/include/libkipi/interface.h:71: error: expected ‘,’ or ‘...’ before ‘&’ token                                                                           
/usr/include/libkipi/interface.h:72: error: expected ‘,’ or ‘...’ before ‘&’ token                                                                           
/usr/include/libkipi/interface.h:73: error: expected ‘,’ or ‘...’ before ‘&’ token                                                                           
/usr/include/libkipi/interface.h:75: error: expected ‘,’ or ‘...’ before ‘::’ token                                                                         
In file included from /var/tmp/portage/kde-base/gwenview-4.0.80/work/gwenview-4.0.80/gwenview/app/kipiinterface.h:25,                                       
                 from /var/tmp/portage/kde-base/gwenview-4.0.80/work/gwenview-4.0.80/gwenview/app/mainwindow.cpp:65:                                         
/usr/include/libkipi/imagecollectionshared.h:51: error: ‘KURL’ has not been declared                                                                         
/usr/include/libkipi/imagecollectionshared.h:51: error: ‘List’ declared as a ‘virtual’ field                                                                 
/usr/include/libkipi/imagecollectionshared.h:51: error: expected ‘;’ before ‘images’                                                                         
/usr/include/libkipi/imagecollectionshared.h:52: error: ‘KURL’ does not name a type                                                                         
/usr/include/libkipi/imagecollectionshared.h:53: error: ‘KURL’ does not name a type                                                                         
/usr/include/libkipi/imagecollectionshared.h:54: error: ‘KURL’ does not name a type                                                                         
In file included from /var/tmp/portage/kde-base/gwenview-4.0.80/work/gwenview-4.0.80/gwenview/app/mainwindow.cpp:65:                                         
/var/tmp/portage/kde-base/gwenview-4.0.80/work/gwenview-4.0.80/gwenview/app/kipiinterface.h:49: error: ISO C++ forbids declaration of ‘ImageCollectionSelector’ with no type                                                                                                                                             
/var/tmp/portage/kde-base/gwenview-4.0.80/work/gwenview-4.0.80/gwenview/app/kipiinterface.h:49: error: invalid use of ‘::’                                   
/var/tmp/portage/kde-base/gwenview-4.0.80/work/gwenview-4.0.80/gwenview/app/kipiinterface.h:49: error: expected ‘;’ before ‘*’ token                         
/var/tmp/portage/kde-base/gwenview-4.0.80/work/gwenview-4.0.80/gwenview/app/kipiinterface.h:50: error: ISO C++ forbids declaration of ‘UploadWidget’ with no type                                                                                                                                                         
/var/tmp/portage/kde-base/gwenview-4.0.80/work/gwenview-4.0.80/gwenview/app/kipiinterface.h:50: error: invalid use of ‘::’                                   
/var/tmp/portage/kde-base/gwenview-4.0.80/work/gwenview-4.0.80/gwenview/app/kipiinterface.h:50: error: expected ‘;’ before ‘*’ token                         
/usr/include/libkipi/interface.h:71: warning: ‘virtual KIPI::ImageInfo KIPI::Interface::info(int)’ was hidden                                               
/var/tmp/portage/kde-base/gwenview-4.0.80/work/gwenview-4.0.80/gwenview/app/kipiinterface.h:43: warning:   by ‘KIPI::ImageInfo Gwenview::KIPIInterface::info(const KUrl&)’                                                                                                                                               
/usr/include/libkipi/interface.h:72: warning: ‘virtual bool KIPI::Interface::addImage(int)’ was hidden                                                       
/var/tmp/portage/kde-base/gwenview-4.0.80/work/gwenview-4.0.80/gwenview/app/kipiinterface.h:45: warning:   by ‘virtual bool Gwenview::KIPIInterface::addImage(const KUrl&, QString&)’                                                                                                                                     
/usr/include/libkipi/interface.h:73: warning: ‘virtual void KIPI::Interface::delImage(int)’ was hidden                                                       
/var/tmp/portage/kde-base/gwenview-4.0.80/work/gwenview-4.0.80/gwenview/app/kipiinterface.h:46: warning:   by ‘virtual void Gwenview::KIPIInterface::delImage(const KUrl&)’                                                                                                                                               
/usr/include/libkipi/interface.h:75: warning: ‘virtual void KIPI::Interface::refreshImages(int)’ was hidden                                                 
/var/tmp/portage/kde-base/gwenview-4.0.80/work/gwenview-4.0.80/gwenview/app/kipiinterface.h:47: warning:   by ‘virtual void Gwenview::KIPIInterface::refreshImages(const KUrl::List&)’                                                                                                                                   
/var/tmp/portage/kde-base/gwenview-4.0.80/work/gwenview-4.0.80/gwenview/app/mainwindow.cpp: In constructor ‘Gwenview::MainWindow::MainWindow()’:             
/var/tmp/portage/kde-base/gwenview-4.0.80/work/gwenview-4.0.80/gwenview/app/mainwindow.cpp:598: error: cannot allocate an object of abstract type ‘Gwenview::KIPIInterface’                                                                                                                                               
/var/tmp/portage/kde-base/gwenview-4.0.80/work/gwenview-4.0.80/gwenview/app/kipiinterface.h:33: note:   because the following virtual functions are pure within ‘Gwenview::KIPIInterface’:                                                                                                                               
/usr/include/libkipi/interface.h:71: note:      virtual KIPI::ImageInfo KIPI::Interface::info(int)                                                           
make[2]: *** [gwenview/app/CMakeFiles/gwenview.dir/mainwindow.o] Error 1                                                                                     
make[2]: *** Waiting for unfinished jobs....                                                                                                                 
make[1]: *** [gwenview/app/CMakeFiles/gwenview.dir/all] Error 2                                                                                             
make: *** [all] Error 2


It is not possible to build kde-base/kopete with the telepathy USE-Flag.
Code:
[ 77%] Generating ui_telepathyeditaccountwidget.h                                                                                                           
Scanning dependencies of target kopete_telepathy                                                                                                             
[ 77%] Building CXX object kopete/protocols/telepathy/CMakeFiles/kopete_telepathy.dir/kopete_telepathy_automoc.o                                             
[ 77%] Building CXX object kopete/protocols/telepathy/CMakeFiles/kopete_telepathy.dir/telepathyprotocol.o                                                   
In file included from /var/tmp/portage/kde-base/kopete-4.0.80/work/kopete-4.0.80/kopete/protocols/telepathy/telepathyprotocol.cpp:30:                       
/var/tmp/portage/kde-base/kopete-4.0.80/work/kopete-4.0.80/kopete/libkopete/kopetecontact.h:236: warning: ‘virtual QList<KAction*>* Kopete::Contact::customContextMenuActions(Kopete::ChatSession*)’ was hidden                                                                                                           
/var/tmp/portage/kde-base/kopete-4.0.80/work/kopete-4.0.80/kopete/protocols/telepathy/telepathycontact.h:55: warning:   by ‘virtual QList<KAction*>* TelepathyContact::customContextMenuActions()’                                                                                                                       
/var/tmp/portage/kde-base/kopete-4.0.80/work/kopete-4.0.80/kopete/protocols/telepathy/telepathyprotocol.cpp:87: warning: unused parameter ‘addressBookData’ 
In file included from /var/tmp/portage/kde-base/kopete-4.0.80/work/kopete-4.0.80/kopete/protocols/telepathy/telepathyprotocol.cpp:162:                       
/var/tmp/portage/kde-base/kopete-4.0.80/work/kopete-4.0.80/kopete/protocols/telepathy/telepathyprotocol.cpp: In member function ‘QtTapioca::ContactBase::Presence TelepathyProtocol::kopeteStatusToTelepathy(const Kopete::OnlineStatus&)’:                                                                               
/var/tmp/portage/kde-base/kopete-4.0.80/work/kopete-4.0.80/kopete/protocols/telepathy/telepathyprotocol.cpp:117: warning: ‘telepathyPresence’ may be used uninitialized in this function                                                                                                                                 
[ 77%] Building CXX object kopete/protocols/telepathy/CMakeFiles/kopete_telepathy.dir/telepathyaccount.o                                                     
In file included from /var/tmp/portage/kde-base/kopete-4.0.80/work/kopete-4.0.80/kopete/libkopete/kopetechatsession.h:34,                                   
                 from /var/tmp/portage/kde-base/kopete-4.0.80/work/kopete-4.0.80/kopete/libkopete/kopetechatsessionmanager.h:24,                             
                 from /var/tmp/portage/kde-base/kopete-4.0.80/work/kopete-4.0.80/kopete/protocols/telepathy/telepathyaccount.cpp:38:                         
/usr/include/qt4/QtCore/qobject.h:125: warning: ‘virtual bool QObject::event(QEvent*)’ was hidden                                                           
/var/tmp/portage/kde-base/kopete-4.0.80/work/kopete-4.0.80/kopete/libkopete/kopetemessagehandlerchain.h:78: warning:   by ‘Kopete::MessageEvent* Kopete::ProcessMessageTask::event()’                                                                                                                                     
In file included from /var/tmp/portage/kde-base/kopete-4.0.80/work/kopete-4.0.80/kopete/protocols/telepathy/telepathyaccount.cpp:53:                         
/var/tmp/portage/kde-base/kopete-4.0.80/work/kopete-4.0.80/kopete/libkopete/kopetecontact.h:236: warning: ‘virtual QList<KAction*>* Kopete::Contact::customContextMenuActions(Kopete::ChatSession*)’ was hidden                                                                                                           
/var/tmp/portage/kde-base/kopete-4.0.80/work/kopete-4.0.80/kopete/protocols/telepathy/telepathycontact.h:55: warning:   by ‘virtual QList<KAction*>* TelepathyContact::customContextMenuActions()’                                                                                                                       
/var/tmp/portage/kde-base/kopete-4.0.80/work/kopete-4.0.80/kopete/protocols/telepathy/telepathyaccount.cpp:394: warning: unused parameter ‘reason’           
[ 77%] Building CXX object kopete/protocols/telepathy/CMakeFiles/kopete_telepathy.dir/telepathycontact.o                                                     
In file included from /var/tmp/portage/kde-base/kopete-4.0.80/work/kopete-4.0.80/kopete/protocols/telepathy/telepathycontact.cpp:17:                         
/var/tmp/portage/kde-base/kopete-4.0.80/work/kopete-4.0.80/kopete/libkopete/kopetecontact.h:236: warning: ‘virtual QList<KAction*>* Kopete::Contact::customContextMenuActions(Kopete::ChatSession*)’ was hidden                                                                                                           
/var/tmp/portage/kde-base/kopete-4.0.80/work/kopete-4.0.80/kopete/protocols/telepathy/telepathycontact.h:55: warning:   by ‘virtual QList<KAction*>* TelepathyContact::customContextMenuActions()’                                                                                                                       
In file included from /var/tmp/portage/kde-base/kopete-4.0.80/work/kopete-4.0.80/kopete/libkopete/kopetechatsession.h:34,                                   
                 from /var/tmp/portage/kde-base/kopete-4.0.80/work/kopete-4.0.80/kopete/libkopete/kopetechatsessionmanager.h:24,                             
                 from /var/tmp/portage/kde-base/kopete-4.0.80/work/kopete-4.0.80/kopete/protocols/telepathy/telepathycontact.cpp:31:                         
/usr/include/qt4/QtCore/qobject.h:125: warning: ‘virtual bool QObject::event(QEvent*)’ was hidden                                                           
/var/tmp/portage/kde-base/kopete-4.0.80/work/kopete-4.0.80/kopete/libkopete/kopetemessagehandlerchain.h:78: warning:   by ‘Kopete::MessageEvent* Kopete::ProcessMessageTask::event()’                                                                                                                                     
/var/tmp/portage/kde-base/kopete-4.0.80/work/kopete-4.0.80/kopete/protocols/telepathy/telepathycontact.cpp:205: warning: unused parameter ‘contactBase’     
/var/tmp/portage/kde-base/kopete-4.0.80/work/kopete-4.0.80/kopete/protocols/telepathy/telepathycontact.cpp:214: warning: unused parameter ‘contactBase’     
[ 77%] Building CXX object kopete/protocols/telepathy/CMakeFiles/kopete_telepathy.dir/telepathycontactmanager.o                                             
In file included from /var/tmp/portage/kde-base/kopete-4.0.80/work/kopete-4.0.80/kopete/protocols/telepathy/telepathycontactmanager.cpp:38:                 
/var/tmp/portage/kde-base/kopete-4.0.80/work/kopete-4.0.80/kopete/libkopete/kopetecontact.h:236: warning: ‘virtual QList<KAction*>* Kopete::Contact::customContextMenuActions(Kopete::ChatSession*)’ was hidden                                                                                                           
/var/tmp/portage/kde-base/kopete-4.0.80/work/kopete-4.0.80/kopete/protocols/telepathy/telepathycontact.h:55: warning:   by ‘virtual QList<KAction*>* TelepathyContact::customContextMenuActions()’                                                                                                                       
[ 77%] Building CXX object kopete/protocols/telepathy/CMakeFiles/kopete_telepathy.dir/telepathychatsession.o                                                 
In file included from /var/tmp/portage/kde-base/kopete-4.0.80/work/kopete-4.0.80/kopete/libkopete/kopetechatsession.h:34,                                   
                 from /var/tmp/portage/kde-base/kopete-4.0.80/work/kopete-4.0.80/kopete/protocols/telepathy/telepathychatsession.h:20,                       
                 from /var/tmp/portage/kde-base/kopete-4.0.80/work/kopete-4.0.80/kopete/protocols/telepathy/telepathychatsession.cpp:17:                     
/usr/include/qt4/QtCore/qobject.h:125: warning: ‘virtual bool QObject::event(QEvent*)’ was hidden                                                           
/var/tmp/portage/kde-base/kopete-4.0.80/work/kopete-4.0.80/kopete/libkopete/kopetemessagehandlerchain.h:78: warning:   by ‘Kopete::MessageEvent* Kopete::ProcessMessageTask::event()’                                                                                                                                     
In file included from /var/tmp/portage/kde-base/kopete-4.0.80/work/kopete-4.0.80/kopete/protocols/telepathy/telepathychatsession.cpp:35:                     
/var/tmp/portage/kde-base/kopete-4.0.80/work/kopete-4.0.80/kopete/libkopete/kopetecontact.h:236: warning: ‘virtual QList<KAction*>* Kopete::Contact::customContextMenuActions(Kopete::ChatSession*)’ was hidden                                                                                                           
/var/tmp/portage/kde-base/kopete-4.0.80/work/kopete-4.0.80/kopete/protocols/telepathy/telepathycontact.h:55: warning:   by ‘virtual QList<KAction*>* TelepathyContact::customContextMenuActions()’                                                                                                                       
[ 78%] Building CXX object kopete/protocols/telepathy/CMakeFiles/kopete_telepathy.dir/telepathyaddpendingcontactjob.o
In file included from /var/tmp/portage/kde-base/kopete-4.0.80/work/kopete-4.0.80/kopete/protocols/telepathy/telepathyaddpendingcontactjob.cpp:36:
/var/tmp/portage/kde-base/kopete-4.0.80/work/kopete-4.0.80/kopete/libkopete/kopetecontact.h:236: warning: ‘virtual QList<KAction*>* Kopete::Contact::customContextMenuActions(Kopete::ChatSession*)’ was hidden
/var/tmp/portage/kde-base/kopete-4.0.80/work/kopete-4.0.80/kopete/protocols/telepathy/telepathycontact.h:55: warning:   by ‘virtual QList<KAction*>* TelepathyContact::customContextMenuActions()’
/var/tmp/portage/kde-base/kopete-4.0.80/work/kopete-4.0.80/kopete/protocols/telepathy/telepathyaddpendingcontactjob.cpp:38: error: ‘UI’ is not a namespace-name
/var/tmp/portage/kde-base/kopete-4.0.80/work/kopete-4.0.80/kopete/protocols/telepathy/telepathyaddpendingcontactjob.cpp:38: error: expected namespace-name before ‘;’ token
make[2]: *** [kopete/protocols/telepathy/CMakeFiles/kopete_telepathy.dir/telepathyaddpendingcontactjob.o] Error 1
make[1]: *** [kopete/protocols/telepathy/CMakeFiles/kopete_telepathy.dir/all] Error 2
make: *** [all] Error 2

_________________
--- sorry for the bad english ---
Back to top
View user's profile Send private message
GroMeZ
n00b
n00b


Joined: 21 Apr 2007
Posts: 10

PostPosted: Wed Jun 04, 2008 9:40 am    Post subject: Reply with quote

lancelott wrote:
How can I easily unmask the kde-4.1 slotted builds?


Check portage.* files/directories in Documentation/portage/ of the overlay and symlink in /etc/portage/ :)
Back to top
View user's profile Send private message
maggu2810
n00b
n00b


Joined: 27 Sep 2005
Posts: 20

PostPosted: Wed Jun 04, 2008 10:58 am    Post subject: Reply with quote

If I edit the file
Code:
/var/tmp/portage/kde-base/kopete-4.0.80/work/kopete-4.0.80/kopete/protocols/telepathy/telepathyaddpendingcontactjob.cpp

and comment out the line
Code:
using namespace Kopete::UI;

it will compile fine with telepathy USE-Flag

Just for the information:
I can connect through my google talk account via telepathy.
I see the other users, can send message to them, but do not receive the answer in kopete (but I can see it in the terminal).



The gwenview error is caused by the kipi include. Now it is using KUrl and not KURL.
Perhaps the ebuild should block <=media-libs/libkipi-0.1.5 and depend on kde-base/libkipi.
So it works if you remove media-libs/libkipi and then build gwenview.
_________________
--- sorry for the bad english ---


Last edited by maggu2810 on Wed Jun 04, 2008 5:57 pm; edited 1 time in total
Back to top
View user's profile Send private message
Matteo Azzali
Retired Dev
Retired Dev


Joined: 23 Sep 2004
Posts: 1133

PostPosted: Wed Jun 04, 2008 1:46 pm    Post subject: Reply with quote

Again about okular:

Changing the dependancy for chmlib fixed issue 1.

For ebook support, here the app-misc/ebook-tools/ebook-tools-0.1.0.ebuild

while okular ebuild patch it's here.

If anything went fine, you'll get "ebook open file format" support (epub).
_________________
Every day a new distro comes to birth. Every day a distro "eats" another.
If you're born distro, no matter what, start to run.
---- http://www.linuxprinting.org/ ---- http://tuxmobil.org/
Back to top
View user's profile Send private message
xenon
Guru
Guru


Joined: 25 Dec 2002
Posts: 432
Location: Europe

PostPosted: Wed Jun 04, 2008 2:47 pm    Post subject: Reply with quote

Hello everyone. This is not the first time I deal with overlays, but I'm quite stuck. So I want to try KDE 4.1 beta, and I install the kdesvn-portage overlay with layman. All is well. I try to install a package and Portage tells me it's masked both by package.mask and by missing keyword. Package.mask is to be expected (but apparently I'm not unmasking them properly in package.unmask) but howtos say I shouldn't have to deal with keywords since I have ACCEPT_KEYWORDS=~amd64. I took a look at an ebuild from the overlay and it has no slot information and no accept keywords at all.
Code:
  GNU nano 2.0.6       File: konsole-4.0.80.ebuild                   

# Copyright 1999-2008 Gentoo Foundation
# Distributed under the terms of the GNU General Public License v2

EAPI="1"

KMNAME=kdebase
KMMODULE=apps/${PN}
inherit kde4-meta

DESCRIPTION="X terminal for use with KDE."
KEYWORDS=""
IUSE="debug htmlhandbook"

RDEPEND="x11-libs/libX11
        x11-libs/libXext
        >=x11-libs/libxklavier-3.2
        x11-libs/libXrender
        x11-libs/libXtst"
DEPEND="${RDEPEND}
        x11-apps/bdftopcf
        x11-proto/kbproto
        x11-proto/renderproto"
RESTRICT="test"

src_unpack() {
        if use htmlhandbook; then
                KMEXTRA="${KMEXTRA}
                        apps/doc/${PN}"
        fi

        kde4-meta_src_unpack
}


What am I doing wrong? Could anyone kindly lead me by hand? :) Thanks.
Back to top
View user's profile Send private message
Berniyh
l33t
l33t


Joined: 07 Jun 2006
Posts: 677

PostPosted: Wed Jun 04, 2008 2:59 pm    Post subject: Reply with quote

xenon wrote:
Package.mask is to be expected (but apparently I'm not unmasking them properly in package.unmask) but howtos say I shouldn't have to deal with keywords since I have ACCEPT_KEYWORDS=~amd64.
What am I doing wrong? Could anyone kindly lead me by hand? :) Thanks.

Please do NOT mix official HowTos (I guess, that you were talking about the KDE4 guide) with unofficial overlays, like this is.
Especially do NOT complain to anyone, if the guide didn't work, because there are things, that are different.

Thanks. :)
Back to top
View user's profile Send private message
xenon
Guru
Guru


Joined: 25 Dec 2002
Posts: 432
Location: Europe

PostPosted: Wed Jun 04, 2008 3:08 pm    Post subject: Reply with quote

Got it. I'll ignore the bit about accept keywords. Could you give me some help now? Thanks. ;)
Back to top
View user's profile Send private message
s.hase
Apprentice
Apprentice


Joined: 19 Nov 2004
Posts: 293

PostPosted: Wed Jun 04, 2008 4:12 pm    Post subject: Reply with quote

Most alpha/beta or whatever ebuilds didn't use ~arch as keyword but **. So simply use
Code:
kde-base/kwin:kde-4.1 **

All this you can find in the Documentation folder of the overlay!
Back to top
View user's profile Send private message
xenon
Guru
Guru


Joined: 25 Dec 2002
Posts: 432
Location: Europe

PostPosted: Wed Jun 04, 2008 4:40 pm    Post subject: Reply with quote

Thank you. I completely missed the fact that the overlay folder included more than just ebuild files. I'll give it a try.
Back to top
View user's profile Send private message
DZhon
n00b
n00b


Joined: 15 Oct 2007
Posts: 11
Location: Russia, Azov

PostPosted: Wed Jun 04, 2008 5:48 pm    Post subject: Reply with quote

Oh, I have seen that amarok-4.0.80 and k3b-4.0.80 depends on kdelibs-svn, not 4.0.80 ... Does amarok need only svn version ? o_O I think that in these reasons amarok-9999 will be better solution ...
Back to top
View user's profile Send private message
aitch
Tux's lil' helper
Tux's lil' helper


Joined: 26 Sep 2005
Posts: 88
Location: New Zealand

PostPosted: Wed Jun 04, 2008 9:54 pm    Post subject: Reply with quote

i4dnf wrote:
here libplasma fails with the folowing:
Code:

[ 33%] Building CXX object libs/plasma/CMakeFiles/plasma.dir/datacontainer.o
/var/tmp/portage/kde-base/libplasma-4.0.80/work/libplasma-4.0.80/libs/plasma/applet.h: In member function ‘Plasma::Containment* Plasma::Corona::Private::addContainment(const QString&, const QVariantList&, uint, bool)’:
/var/tmp/portage/kde-base/libplasma-4.0.80/work/libplasma-4.0.80/libs/plasma/applet.h:579: error: ‘void Plasma::Applet::setFailedToLaunch(bool, const QString&)’ is protected
/var/tmp/portage/kde-base/libplasma-4.0.80/work/libplasma-4.0.80/libs/plasma/corona.cpp:153: error: within this context
/var/tmp/portage/kde-base/libplasma-4.0.80/work/libplasma-4.0.80/libs/plasma/applet.h:625: error: ‘void Plasma::Applet::setIsContainment(bool)’ is protected
/var/tmp/portage/kde-base/libplasma-4.0.80/work/libplasma-4.0.80/libs/plasma/corona.cpp:157: error: within this context
make[2]: *** [libs/plasma/CMakeFiles/plasma.dir/corona.o] Error 1
make[2]: *** Waiting for unfinished jobs....
/var/tmp/portage/kde-base/libplasma-4.0.80/work/libplasma-4.0.80/libs/plasma/containment.cpp: In member function ‘QPoint Plasma::Containment::effectiveScreenPos() const’:
/var/tmp/portage/kde-base/libplasma-4.0.80/work/libplasma-4.0.80/libs/plasma/containment.cpp:604: warning: passing ‘qreal’ for argument 1 to ‘QPoint::QPoint(int, int)’
/var/tmp/portage/kde-base/libplasma-4.0.80/work/libplasma-4.0.80/libs/plasma/containment.cpp:607: warning: passing ‘qreal’ for argument 1 to ‘QPoint::QPoint(int, int)’
/var/tmp/portage/kde-base/libplasma-4.0.80/work/libplasma-4.0.80/libs/plasma/containment.cpp:607: warning: passing ‘qreal’ for argument 2 to ‘QPoint::QPoint(int, int)’
/var/tmp/portage/kde-base/libplasma-4.0.80/work/libplasma-4.0.80/libs/plasma/containment.cpp:610: warning: passing ‘qreal’ for argument 2 to ‘QPoint::QPoint(int, int)’
/var/tmp/portage/kde-base/libplasma-4.0.80/work/libplasma-4.0.80/libs/plasma/containment.cpp:613: warning: passing ‘qreal’ for argument 1 to ‘QPoint::QPoint(int, int)’
/var/tmp/portage/kde-base/libplasma-4.0.80/work/libplasma-4.0.80/libs/plasma/containment.cpp:613: warning: passing ‘qreal’ for argument 2 to ‘QPoint::QPoint(int, int)’
/var/tmp/portage/kde-base/libplasma-4.0.80/work/libplasma-4.0.80/libs/plasma/applet.h: In member function ‘KActionCollection& Plasma::Containment::Private::actions()’:
/var/tmp/portage/kde-base/libplasma-4.0.80/work/libplasma-4.0.80/libs/plasma/applet.h:724: error: ‘Plasma::Applet::Private* const Plasma::Applet::d’ is private
/var/tmp/portage/kde-base/libplasma-4.0.80/work/libplasma-4.0.80/libs/plasma/containment.cpp:871: error: within this context
/var/tmp/portage/kde-base/libplasma-4.0.80/work/libplasma-4.0.80/libs/plasma/containment.cpp: In member function ‘void Plasma::Containment::Private::positionContainment()’:
/var/tmp/portage/kde-base/libplasma-4.0.80/work/libplasma-4.0.80/libs/plasma/containment.cpp:1283: warning: passing ‘qreal’ for argument 2 to ‘QPoint::QPoint(int, int)’
make[2]: *** [libs/plasma/CMakeFiles/plasma.dir/containment.o] Error 1
make[1]: *** [libs/plasma/CMakeFiles/plasma.dir/all] Error 2
make: *** [all] Error 2


I'm getting this error too, tried updating over a 12 hour period so I'm not sure what the problem is.

problems with corona.o..?
Back to top
View user's profile Send private message
i4dnf
Apprentice
Apprentice


Joined: 18 Sep 2005
Posts: 265
Location: Bucharest, Romania

PostPosted: Wed Jun 04, 2008 10:01 pm    Post subject: Reply with quote

don't know, i get that problem with both 4.0.80 and svn versions... :(
_________________
"The only difference between me and a madman is that I am not MAD" (SALVATOR DALI)
Back to top
View user's profile Send private message
aitch
Tux's lil' helper
Tux's lil' helper


Joined: 26 Sep 2005
Posts: 88
Location: New Zealand

PostPosted: Wed Jun 04, 2008 10:07 pm    Post subject: Reply with quote

what's your setup? I'm running 64-bit, so maybe a problem with the arch. but dunno what's wrong with our systems specifically...
Back to top
View user's profile Send private message
i4dnf
Apprentice
Apprentice


Joined: 18 Sep 2005
Posts: 265
Location: Bucharest, Romania

PostPosted: Wed Jun 04, 2008 10:58 pm    Post subject: Reply with quote

i'm on 32bit, though i have a amd64 processor
emerge --info:
Code:

Portage 2.1.5.3 (default/linux/x86/2008.0/desktop, gcc-4.1.1, glibc-2.5-r4, 2.6.24-gentoo-r3CS i686)
=================================================================
System uname: 2.6.24-gentoo-r3CS i686 AMD Athlon(tm) 64 X2 Dual Core Processor 4200+
Timestamp of tree: Wed, 04 Jun 2008 15:15:01 +0000
ccache version 2.4 [enabled]
app-shells/bash:     3.2_p17-r1
dev-java/java-config: 1.3.7, 2.0.33-r1
dev-lang/python:     2.4.4-r5, 2.5.1-r5
dev-python/pycrypto: 2.0.1-r6
dev-util/ccache:     2.4-r7
sys-apps/baselayout: 2.0.0
sys-apps/openrc:     0.2.4-r1
sys-apps/sandbox:    1.2.18.1-r2
sys-devel/autoconf:  2.13, 2.61
sys-devel/automake:  1.4_p6, 1.5, 1.6.3, 1.7.9-r1, 1.8.5-r3, 1.9.6-r2, 1.10.1, 1.71
sys-devel/binutils:  2.18-r1
sys-devel/gcc-config: 1.3.14
sys-devel/libtool:   1.5.22
virtual/os-headers:  2.6.22-r1
ACCEPT_KEYWORDS="x86"
CBUILD="i686-pc-linux-gnu"
CFLAGS="-O2 -march=athlon64 -msse2 -msse3 -pipe -fomit-frame-pointer"
CHOST="i686-pc-linux-gnu"
CONFIG_PROTECT="/etc /usr/kde/3.5/env /usr/kde/3.5/share/config /usr/kde/3.5/shutdown /usr/kde/4.0/env /usr/kde/4.0/share/config /usr/kde/4.0/shutdown /usr/kde/4.1/env /usr/kde/4.1/share/config /usr/kde/4.1/shutdown /usr/kde/svn/env /usr/kde/svn/share/config /usr/kde/svn/shutdown /usr/share/X11/xkb /usr/share/config"
CONFIG_PROTECT_MASK="/etc/env.d /etc/env.d/java/ /etc/fonts/fonts.conf /etc/gconf /etc/gentoo-release /etc/revdep-rebuild /etc/splash /etc/terminfo /etc/texmf/web2c /etc/udev/rules.d"
CXXFLAGS="-O2 -march=athlon64 -msse2 -msse3 -pipe -fomit-frame-pointer -fvisibility-inlines-hidden"
DISTDIR="/usr/portage/distfiles"
EMERGE_DEFAULT_OPTS="--ask "
FEATURES="candy ccache collision-protect distlocks parallel-fetch sandbox sfperms strict unmerge-orphans userfetch"
GENTOO_MIRRORS="ftp://gentoo.romnet.org/gentoo ftp://ftp.lug.ro/gentoo/ "
LANG="en_US.UTF-8"
LC_ALL="en_US.UTF-8"
LDFLAGS="-Wl,-O1 -Wl,--enable-new-dtags -Wl,--sort-common -s"
LINGUAS="en"
MAKEOPTS="-j3"
PKGDIR="/usr/portage/packages"
PORTAGE_RSYNC_OPTS="--recursive --links --safe-links --perms --times --compress --force --whole-file --delete --stats --timeout=180 --exclude=/distfiles --exclude=/local --exclude=/packages"
PORTAGE_TMPDIR="/var/tmp"
PORTDIR="/usr/portage"
PORTDIR_OVERLAY="/var/portage /usr/portage/local/layman/kdesvn-portage"
SYNC="rsync://rsync3.ro.gentoo.org/gentoo-portage"
USE="3dnow 3dnowext X a52 aac acl acpi alsa audiofile bash-completion berkdb binary-drivers bluetooth branding bzip2 cairo cdda cddb cdr cli cracklib crypt cups curl dbus djvu dmi doc dri dts dvd dvdr dvdread emboss encode evo exif fam firefox flac fontconfig fortran gdbm gif gimpprint gpm gtk gtk2 hal hdri htmlhandbook iconv imagemagick iproute2 isdnlog jbig jp2 jpeg jpeg2k kde kdeenablefinal kdehiddenvisibility kdexdeltas kerberos lapack lcms ldap libnotify lm_sensors mad midi mikmod mime mmx mp3 mp4 mpeg mudflap mysql ncurses nls nptl nptlonly nvidia offensive ogg oggvorbis openal openexr opengl openmp oss pcre pdf pdflib perl pertty pic png ppds pppd python qt qt-copy qt3 qt3support qt4 quicktime readline real reflection samba sdl session spell spl sse sse2 sse3 ssl startup-notification stream svg tcpd threads tiff transparency truetype udev unicode usb visualization vorbis win32codecs wmf x86 xcb xcomposite xml xorg xosd xscreensaver xv xvid zeroconf zlib" ALSA_CARDS="emu10k1 emu10k1x" ALSA_PCM_PLUGINS="adpcm alaw asym copy dmix dshare dsnoop empty extplug file hooks iec958 ioplug ladspa lfloat linear meter mulaw multi null plug rate route share shm softvol" APACHE2_MODULES="actions alias auth_basic authn_alias authn_anon authn_dbm authn_default authn_file authz_dbm authz_default authz_groupfile authz_host authz_owner authz_user autoindex cache dav dav_fs dav_lock deflate dir disk_cache env expires ext_filter file_cache filter headers include info log_config logio mem_cache mime mime_magic negotiation rewrite setenvif speling status unique_id userdir usertrack vhost_alias" CAMERAS="directory" ELIBC="glibc" INPUT_DEVICES="keyboard mouse joystick evdev" KERNEL="linux" LCD_DEVICES="bayrad cfontz cfontz633 glk hd44780 lb216 lcdm001 mtxorb ncurses text" LINGUAS="en" USERLAND="GNU" VIDEO_CARDS="geforce nvidia"
Unset:  CPPFLAGS, CTARGET, INSTALL_MASK, PORTAGE_COMPRESS, PORTAGE_COMPRESS_FLAGS, PORTAGE_RSYNC_EXTRA_OPTS


_________________
"The only difference between me and a madman is that I am not MAD" (SALVATOR DALI)
Back to top
View user's profile Send private message
aitch
Tux's lil' helper
Tux's lil' helper


Joined: 26 Sep 2005
Posts: 88
Location: New Zealand

PostPosted: Wed Jun 04, 2008 11:13 pm    Post subject: Reply with quote

if it'll help..

Code:
Portage 2.1.5.3 (default-linux/amd64/2007.0, gcc-4.1.1, glibc-2.7-r2, 2.6.24-gentoo-r3 x86_64)
=================================================================
System uname: 2.6.24-gentoo-r3 x86_64 AMD Athlon(tm) 64 X2 Dual Core Processor 4200+
Timestamp of tree: Tue, 03 Jun 2008 07:06:01 +0000
app-shells/bash:     3.2_p39
dev-java/java-config: 1.3.7, 2.1.5
dev-lang/python:     2.4.3-r4, 2.5.1-r5
dev-python/pycrypto: 2.0.1-r5
sys-apps/baselayout: 2.0.0
sys-apps/openrc:     0.2.2
sys-apps/sandbox:    1.2.18.1-r2
sys-devel/autoconf:  2.13, 2.61-r1
sys-devel/automake:  1.5, 1.7.9-r1, 1.8.5-r3, 1.9.6-r2, 1.10.1-r1
sys-devel/binutils:  2.18-r1
sys-devel/gcc-config: 1.4.0-r4
sys-devel/libtool:   1.5.26
virtual/os-headers:  2.6.25-r3
ACCEPT_KEYWORDS="amd64 ~amd64"
CBUILD="x86_64-pc-linux-gnu"
CFLAGS="-march=k8 -pipe -O2"
CHOST="x86_64-pc-linux-gnu"
CONFIG_PROTECT="/etc /usr/kde/3.5/env /usr/kde/3.5/share/config /usr/kde/3.5/shutdown /usr/kde/4.0/env /usr/kde/4.0/share/config /usr/kde/4.0/shutdown /usr/kde/svn/env /usr/kde/svn/share/config /usr/kde/svn/shutdown /usr/share/config"
CONFIG_PROTECT_MASK="/etc/env.d /etc/env.d/java/ /etc/fonts/fonts.conf /etc/gconf /etc/gentoo-release /etc/revdep-rebuild /etc/terminfo /etc/udev/rules.d"
CXXFLAGS="-march=k8 -pipe -O2"
DISTDIR="/usr/portage/distfiles"
FEATURES="distlocks parallel-fetch sfperms strict unmerge-orphans userfetch"
GENTOO_MIRRORS="ftp://ftp.ecc.u-tokyo.ac.jp/GENTOO"
LANG="en_NZ.UTF-8"
LDFLAGS=""
LINGUAS="en_GB"
MAKEOPTS="-j3"
PKGDIR="/usr/portage/packages"
PORTAGE_RSYNC_OPTS="--recursive --links --safe-links --perms --times --compress --force --whole-file --delete --stats --timeout=180 --exclude=/distfiles --exclude=/local --exclude=/packages"
PORTAGE_TMPDIR="/var/tmp"
PORTDIR="/usr/portage"
PORTDIR_OVERLAY="/usr/local/layman/sunrise /usr/local/layman/desktop-effects /usr/local/layman/kdesvn-portage /usr/local/portage"
SYNC="rsync://rsync.gentoo.org/gentoo-portage"
USE="X aac acl acpi akamaru alsa amd64 automount avahi avi bash-completion berkdb bitmap-fonts cairo cdinstall cdr cjk cli cracklib crypt dbus dv dvd dvdr dvdread fame ffmpeg flac fortran gdbm gif glitz gnutls gpm gtk gtk2 hal howl iconv ieee1394 isdnlog java javascript joystick jpeg kde kdeenablefinal kipi lm_sensors mad midi mikmod mmx mp3 mpeg mudflap musicbrainz ncurses nls nptl nptlonly nsplugin ogg opengl openmp oss pam pcre pdf perl png pppd profile python qt qt3 qt3support qt4 quicktime readline reflection samba scanner sdl session slang spell spl sse sse2 ssl subtitles svg tcpd threads truetype truetype-fonts type1-fonts udev unicode usb userlocales v4l vcd visualization vorbis wacom xine xorg xv xvid zlib" ALSA_CARDS="intel8x0" ALSA_PCM_PLUGINS="adpcm alaw asym copy dmix dshare dsnoop empty extplug file hooks iec958 ioplug ladspa lfloat linear meter mulaw multi null plug rate route share shm softvol" APACHE2_MODULES="actions alias auth_basic authn_alias authn_anon authn_dbm authn_default authn_file authz_dbm authz_default authz_groupfile authz_host authz_owner authz_user autoindex cache dav dav_fs dav_lock deflate dir disk_cache env expires ext_filter file_cache filter headers include info log_config logio mem_cache mime mime_magic negotiation rewrite setenvif speling status unique_id userdir usertrack vhost_alias" ELIBC="glibc" INPUT_DEVICES="mouse keyboard wacom evdev joystick" KERNEL="linux" LCD_DEVICES="bayrad cfontz cfontz633 glk hd44780 lb216 lcdm001 mtxorb ncurses text" LINGUAS="en_GB" USERLAND="GNU" VIDEO_CARDS="nv nvidia vesa"
Unset:  CPPFLAGS, CTARGET, EMERGE_DEFAULT_OPTS, INSTALL_MASK, LC_ALL, PORTAGE_COMPRESS, PORTAGE_COMPRESS_FLAGS, PORTAGE_RSYNC_EXTRA_OPTS


anything weird?

--edit-- we're both on kernel 2.6.24, but surely a lot of others are as well..

--edit2-- I'm going through build utilities trying to find the problem here, upgraded cmake to a newer version but to no avail.

these unused parameter errors are annoying, but I didn't think they were fatal up until now. I wish I knew what I could do to resolve this issue.
Back to top
View user's profile Send private message
coolsnowmen
Veteran
Veteran


Joined: 30 Jun 2004
Posts: 1479
Location: No.VA

PostPosted: Thu Jun 05, 2008 2:18 am    Post subject: nepomuk Reply with quote

has anyone had trouble with nepomuk? installed it?

Quote:
>>> Source compiled.
>>> Test phase [not enabled]: kde-base/nepomuk-4.0.80

>>> Install nepomuk-4.0.80 into /var/tmp/portage/kde-base/nepomuk-4.0.80/image/ category kde-base
make: *** No rule to make target `install'. Stop.
*
* ERROR: kde-base/nepomuk-4.0.80 failed.
* Call stack:
* ebuild.sh, line 49: Called src_install
* environment, line 2902: Called kde4-meta_src_install
* environment, line 2302: Called cmake-utils_src_install
* environment, line 690: Called die
* The specific snippet of code:
* emake install DESTDIR="${D}" || die "Make install failed";
* The die message:
* Make install failed
*
* If you need support, post the topmost build error, and the call stack if relevant.
* A complete build log is located at '/var/tmp/portage/kde-base/nepomuk-4.0.80/temp/build.log'.
* The ebuild environment file is located at '/var/tmp/portage/kde-base/nepomuk-4.0.80/temp/environment'.
* This ebuild used the following eclasses from overlays:
* /usr/portage/local/layman/kdesvn-portage/eclass/kde4-meta.eclass
* /usr/portage/local/layman/kdesvn-portage/eclass/kde4-functions.eclass
* /usr/portage/local/layman/kdesvn-portage/eclass/kde4-base.eclass
*


I tried forcing the 9999 install w/o 9999 kdelibs

Quote:
>>> Source compiled.
>>> Test phase [not enabled]: kde-base/nepomuk-9999

>>> Install nepomuk-9999 into /var/tmp/portage/kde-base/nepomuk-9999/image/ category kde-base
make: *** No rule to make target `install'. Stop.
*
* ERROR: kde-base/nepomuk-9999 failed.
* Call stack:
* ebuild.sh, line 49: Called src_install
* environment, line 3003: Called kde4-meta_src_install
* environment, line 2323: Called cmake-utils_src_install
* environment, line 711: Called die
* The specific snippet of code:
* emake install DESTDIR="${D}" || die "Make install failed";
* The die message:
* Make install failed
*
* If you need support, post the topmost build error, and the call stack if relevant.
* A complete build log is located at '/var/tmp/portage/kde-base/nepomuk-9999/temp/build.log'.
* The ebuild environment file is located at '/var/tmp/portage/kde-base/nepomuk-9999/temp/environment'.
* This ebuild used the following eclasses from overlays:
* /usr/portage/local/layman/kdesvn-portage/eclass/kde4svn-meta.eclass
* /usr/portage/local/layman/kdesvn-portage/eclass/kde4svn.eclass
* /usr/portage/local/layman/kdesvn-portage/eclass/kde4-meta.eclass
* /usr/portage/local/layman/kdesvn-portage/eclass/kde4-functions.eclass
* /usr/portage/local/layman/kdesvn-portage/eclass/kde4-base.eclass

_________________
emerge: there are no ebuilds to satisfy "moo"
Back to top
View user's profile Send private message
DZhon
n00b
n00b


Joined: 15 Oct 2007
Posts: 11
Location: Russia, Azov

PostPosted: Thu Jun 05, 2008 5:13 am    Post subject: Reply with quote

I compiled kjots only after USE="-kontact". It crashes with this flag o_O
Back to top
View user's profile Send private message
coolsnowmen
Veteran
Veteran


Joined: 30 Jun 2004
Posts: 1479
Location: No.VA

PostPosted: Thu Jun 05, 2008 5:40 am    Post subject: Reply with quote

just a tip for 4.0.80
COLLISION_IGNORE="/usr/kde/4.1/share/apps/cmake/modules/" is usefull for trying to install the following packages
kde-base/kmplot
kde-base/kiten
kde-base/libkdeedu
kde-base/blinken
kde-base/kwordquiz
kde-base/kalgebra
kde-base/kstars
kde-base/klettres
kde-base/kpercentage
kde-base/kbruch
kde-base/kalzium
kde-base/kgeography
kde-base/ktouch
kde-base/kturtle
kde-base/marble

this is in reference to the following files
* /usr/kde/4.1/share/apps/cmake/modules/FindKDEEdu.cmake
* /usr/kde/4.1/share/apps/cmake/modules/FindMarbleWidget.cmake
_________________
emerge: there are no ebuilds to satisfy "moo"
Back to top
View user's profile Send private message
Display posts from previous:   
This topic is locked: you cannot edit posts or make replies.    Gentoo Forums Forum Index Unsupported Software All times are GMT
Goto page Previous  1, 2, 3, ... 28, 29, 30  Next
Page 2 of 30

 
Jump to:  
You cannot post new topics in this forum
You cannot reply to topics in this forum
You cannot edit your posts in this forum
You cannot delete your posts in this forum
You cannot vote in polls in this forum