Gentoo Forums
Gentoo Forums
Gentoo Forums
Quick Search: in
Compil pb with paludis for gtk-engines-qtcurve / qtcurve-qt4
View unanswered posts
View posts from last 24 hours

 
Reply to topic    Gentoo Forums Forum Index Unsupported Software
View previous topic :: View next topic  
Author Message
cauchy49
n00b
n00b


Joined: 15 Sep 2008
Posts: 17
Location: france

PostPosted: Mon Sep 15, 2008 8:27 pm    Post subject: Compil pb with paludis for gtk-engines-qtcurve / qtcurve-qt4 Reply with quote

I use paludis 0.30 and i can't compile these packages (i use ~x86 for all my system) :

* x11-themes/gtk-engines-qtcurve-0.59.7-r1:0::gentoo: failure
* x11-themes/qtcurve-qt4-0.59.6:0::gentoo: failure

I use version 4.4.1-r1 of the qt4 library.

debug for qtcurve-qt4 :

/var/tmp/paludis/x11-themes-qtcurve-qt4-0.59.6/work/qtcurve-qt4_build/config.h:7:6: error: invalid suffix "mACCESS" on integer constant
/var/tmp/paludis/x11-themes-qtcurve-qt4-0.59.6/work/qtcurve-qt4_build/config.h:7: error: stray '\33' in program
/var/tmp/paludis/x11-themes-qtcurve-qt4-0.59.6/work/qtcurve-qt4_build/config.h:7:24: error: invalid suffix "m" on integer constant
/var/tmp/paludis/x11-themes-qtcurve-qt4-0.59.6/work/qtcurve-qt4_build/config.h:9: error: stray '\33' in program
/var/tmp/paludis/x11-themes-qtcurve-qt4-0.59.6/work/qtcurve-qt4_build/config.h:9:6: error: invalid suffix "mACCESS" on integer constant
/var/tmp/paludis/x11-themes-qtcurve-qt4-0.59.6/work/qtcurve-qt4_build/config.h:9: error: stray '\33' in program
/var/tmp/paludis/x11-themes-qtcurve-qt4-0.59.6/work/qtcurve-qt4_build/config.h:9:24: error: invalid suffix "m" on integer constant
/var/tmp/paludis/x11-themes-qtcurve-qt4-0.59.6/work/qtcurve-qt4_build/config.h:11:13: warning: missing terminating " character
/var/tmp/paludis/x11-themes-qtcurve-qt4-0.59.6/work/qtcurve-qt4_build/config.h:11: error: missing terminating " character
/var/tmp/paludis/x11-themes-qtcurve-qt4-0.59.6/work/qtcurve-qt4_build/config.h:14: error: stray '\33' in program
/var/tmp/paludis/x11-themes-qtcurve-qt4-0.59.6/work/qtcurve-qt4_build/config.h:14:6: error: invalid suffix "mACCESS" on integer constant
/var/tmp/paludis/x11-themes-qtcurve-qt4-0.59.6/work/qtcurve-qt4_build/config.h:14: error: stray '\33' in program
/var/tmp/paludis/x11-themes-qtcurve-qt4-0.59.6/work/qtcurve-qt4_build/config.h:14:24: error: invalid suffix "m" on integer constant
/var/tmp/paludis/x11-themes-qtcurve-qt4-0.59.6/work/qtcurve-qt4_build/config.h:16: error: stray '\33' in program
/var/tmp/paludis/x11-themes-qtcurve-qt4-0.59.6/work/qtcurve-qt4_build/config.h:16:6: error: invalid suffix "mACCESS" on integer constant
/var/tmp/paludis/x11-themes-qtcurve-qt4-0.59.6/work/qtcurve-qt4_build/config.h:16: error: stray '\33' in program
/var/tmp/paludis/x11-themes-qtcurve-qt4-0.59.6/work/qtcurve-qt4_build/config.h:16:24: error: invalid suffix "m" on integer constant
/var/tmp/paludis/x11-themes-qtcurve-qt4-0.59.6/work/qtcurve-qt4_build/config.h:18:13: warning: missing terminating " character
/var/tmp/paludis/x11-themes-qtcurve-qt4-0.59.6/work/qtcurve-qt4_build/config.h:18: error: missing terminating " character
/var/tmp/paludis/x11-themes-qtcurve-qt4-0.59.6/work/QtCurve-KDE4-0.59.6/style/qtcurve.cpp:454: error: stray '\33' in program
/var/tmp/paludis/x11-themes-qtcurve-qt4-0.59.6/work/QtCurve-KDE4-0.59.6/style/qtcurve.cpp:454:110: error: invalid suffix "mACCESS" on integer constant
/var/tmp/paludis/x11-themes-qtcurve-qt4-0.59.6/work/QtCurve-KDE4-0.59.6/style/qtcurve.cpp:454: error: stray '\33' in program
/var/tmp/paludis/x11-themes-qtcurve-qt4-0.59.6/work/QtCurve-KDE4-0.59.6/style/qtcurve.cpp:454:128: error: invalid suffix "m" on integer constant
/var/tmp/paludis/x11-themes-qtcurve-qt4-0.59.6/work/QtCurve-KDE4-0.59.6/style/qtcurve.cpp:455: error: stray '\33' in program
/var/tmp/paludis/x11-themes-qtcurve-qt4-0.59.6/work/QtCurve-KDE4-0.59.6/style/qtcurve.cpp:455:110: error: invalid suffix "mACCESS" on integer constant
/var/tmp/paludis/x11-themes-qtcurve-qt4-0.59.6/work/QtCurve-KDE4-0.59.6/style/qtcurve.cpp:455: error: stray '\33' in program
/var/tmp/paludis/x11-themes-qtcurve-qt4-0.59.6/work/QtCurve-KDE4-0.59.6/style/qtcurve.cpp:455:128: error: invalid suffix "m" on integer constant
/var/tmp/paludis/x11-themes-qtcurve-qt4-0.59.6/work/QtCurve-KDE4-0.59.6/style/qtcurve.cpp:951: error: stray '\33' in program
/var/tmp/paludis/x11-themes-qtcurve-qt4-0.59.6/work/QtCurve-KDE4-0.59.6/style/qtcurve.cpp:951:144: error: invalid suffix "mACCESS" on integer constant
/var/tmp/paludis/x11-themes-qtcurve-qt4-0.59.6/work/QtCurve-KDE4-0.59.6/style/qtcurve.cpp:951: error: stray '\33' in program
/var/tmp/paludis/x11-themes-qtcurve-qt4-0.59.6/work/QtCurve-KDE4-0.59.6/style/qtcurve.cpp:951:162: error: invalid suffix "m" on integer constant
/var/tmp/paludis/x11-themes-qtcurve-qt4-0.59.6/work/QtCurve-KDE4-0.59.6/style/qtcurve.cpp:953: error: stray '\33' in program
/var/tmp/paludis/x11-themes-qtcurve-qt4-0.59.6/work/QtCurve-KDE4-0.59.6/style/qtcurve.cpp:953:148: error: invalid suffix "mACCESS" on integer constant
/var/tmp/paludis/x11-themes-qtcurve-qt4-0.59.6/work/QtCurve-KDE4-0.59.6/style/qtcurve.cpp:953: error: stray '\33' in program
/var/tmp/paludis/x11-themes-qtcurve-qt4-0.59.6/work/QtCurve-KDE4-0.59.6/style/qtcurve.cpp:953:166: error: invalid suffix "m" on integer constant
/var/tmp/paludis/x11-themes-qtcurve-qt4-0.59.6/work/qtcurve-qt4_build/config.h:6: error: 'trying' does not name a type
/var/tmp/paludis/x11-themes-qtcurve-qt4-0.59.6/work/qtcurve-qt4_build/config.h:7: error: expected unqualified-id before numeric constant
/var/tmp/paludis/x11-themes-qtcurve-qt4-0.59.6/work/qtcurve-qt4_build/config.h:9: error: expected unqualified-id before numeric constant
/var/tmp/paludis/x11-themes-qtcurve-qt4-0.59.6/work/qtcurve-qt4_build/config.h:14: error: expected unqualified-id before numeric constant
/var/tmp/paludis/x11-themes-qtcurve-qt4-0.59.6/work/qtcurve-qt4_build/config.h:16: error: expected unqualified-id before numeric constant
In file included from /var/tmp/paludis/x11-themes-qtcurve-qt4-0.59.6/work/QtCurve-KDE4-0.59.6/style/qtcurve.h:42,
from /var/tmp/paludis/x11-themes-qtcurve-qt4-0.59.6/work/QtCurve-KDE4-0.59.6/style/qtcurve.cpp:25:
/var/tmp/paludis/x11-themes-qtcurve-qt4-0.59.6/work/QtCurve-KDE4-0.59.6/common/common.h:65: error: expected constructor, destructor, or type conversion before ';' token
/var/tmp/paludis/x11-themes-qtcurve-qt4-0.59.6/work/QtCurve-KDE4-0.59.6/common/common.h:68: error: 'EShading' does not name a type
In file included from /var/tmp/paludis/x11-themes-qtcurve-qt4-0.59.6/work/QtCurve-KDE4-0.59.6/style/qtcurve.h:42,
from /var/tmp/paludis/x11-themes-qtcurve-qt4-0.59.6/work/QtCurve-KDE4-0.59.6/style/qtcurve.cpp:25:
/var/tmp/paludis/x11-themes-qtcurve-qt4-0.59.6/work/QtCurve-KDE4-0.59.6/common/common.h: In function 'double getWidgetShade(EWidget, bool, bool, EAppearance)':
/var/tmp/paludis/x11-themes-qtcurve-qt4-0.59.6/work/QtCurve-KDE4-0.59.6/common/common.h:597: error: 'shading' was not declared in this scope
/var/tmp/paludis/x11-themes-qtcurve-qt4-0.59.6/work/QtCurve-KDE4-0.59.6/common/common.h:604: error: 'shading' was not declared in this scope
/var/tmp/paludis/x11-themes-qtcurve-qt4-0.59.6/work/QtCurve-KDE4-0.59.6/common/common.h: In function 'void shade(const color&, color*, double)':
/var/tmp/paludis/x11-themes-qtcurve-qt4-0.59.6/work/QtCurve-KDE4-0.59.6/common/common.h:809: error: 'shading' was not declared in this scope
/var/tmp/paludis/x11-themes-qtcurve-qt4-0.59.6/work/QtCurve-KDE4-0.59.6/common/common.h:811: error: 'SHADING_SIMPLE' was not declared in this scope
/var/tmp/paludis/x11-themes-qtcurve-qt4-0.59.6/work/QtCurve-KDE4-0.59.6/common/common.h:826: error: 'SHADING_HSL' was not declared in this scope
/var/tmp/paludis/x11-themes-qtcurve-qt4-0.59.6/work/QtCurve-KDE4-0.59.6/common/common.h:852: error: 'SHADING_HSV' was not declared in this scope
In file included from /var/tmp/paludis/x11-themes-qtcurve-qt4-0.59.6/work/QtCurve-KDE4-0.59.6/style/qtcurve.cpp:28:
/var/tmp/paludis/x11-themes-qtcurve-qt4-0.59.6/work/QtCurve-KDE4-0.59.6/common/config_file.c: At global scope:
/var/tmp/paludis/x11-themes-qtcurve-qt4-0.59.6/work/QtCurve-KDE4-0.59.6/common/config_file.c:240: error: 'EShading' does not name a type
In file included from /var/tmp/paludis/x11-themes-qtcurve-qt4-0.59.6/work/QtCurve-KDE4-0.59.6/style/qtcurve.cpp:28:
/var/tmp/paludis/x11-themes-qtcurve-qt4-0.59.6/work/QtCurve-KDE4-0.59.6/common/config_file.c: In function 'bool readConfig(const QString&, Options*, Options*)':
/var/tmp/paludis/x11-themes-qtcurve-qt4-0.59.6/work/QtCurve-KDE4-0.59.6/common/config_file.c:815: error: 'shading' was not declared in this scope
/var/tmp/paludis/x11-themes-qtcurve-qt4-0.59.6/work/QtCurve-KDE4-0.59.6/common/config_file.c:815: error: 'toShading' was not declared in this scope
/var/tmp/paludis/x11-themes-qtcurve-qt4-0.59.6/work/QtCurve-KDE4-0.59.6/style/qtcurve.cpp: In member function 'virtual QStringList QtCurveStylePlugin::keys() const':
/var/tmp/paludis/x11-themes-qtcurve-qt4-0.59.6/work/QtCurve-KDE4-0.59.6/style/qtcurve.cpp:454: error: expected `]' before ';' token
/var/tmp/paludis/x11-themes-qtcurve-qt4-0.59.6/work/QtCurve-KDE4-0.59.6/style/qtcurve.cpp:454: error: expected `:' before ';' token
/var/tmp/paludis/x11-themes-qtcurve-qt4-0.59.6/work/QtCurve-KDE4-0.59.6/style/qtcurve.cpp:454: error: expected primary-expression before ';' token
/var/tmp/paludis/x11-themes-qtcurve-qt4-0.59.6/work/QtCurve-KDE4-0.59.6/style/qtcurve.cpp:454: error: expected `)' before ';' token
/var/tmp/paludis/x11-themes-qtcurve-qt4-0.59.6/work/QtCurve-KDE4-0.59.6/style/qtcurve.cpp:454: error: expected `;' before 'DENIED'
/var/tmp/paludis/x11-themes-qtcurve-qt4-0.59.6/work/QtCurve-KDE4-0.59.6/style/qtcurve.cpp:455: error: expected `]' before ';' token
/var/tmp/paludis/x11-themes-qtcurve-qt4-0.59.6/work/QtCurve-KDE4-0.59.6/style/qtcurve.cpp:455: error: expected `:' before ';' token
/var/tmp/paludis/x11-themes-qtcurve-qt4-0.59.6/work/QtCurve-KDE4-0.59.6/style/qtcurve.cpp:455: error: expected primary-expression before ';' token
/var/tmp/paludis/x11-themes-qtcurve-qt4-0.59.6/work/QtCurve-KDE4-0.59.6/style/qtcurve.cpp:455: error: expected `)' before ';' token
/var/tmp/paludis/x11-themes-qtcurve-qt4-0.59.6/work/QtCurve-KDE4-0.59.6/style/qtcurve.cpp:455: error: expected `;' before 'DENIED'
/var/tmp/paludis/x11-themes-qtcurve-qt4-0.59.6/work/QtCurve-KDE4-0.59.6/style/qtcurve.cpp: In constructor 'QtCurveStyle::QtCurveStyle(const QString&)':
/var/tmp/paludis/x11-themes-qtcurve-qt4-0.59.6/work/QtCurve-KDE4-0.59.6/style/qtcurve.cpp:951: error: expected `]' before ';' token
/var/tmp/paludis/x11-themes-qtcurve-qt4-0.59.6/work/QtCurve-KDE4-0.59.6/style/qtcurve.cpp:951: error: expected `:' before ';' token
/var/tmp/paludis/x11-themes-qtcurve-qt4-0.59.6/work/QtCurve-KDE4-0.59.6/style/qtcurve.cpp:951: error: expected primary-expression before ';' token
/var/tmp/paludis/x11-themes-qtcurve-qt4-0.59.6/work/QtCurve-KDE4-0.59.6/style/qtcurve.cpp:951: error: expected `)' before ';' token
/var/tmp/paludis/x11-themes-qtcurve-qt4-0.59.6/work/QtCurve-KDE4-0.59.6/style/qtcurve.cpp:951: error: expected `;' before 'DENIED'
/var/tmp/paludis/x11-themes-qtcurve-qt4-0.59.6/work/QtCurve-KDE4-0.59.6/style/qtcurve.cpp:953: error: expected `]' before ';' token
/var/tmp/paludis/x11-themes-qtcurve-qt4-0.59.6/work/QtCurve-KDE4-0.59.6/style/qtcurve.cpp:953: error: expected `:' before ';' token
/var/tmp/paludis/x11-themes-qtcurve-qt4-0.59.6/work/QtCurve-KDE4-0.59.6/style/qtcurve.cpp:953: error: expected primary-expression before ';' token
/var/tmp/paludis/x11-themes-qtcurve-qt4-0.59.6/work/QtCurve-KDE4-0.59.6/style/qtcurve.cpp:953: error: expected `)' before ';' token
/var/tmp/paludis/x11-themes-qtcurve-qt4-0.59.6/work/QtCurve-KDE4-0.59.6/style/qtcurve.cpp:953: error: expected `;' before 'DENIED'
/var/tmp/paludis/x11-themes-qtcurve-qt4-0.59.6/work/QtCurve-KDE4-0.59.6/style/qtcurve.cpp: In member function 'virtual void QtCurveStyle::drawControl(QStyle::ControlElement, const QStyleOption*, QPainter*, const QWidget*) const':
/var/tmp/paludis/x11-themes-qtcurve-qt4-0.59.6/work/QtCurve-KDE4-0.59.6/style/qtcurve.cpp:3463: error: 'shading' was not declared in this scope
/var/tmp/paludis/x11-themes-qtcurve-qt4-0.59.6/work/QtCurve-KDE4-0.59.6/style/qtcurve.cpp:3506: error: 'shading' was not declared in this scope
/var/tmp/paludis/x11-themes-qtcurve-qt4-0.59.6/work/QtCurve-KDE4-0.59.6/style/qtcurve.cpp: In member function 'void QtCurveStyle::drawSliderHandle(QPainter*, const QRect&, const QStyleOptionSlider*) const':
/var/tmp/paludis/x11-themes-qtcurve-qt4-0.59.6/work/QtCurve-KDE4-0.59.6/style/qtcurve.cpp:7927: error: 'shading' was not declared in this scope
/var/tmp/paludis/x11-themes-qtcurve-qt4-0.59.6/work/QtCurve-KDE4-0.59.6/style/qtcurve.cpp: In member function 'void QtCurveStyle::drawMenuOrToolBarBackground(QPainter*, const QRect&, const QStyleOption*, bool, bool) const':
/var/tmp/paludis/x11-themes-qtcurve-qt4-0.59.6/work/QtCurve-KDE4-0.59.6/style/qtcurve.cpp:8145: error: 'shading' was not declared in this scope
/var/tmp/paludis/x11-themes-qtcurve-qt4-0.59.6/work/QtCurve-KDE4-0.59.6/style/qtcurve.cpp: In member function 'void QtCurveStyle::shadeColors(const QColor&, QColor*) const':
/var/tmp/paludis/x11-themes-qtcurve-qt4-0.59.6/work/QtCurve-KDE4-0.59.6/style/qtcurve.cpp:8229: error: 'SHADING_SIMPLE' was not declared in this scope
/var/tmp/paludis/x11-themes-qtcurve-qt4-0.59.6/work/QtCurve-KDE4-0.59.6/style/qtcurve.cpp:8229: error: 'shading' was not declared in this scope
make[2]: *** [style/CMakeFiles/qtcurve.dir/qtcurve.o] Error 1
make[1]: *** [style/CMakeFiles/qtcurve.dir/all] Error 2
make: *** [all] Error 2
/usr/libexec/paludis/utils/emake: emake returned error 2

!!! ERROR in x11-themes/qtcurve-qt4-0.59.6:
!!! In cmake-utils_src_make at line 1038
!!! Make failed!

!!! Call stack:
!!! * cmake-utils_src_make (/var/tmp/paludis/x11-themes-qtcurve-qt4-0.59.6/temp/loadsaveenv:1038)
!!! * cmake-utils_src_compile (/var/tmp/paludis/x11-themes-qtcurve-qt4-0.59.6/temp/loadsaveenv:998)
!!! * src_compile (/var/tmp/paludis/x11-themes-qtcurve-qt4-0.59.6/temp/loadsaveenv:3732)
!!! * ebuild_f_compile (/usr/libexec/paludis/1/src_compile.bash:49)
!!! * ebuild_main (/usr/libexec/paludis/ebuild.bash:470)
!!! * main (/usr/libexec/paludis/ebuild.bash:485)

diefunc: making ebuild PID 19242 exit with error
die trap: exiting with error.

any ideas of the problem ?
Back to top
View user's profile Send private message
cauchy49
n00b
n00b


Joined: 15 Sep 2008
Posts: 17
Location: france

PostPosted: Sat Sep 20, 2008 10:52 pm    Post subject: Reply with quote

I switch to qt 4.4.2 and it compiles now...
Back to top
View user's profile Send private message
Display posts from previous:   
Reply to topic    Gentoo Forums Forum Index Unsupported Software All times are GMT
Page 1 of 1

 
Jump to:  
You cannot post new topics in this forum
You cannot reply to topics in this forum
You cannot edit your posts in this forum
You cannot delete your posts in this forum
You cannot vote in polls in this forum