Gentoo Forums
Gentoo Forums
Gentoo Forums
Quick Search: in
[kde-testing] and [kde-crazy] KDE4 overlays thread (part 2)
View unanswered posts
View posts from last 24 hours

Goto page Previous  1, 2, 3 ... 18, 19, 20 ... 28, 29, 30  Next  
This topic is locked: you cannot edit posts or make replies.    Gentoo Forums Forum Index Unsupported Software
View previous topic :: View next topic  
Author Message
Basin
n00b
n00b


Joined: 16 Jul 2004
Posts: 41

PostPosted: Fri Nov 28, 2008 6:45 am    Post subject: Reply with quote

Basin wrote:
I'm having a really bizarre problem with kde-live where starting konsole from kickoff and clicking any of its menus will crash the whole of kde, dumping me back at kdm. What makes it odd is that it doesn't happen if I start konsole from a konsole, or from alt+f2 (Although it does still cause part of the window to go white). Also (possibly related) konsole has two bookmarks menus. I've tried deleting ~/.kde-live, but I can't understand what's causing it, especially why kickoff makes a difference. Any ideas?


I've found out that my problems, along with some random plasma crashes I was getting when adding applets etc, were cause by nvidia options set in xorg.conf. I removed all the options except for "AllowSHMPixmaps" "0" and NoLogo, and all of the nvidia-settings options, and kde4 is now working perfectly for me. I'm using the 180 series beta drivers which are meant to have most of the good options as default now.
I'm just posting to let nvidia users who are getting random crashes know that they should probably upgrade to the beta drivers, and delete all their old optimisations in xorg.conf if they haven't already.
Back to top
View user's profile Send private message
marcus84
Tux's lil' helper
Tux's lil' helper


Joined: 23 Apr 2008
Posts: 87

PostPosted: Fri Nov 28, 2008 8:29 am    Post subject: Reply with quote

tranquilcool wrote:
marcus84 wrote:
marcus84 wrote:
Hi guys,

I'm getting this error with KDM:

kdm :0[18368]: Cannot open ConsoleKit session: Unable to open session: The name org.freedesktop.ConsoleKit was not provided by any .service files.

I have consolekit installed: version 0.2.3

any idea?
any ideas???



start the consolekit;

/etc/init.d/consolekit start
then
rc-update add consolekit default


Thanks!
Back to top
View user's profile Send private message
Dusdan
n00b
n00b


Joined: 10 Mar 2008
Posts: 37

PostPosted: Fri Nov 28, 2008 8:31 am    Post subject: Reply with quote

Basin wrote:
I'm just posting to let nvidia users who are getting random crashes know that they should probably upgrade to the beta drivers, and delete all their old optimisations in xorg.conf if they haven't already.
I've tried to manually upgrade when the 180 drivers came out, but firefox 3 was not working: is it still the case?
Back to top
View user's profile Send private message
marcus84
Tux's lil' helper
Tux's lil' helper


Joined: 23 Apr 2008
Posts: 87

PostPosted: Fri Nov 28, 2008 8:46 am    Post subject: Reply with quote

Dusdan wrote:
Basin wrote:
I'm just posting to let nvidia users who are getting random crashes know that they should probably upgrade to the beta drivers, and delete all their old optimisations in xorg.conf if they haven't already.
I've tried to manually upgrade when the 180 drivers came out, but firefox 3 was not working: is it still the case?


I'm with 180.08 and firefox and it's all ok...
Back to top
View user's profile Send private message
uraes
Tux's lil' helper
Tux's lil' helper


Joined: 28 Nov 2002
Posts: 120
Location: Estonia

PostPosted: Fri Nov 28, 2008 10:33 am    Post subject: Reply with quote

marcus84 wrote:
tranquilcool wrote:
marcus84 wrote:
marcus84 wrote:
Hi guys,

I'm getting this error with KDM:

kdm :0[18368]: Cannot open ConsoleKit session: Unable to open session: The name org.freedesktop.ConsoleKit was not provided by any .service files.

I have consolekit installed: version 0.2.3

any idea?
any ideas???



start the consolekit;

/etc/init.d/consolekit start
then
rc-update add consolekit default


Thanks!


I tried it also, but restarting consolekit didn't help. Finally I just removed all 4.1(.80) installation and merged again. Now it is all right.
Back to top
View user's profile Send private message
bers
n00b
n00b


Joined: 28 Nov 2008
Posts: 49

PostPosted: Fri Nov 28, 2008 1:43 pm    Post subject: Reply with quote

Hi. Please help.

>>> Emerging (5 of 9) kde-base/libksieve-4.1.80
* kdepim-4.1.80.tar.bz2 RMD160 SHA1 SHA256 size ;-) ... [ ok ]
* checking ebuild checksums ;-) ... [ ok ]
* checking auxfile checksums ;-) ... [ ok ]
* checking miscfile checksums ;-) ... [ ok ]
>>> Unpacking source...
Unpacking parts of kdepim-4.1.80.tar.bz2 to /var/tmp/portage/kde-base/libksieve-4.1.80/work
>>> Source unpacked.
>>> Configuring source in /var/tmp/portage/kde-base/libksieve-4.1.80/work/libksieve-4.1.80 ...
loading initial cache file /var/tmp/portage/kde-base/libksieve-4.1.80/temp/gentoo_common_config.cmake
-- The C compiler identification is GNU
-- The CXX compiler identification is GNU
-- Check for working C compiler: /usr/lib/ccache/bin/x86_64-pc-linux-gnu-gcc
-- Check for working C compiler: /usr/lib/ccache/bin/x86_64-pc-linux-gnu-gcc -- works
-- Detecting C compiler ABI info
-- Detecting C compiler ABI info - done
-- Check for working CXX compiler: /usr/lib/ccache/bin/x86_64-pc-linux-gnu-g++
-- Check for working CXX compiler: /usr/lib/ccache/bin/x86_64-pc-linux-gnu-g++ -- works
-- Detecting CXX compiler ABI info
-- Detecting CXX compiler ABI info - done
-- Looking for Q_WS_X11
-- Looking for Q_WS_X11 - found
-- Looking for Q_WS_WIN
-- Looking for Q_WS_WIN - not found.
-- Looking for Q_WS_QWS
-- Looking for Q_WS_QWS - not found.
-- Looking for Q_WS_MAC
-- Looking for Q_WS_MAC - not found.
-- Found Qt-Version 4.4.2 (using /usr/bin/qmake)
-- Looking for XOpenDisplay in /usr/lib64/libX11.so;/usr/lib64/libXext.so;/usr/lib64/libXft.so;/usr/lib64/libXau.so;/usr/lib64/libXdmcp.so;/usr/lib64/libXpm.so
-- Looking for XOpenDisplay in /usr/lib64/libX11.so;/usr/lib64/libXext.so;/usr/lib64/libXft.so;/usr/lib64/libXau.so;/usr/lib64/libXdmcp.so;/usr/lib64/libXpm.so - found
-- Looking for gethostbyname
-- Looking for gethostbyname - found
-- Looking for connect
-- Looking for connect - found
-- Looking for remove
-- Looking for remove - found
-- Looking for shmat
-- Looking for shmat - found
-- Looking for IceConnectionNumber in ICE
-- Looking for IceConnectionNumber in ICE - found
-- Found X11: /usr/lib64/libX11.so
-- Looking for include files CMAKE_HAVE_PTHREAD_H
-- Looking for include files CMAKE_HAVE_PTHREAD_H - found
-- Looking for pthread_create in pthreads
-- Looking for pthread_create in pthreads - not found
-- Looking for pthread_create in pthread
-- Looking for pthread_create in pthread - found
-- Found Threads: TRUE
-- Found Perl: /usr/bin/perl
-- Performing Test _OFFT_IS_64BIT
-- Performing Test _OFFT_IS_64BIT - Success
-- Performing Test HAVE_FPIE_SUPPORT
-- Performing Test HAVE_FPIE_SUPPORT - Success
-- Performing Test __KDE_HAVE_W_OVERLOADED_VIRTUAL
-- Performing Test __KDE_HAVE_W_OVERLOADED_VIRTUAL - Success
-- Performing Test __KDE_HAVE_GCC_VISIBILITY
-- Performing Test __KDE_HAVE_GCC_VISIBILITY - Success
-- Phonon Version:
-- Found Phonon: /usr/lib64/libphonon.so
-- Found Phonon Includes: /usr/include/KDE;/usr/include
-- Found KDE 4.2 include dir: /usr/kde/4.2/include
-- Found KDE 4.2 library dir: /usr/kde/4.2/lib64
-- Found the KDE4 kconfig_compiler preprocessor: /usr/kde/4.2/bin/kconfig_compiler
-- Found automoc4: /usr/bin/automoc4
-- Found KDE PIM libraries
-- Boost version: 1.35.0
-- Found the following Boost libraries:
-- Found Akonadi: /usr/lib64/libakonadiprotocolinternals.so
-- Found Akonadi includes: /usr/include
-- Found Akonadi common libraries: /usr/lib64/libakonadiprotocolinternals.so
-- Found Akonadi dbus-interfaces: /usr/share/dbus-1/interfaces
-- Found ZLIB: /lib64/libz.so
-- checking for module 'libstreamanalyzer>=0.5.9'
-- found libstreamanalyzer, version 0.6.0
-- Found Strigi: /usr/lib64/libstreams.so
-- Performing Test STRIGI_NEEDS_SIGNED_CHAR
-- Performing Test STRIGI_NEEDS_SIGNED_CHAR - Success
-- Performing Test STRIGI_NEEDS_CHAR
-- Performing Test STRIGI_NEEDS_CHAR - Failed
-- Strigi API needs 'signed char'
-- Found gpgme-config at /usr/bin/gpgme-config
-- Found gpgme v1.1.6, checking for flavours...
-- Found flavour 'vanilla', checking whether it's usable...yes
-- Found flavour 'pthread', checking whether it's usable...yes
-- Usable gpgme flavours found: vanilla pthread
-- Found qgpgme: libraries: qgpgme;gpgme++-pthread;/usr/lib64/libgpgme-pthread.so;/usr/lib64/libpthread.so;/usr/lib64/libgpg-error.so
-- checking for one of the modules 'libopensync;>=0.38'
-- WARNING: you are using the obsolete 'PKGCONFIG' macro use FindPkgConfig
-- Found GLIB2: /usr/lib64/libglib-2.0.so
-- Could NOT find GNOKII (missing: GNOKII_INCLUDE_DIR GNOKII_LIBRARIES)
-- Found Soprano: /usr/lib64/libsoprano.so
-- Found Soprano includes: /usr/include
-- Found Soprano Index: /usr/lib64/libsopranoindex.so
-- Found Soprano Client: /usr/lib64/libsopranoclient.so
-- Found Soprano Plugins: nquadparser nquadserializer sesame2backend
-- Found NEPOMUK: /usr/kde/4.2/lib64/libnepomuk.so
-- Found libassuan-config at /usr/bin/libassuan-config
-- Found assuan v1.0.5, checking for flavours...
-- Found flavour 'vanilla', checking whether it's usable...yes
-- Found flavour 'pthread', checking whether it's usable...yes
-- Found flavour 'pth', checking whether it's usable...yes
-- Usable assuan flavours found: vanilla pthread pth
-- Performing Test HAVE_ASSUAN_FD_T
-- Performing Test HAVE_ASSUAN_FD_T - Success
-- Looking for assuan_inquire_ext
-- Looking for assuan_inquire_ext - found
-- Performing Test HAVE_NEW_STYLE_ASSUAN_INQUIRE_EXT
-- Performing Test HAVE_NEW_STYLE_ASSUAN_INQUIRE_EXT - Success
-- Performing Test HAVE_GPG_ERR_SOURCE_KLEO
-- Performing Test HAVE_GPG_ERR_SOURCE_KLEO - Success
-- Performing Test HAVE_ASSUAN_SOCK_GET_NONCE
terminate called after throwing an instance of 'std::out_of_range'
what(): basic_string::erase
/var/tmp/portage/kde-base/libksieve-4.1.80/temp/environment: line 877: 2590 Аварийный останов cmake -C "${TMPDIR}/gentoo_common_config.cmake" ${cmakeargs} "${S}"
*
* ERROR: kde-base/libksieve-4.1.80 failed.
* Call stack:
* ebuild.sh, line 49: Called src_configure
* environment, line 3572: Called kde4-meta_src_configure
* environment, line 2737: Called kde4-base_src_configure
* environment, line 2449: Called cmake-utils_src_configure
* environment, line 865: Called cmake-utils_src_configureout
* environment, line 884: Called die
* The specific snippet of code:
* cmake -C "${TMPDIR}/gentoo_common_config.cmake" ${cmakeargs} "${S}" || die "Cmake failed";
* The die message:
* Cmake failed


emerge --info

Portage 2.2_rc16 (default/linux/amd64/2008.0, gcc-4.3.2, glibc-2.8_p20080602-r0, 2.6.27-gentoo-r4-utf8 x86_64)
=================================================================
System uname: Linux-2.6.27-gentoo-r4-utf8-x86_64-Intel-R-_Core-TM-2_Duo_CPU_E4400_@_2.00GHz-with-glibc2.2.5
Timestamp of tree: Fri, 28 Nov 2008 07:07:01 +0000
ccache version 2.4 [enabled]
app-shells/bash: 3.2_p48
dev-java/java-config: 1.3.7-r1, 2.1.6-r1
dev-lang/python: 2.5.2-r8
dev-util/ccache: 2.4-r8
dev-util/cmake: 2.6.2
sys-apps/baselayout: 2.0.0
sys-apps/openrc: 0.3.0-r1
sys-apps/sandbox: 1.2.18.1-r3
sys-devel/autoconf: 2.13, 2.63
sys-devel/automake: 1.5, 1.7.9-r1, 1.9.6-r2, 1.10.2
sys-devel/binutils: 2.19
sys-devel/gcc-config: 1.4.0-r4
sys-devel/libtool: 2.2.6a
virtual/os-headers: 2.6.27-r2
ACCEPT_KEYWORDS="amd64 ~amd64"
CBUILD="x86_64-pc-linux-gnu"
CFLAGS="-O2 -march=nocona -pipe"
CHOST="x86_64-pc-linux-gnu"
CONFIG_PROTECT="/etc /usr/kde/3.5/env /usr/kde/3.5/share/config /usr/kde/3.5/shutdown /usr/kde/4.2/env /usr/kde/4.2/share/config /usr/kde/4.2/shutdown /usr/share/config"
CONFIG_PROTECT_MASK="/etc/ca-certificates.conf /etc/env.d /etc/env.d/java/ /etc/fonts/fonts.conf /etc/gconf /etc/gentoo-release /etc/revdep-rebuild /etc/splash /etc/terminfo /etc/udev/rules.d"
CXXFLAGS="-O2 -march=nocona -pipe"
DISTDIR="/usr/portage/distfiles"
FEATURES="ccache distlocks parallel-fetch preserve-libs protect-owned sandbox sfperms strict unmerge-orphans userfetch"
GENTOO_MIRRORS="http://distfiles.gentoo.org ftp://pandemonium.tiscali.de/pub/gentoo http://gentoo.mirrors.tera-byte.com"
LANG="ru_RU.UTF-8"
LC_ALL=""
LDFLAGS="-Wl,-O1"
LINGUAS="ru"
MAKEOPTS="-j3"
PKGDIR="/usr/portage/packages"
PORTAGE_RSYNC_OPTS="--recursive --links --safe-links --perms --times --compress --force --whole-file--delete --stats --timeout=180 --exclude=/distfiles --exclude=/local --exclude=/packages"
PORTAGE_TMPDIR="/var/tmp"
PORTDIR="/usr/portage"
PORTDIR_OVERLAY="/usr/local/portage/layman/kde-crazy"
SYNC="rsync://rsync.gentoo.org/gentoo-portage"
USE="X accessibility acl alsa amd64 audacious bash-completion bzip2 cairo cdr cli cracklib crypt cups dbus dlloader dri dts dvd esd gdbm gif glitz gpm gtk hal iconv isdnlog javascript jpeg jpeg2k kde kdeprefix lm_sensors mad midi mmx mmxext mp3 mudflap multilib ncurses nls nptl nptlonly opengl openmp oss pam pcre pdf perl png pppd python qt3 qt3support qt4 rdesktop readline reflection rtc samba session spl sqlite sse sse2 ssl ssse3 svg sysfs tcl tcpd tiff tk truetype unicode vim-syntax vorbis wmp xcomposite xorg xv xvid zlib" ALSA_CARDS="hda-intel" ALSA_PCM_PLUGINS="adpcm alaw asym copy dmix dsharedsnoop empty extplug file hooks iec958 ioplug ladspa lfloat linear meter mmap_emul mulaw multi null plug rate route share shm softvol" APACHE2_MODULES="actions alias auth_basic authn_alias authn_anon authn_dbm authn_default authn_file authz_dbm authz_default authz_groupfile authz_host authz_owner authz_user autoindex cache dav dav_fs dav_lock deflate dir disk_cache env expires ext_filter file_cache filter headers include info log_config logio mem_cache mime mime_magic negotiation rewrite setenvif speling status unique_id userdir usertrack vhost_alias" ELIBC="glibc" INPUT_DEVICES="keyboard mouse" KERNEL="linux" LCD_DEVICES="bayrad cfontz cfontz633 glk hd44780 lb216 lcdm001 mtxorb ncurses text" LINGUAS="ru" USERLAND="GNU" VIDEO_CARDS="nvidia"
Unset: CPPFLAGS, CTARGET, EMERGE_DEFAULT_OPTS, FFLAGS, INSTALL_MASK, PORTAGE_COMPRESS, PORTAGE_COMPRESS_FLAGS, PORTAGE_RSYNC_EXTRA_OPTS
Back to top
View user's profile Send private message
l3u
Advocate
Advocate


Joined: 26 Jan 2005
Posts: 2322
Location: Konradsreuth (Germany)

PostPosted: Fri Nov 28, 2008 5:37 pm    Post subject: Reply with quote

Hi :-)
kde-base/pykde4-4.1.80 fails here with:
Code:
[  1%] Built target compile_python_files
[  2%] Generating sip/dnssd/sipdnssdpart0.cpp, sip/dnssd/sipdnssdpart1.cpp, sip/dnssd/sipdnssdpart2.cpp, sip/dnssd/sipdnssdpart3.cpp, sip/dnssd/sipdnssdpart4.cpp, sip/dnssd/sipdnssdpart5.cpp, sip/dnssd/sipdnssdpart6.cpp, sip/dnssd/sipdnssdpart7.cpp

sip: /usr/share/sip/qt/versions.sip:34: Version is already defined
make[2]: *** [python/pykde4/sip/dnssd/sipdnssdpart0.cpp] Fehler 1
make[1]: *** [python/pykde4/CMakeFiles/python_module_PyKDE4_dnssd.dir/all] Fehler 2
make[1]: *** Warte auf noch nicht beendete Prozesse...
sip: /usr/share/sip/qt/versions.sip:34: Version is already defined
make[2]: *** [python/pykde4/sip/akonadi/sipakonadipart0.cpp] Fehler 1
make[1]: *** [python/pykde4/CMakeFiles/python_module_PyKDE4_akonadi.dir/all] Fehler 2
make: *** [all] Fehler 2
 *
 * ERROR: kde-base/pykde4-4.1.80 failed.
 * Call stack:
 *               ebuild.sh, line   49:  Called src_compile
 *             environment, line 3501:  Called kde4-meta_src_compile
 *             environment, line 2674:  Called kde4-meta_src_make
 *             environment, line 2767:  Called kde4-base_src_make
 *             environment, line 2405:  Called cmake-utils_src_make
 *             environment, line  887:  Called die
 * The specific snippet of code:
 *           emake "$@" || die "Make failed!";
 *  The die message:
 *   Make failed!

Any ideas?
Back to top
View user's profile Send private message
aTan
Tux's lil' helper
Tux's lil' helper


Joined: 06 Jan 2007
Posts: 134
Location: Czech Republic (Ukraine)

PostPosted: Fri Nov 28, 2008 5:59 pm    Post subject: Reply with quote

kde-base/kde-l10n-4.1.80 for "cs ru"

Code:
Scanning dependencies of target autostart-handbook
[ 90%] Generating index.cache.bz2
index.docbook:81: parser error : Entity 'systemsettings' not defined
> в &systemsettings; и установить папку, отличную от
                     ^
make[2]: *** [kde-l10n-ru-4.1.80/docs/kdebase-workspace/kcontrol/autostart/index.cache.bz2] Error 1
make[1]: *** [kde-l10n-ru-4.1.80/docs/kdebase-workspace/kcontrol/autostart/CMakeFiles/autostart-handbook.dir/all] Error 2
make: *** [all] Error 2
Back to top
View user's profile Send private message
marcus84
Tux's lil' helper
Tux's lil' helper


Joined: 23 Apr 2008
Posts: 87

PostPosted: Fri Nov 28, 2008 9:08 pm    Post subject: Reply with quote

anybody has compiled koffice beta2 (1.9.98.2)?

I get an error compiling Kchart

Code:

Linking CXX shared library ../../lib/libchartshapelib.so                                                         
CMakeFiles/chartshapelib.dir/Axis.o: In function `KChart::Axis::saveOdfGrid(KoShapeSavingContext&, KChart::OdfGridClass)':                                                                                                         
Axis.cpp:(.text+0x2c01): undefined reference to `KoGenStyle::KoGenStyle(KoGenStyle::Type, char const*, QString const&)'                                                                                                             
Axis.cpp:(.text+0x2ccd): undefined reference to `KoGenStyles::lookup(KoGenStyle const&, QString const&, int)'     
Axis.cpp:(.text+0x2d51): undefined reference to `KoGenStyle::~KoGenStyle()'                                       
CMakeFiles/chartshapelib.dir/Axis.o: In function `KChart::Axis::saveOdf(KoShapeSavingContext&)':                 
Axis.cpp:(.text+0x4100): undefined reference to `KoGenStyle::KoGenStyle(KoGenStyle::Type, char const*, QString const&)'                                                                                                             
Axis.cpp:(.text+0x4200): undefined reference to `KoGenStyles::lookup(KoGenStyle const&, QString const&, int)'     
Axis.cpp:(.text+0x45fb): undefined reference to `KoGenStyle::~KoGenStyle()'                                       
CMakeFiles/chartshapelib.dir/Axis.o: In function `KChart::Axis::loadOdf(KoXmlElement const&, KoShapeLoadingContext&)':                                                                                                             
Axis.cpp:(.text+0x499c): undefined reference to `KoStyleStack::save()'       
Back to top
View user's profile Send private message
Benni123
Tux's lil' helper
Tux's lil' helper


Joined: 13 Mar 2005
Posts: 110

PostPosted: Fri Nov 28, 2008 9:55 pm    Post subject: Reply with quote

there are some faulty digests:

Quote:
Calculating dependencies - * Digest verification failed:
* /usr/portage/local/layman/kde-crazy/kde-base/kdesdk-strigi-analyzer/kdesdk-strigi-analyzer-4.1.80.ebuild
* Reason: Filesize does not match recorded size
* Got: 447
* Expected: 459
... done!


k3b and kdevelop still depend on 9999 live ebuild versions of kde4.2....

emerge nepomuk fails:
Quote:
-- Configuring done
-- Generating done
-- Build files have been written to: /var/tmp/portage/kde-base/nepomuk-4.1.80/work/nepomuk_build
>>> Source configured.
>>> Compiling source in /var/tmp/portage/kde-base/nepomuk-4.1.80/work/nepomuk-4.1.80 ...
make -j3
>>> Source compiled.
>>> Test phase [not enabled]: kde-base/nepomuk-4.1.80

>>> Install nepomuk-4.1.80 into /var/tmp/portage/kde-base/nepomuk-4.1.80/image/ category kde-base
make -j3 install DESTDIR=/var/tmp/portage/kde-base/nepomuk-4.1.80/image/
make: *** no rule to create »install«. Quit.
*
* ERROR: kde-base/nepomuk-4.1.80 failed.
* Call stack:


emerge akonadi fails:
Quote:
/var/tmp/portage/kde-base/akonadi-4.1.80/work/akonadi-4.1.80/akonadi/agents/mailthreader/mailthreaderagent.cpp:160: Warnung: unbenutzter Parameter »item«
/var/tmp/portage/kde-base/akonadi-4.1.80/work/akonadi-4.1.80/akonadi/agents/mailthreader/mailthreaderagent.cpp:358: Warnung: unbenutzter Parameter »ref«
[ 51%] Building CXX object akonadi/resources/distlist/CMakeFiles/akonadi_distlist_resource.dir/settingsadaptor.o
[ 51%] Building CXX object akonadi/resources/distlist/CMakeFiles/akonadi_distlist_resource.dir/akonadi_distlist_resource_automoc.o
[ 52%] Building CXX object akonadi/agents/mailthreader/CMakeFiles/akonadi_mailthreader_agent.dir/akonadi_mailthreader_agent_automoc.o
Linking CXX executable akonadi_mailthreader_agent
[ 52%] Built target akonadi_mailthreader_agent
Linking CXX executable akonadi_distlist_resource
[ 52%] Built target akonadi_distlist_resource
make: *** [all] Fehler 2
*
* ERROR: kde-base/akonadi-4.1.80 failed.
* Call stack:
* ebuild.sh, line 49: Called src_compile
* environment, line 3520: Called kde4-meta_src_compile
* environment, line 2687: Called kde4-meta_src_make
* environment, line 2780: Called kde4-base_src_make
* environment, line 2418: Called cmake-utils_src_make
* environment, line 897: Called die
* The specific snippet of code:
* emake "$@" || die "Make failed!";
* The die message:
* Make failed!


pkde4 still fails
Quote:


usr/include/python2.5/pyconfig.h:948:1: Warnung: »_XOPEN_SOURCE« redefiniert
<Kommandozeile>:1:1: Warnung: dies ist die Stelle der vorherigen Definition
[ 97%] Building CXX object python/pykde4/CMakeFiles/python_module_PyKDE4_soprano.dir/sip/soprano/sipsopranopart6.o
In Datei, eingefügt von /usr/include/python2.5/Python.h:13,
von /usr/include/python2.5/sip.h:28,
von /var/tmp/portage/kde-base/pykde4-4.1.80/work/pykde4_build/python/pykde4/sip/soprano/sipAPIsoprano.h:11,
von /var/tmp/portage/kde-base/pykde4-4.1.80/work/pykde4_build/python/pykde4/sip/soprano/sipsopranopart6.cpp:7:
/usr/include/python2.5/pyconfig.h:948:1: Warnung: »_XOPEN_SOURCE« redefiniert
<Kommandozeile>:1:1: Warnung: dies ist die Stelle der vorherigen Definition
[ 98%] Building CXX object python/pykde4/CMakeFiles/python_module_PyKDE4_soprano.dir/sip/soprano/sipsopranopart7.o
In Datei, eingefügt von /usr/include/python2.5/Python.h:13,
von /usr/include/python2.5/sip.h:28,
von /var/tmp/portage/kde-base/pykde4-4.1.80/work/pykde4_build/python/pykde4/sip/soprano/sipAPIsoprano.h:11,
von /var/tmp/portage/kde-base/pykde4-4.1.80/work/pykde4_build/python/pykde4/sip/soprano/sipsopranopart7.cpp:7:
/usr/include/python2.5/pyconfig.h:948:1: Warnung: »_XOPEN_SOURCE« redefiniert
<Kommandozeile>:1:1: Warnung: dies ist die Stelle der vorherigen Definition

Linking CXX shared library ../../lib/pykde/soprano.so
[ 98%] Built target python_module_PyKDE4_soprano
make: *** [all] error 2
*
* ERROR: kde-base/pykde4-4.1.80 failed.
* Call stack:
* ebuild.sh, line 49: Called src_compile
* environment, line 3512: Called kde4-meta_src_compile
* environment, line 2685: Called kde4-meta_src_make
* environment, line 2778: Called kde4-base_src_make
* environment, line 2
Back to top
View user's profile Send private message
Benni123
Tux's lil' helper
Tux's lil' helper


Joined: 13 Mar 2005
Posts: 110

PostPosted: Fri Nov 28, 2008 10:36 pm    Post subject: Reply with quote

By the way, Beta6 of Digikam came out recently!
Back to top
View user's profile Send private message
bers
n00b
n00b


Joined: 28 Nov 2008
Posts: 49

PostPosted: Sat Nov 29, 2008 9:40 am    Post subject: Reply with quote

[quote="bers"]Hi. Please help.

>>> Emerging (5 of 9) kde-base/libksieve-4.1.80
*********************************************
-- Performing Test HAVE_GPG_ERR_SOURCE_KLEO - Success
-- Performing Test HAVE_ASSUAN_SOCK_GET_NONCE
terminate called after throwing an instance of 'std::out_of_range'
what(): basic_string::erase
/var/tmp/portage/kde-base/libksieve-4.1.80/temp/environment: line 877: 2590 Аварийный останов cmake -C "${TMPDIR}/gentoo_common_config.cmake" ${cmakeargs} "${S}"
*
* ERROR: kde-base/libksieve-4.1.80 failed.
* Call stack:
* ebuild.sh, line 49: Called src_configure
* environment, line 3572: Called kde4-meta_src_configure
* environment, line 2737: Called kde4-base_src_configure
* environment, line 2449: Called cmake-utils_src_configure
* environment, line 865: Called cmake-utils_src_configureout
* environment, line 884: Called die
* The specific snippet of code:
* cmake -C "${TMPDIR}/gentoo_common_config.cmake" ${cmakeargs} "${S}" || die "Cmake failed";
* The die message:
* Cmake failed


;) Fixed
Back to top
View user's profile Send private message
Krog
Guru
Guru


Joined: 26 Jun 2007
Posts: 330
Location: Roma, Italy

PostPosted: Sat Nov 29, 2008 12:23 pm    Post subject: Reply with quote

Benni123 wrote:


pkde4 still fails
Quote:

...

Linking CXX shared library ../../lib/pykde/soprano.so
[ 98%] Built target python_module_PyKDE4_soprano
make: *** [all] error 2
*
* ERROR: kde-base/pykde4-4.1.80 failed.
* Call stack:
* ebuild.sh, line 49: Called src_compile
* environment, line 3512: Called kde4-meta_src_compile
* environment, line 2685: Called kde4-meta_src_make
* environment, line 2778: Called kde4-base_src_make
* environment, line 2



same here
Back to top
View user's profile Send private message
Krog
Guru
Guru


Joined: 26 Jun 2007
Posts: 330
Location: Roma, Italy

PostPosted: Sat Nov 29, 2008 7:15 pm    Post subject: akonadi? Reply with quote

after upgrading to 4.1.80 nepomuk is not functioning and i have often a window by akonadi giving me a lot of errors... the log is this:

[code:1:3f306d0eb2]Akonadi Server Self-Test Report
===============================

Test 1: SUCCESS
--------

Database driver found.
Details: The QtSQL driver 'QMYSQL' is required by your current Akonadi server configuration.
The following drivers are installed: QSQLITE, QMYSQL3, QMYSQL.
Make sure the required driver is installed.

File content of '/home/krog/.config/akonadi/akonadiserverrc':
[%General]
Driver=QMYSQL

[QMYSQL]
Name=akonadi
Options="UNIX_SOCKET=/home/krog/.local/share/akonadi/db_misc/mysql.socket"
Password=
User=
StartServer=true
ServerPath=/var/run/mysqld
Host=

[Debug]
Tracer=null


Test 2: SUCCESS
--------

MySQL server found.
Details: You currently have configured Akonadi to use the MySQL server '/var/run/mysqld'.
Make sure you have the MySQL server installed, set the correct path and ensure you have the necessary read and execution rights on the server executable. The server executable is typically called 'mysqld', its locations varies depending on the distribution.

Test 3: ERROR
--------

Executing the MySQL server failed.
Details: Executing the MySQL server '/var/run/mysqld' failed with the following error message: ''

Test 4: SUCCESS
--------

No current MySQL error log found.
Details: The MySQL server did not report any errors during this startup into '/home/krog/.local/share/akonadi/db_data/mysql.err'.

Test 5: SUCCESS
--------

MySQL server default configuration found.
Details: The default configuration for the MySQL server was found and is readable at <a href='/usr/share/config/akonadi/mysql-global.conf'>/usr/share/config/akonadi/mysql-global.conf</a>.

File content of '/usr/share/config/akonadi/mysql-global.conf':
#
# Global Akonadi MySQL server settings,
# These settings can be adjusted using $HOME/.config/akonadi/mysql-local.conf
#
# Based on advice by Kris Köhntopp <kris@mysql.com>
#
[mysqld]
skip_grant_tables
skip_networking

# strict query parsing/interpretation
# TODO: make Akonadi work with those settings enabled
#sql_mode=strict_trans_tables,strict_all_tables,strict_error_for_division_by_zero,no_auto_create_user,no_auto_value_on_zero,no_engine_substitution,no_zero_date,no_zero_in_date,only_full_group_by,pipes_as_concat
#sql_mode=strict_trans_tables

# use InnoDB for transactions and better crash recovery
default_storage_engine=innodb
# case-insensitive table names, avoids trouble on windows
lower_case_table_names=1
character_set_server=latin1
collation_server=latin1_general_ci
table_cache=200
thread_cache_size=3
log_bin=mysql-bin
expire_logs_days=3
#sync_bin_log=0
# error log file name, relative to datadir
log_error=mysql.err
log_warnings=2
# log all queries, useful for debugging but generates an enormous amount of data
#log=mysql.full
# log queries slower than n seconds, log file name relative to datadir
log_slow_queries=mysql.slow
long_query_time=1
# log queries not using indices, debug only, disable for production use
log_queries_not_using_indexes=1
# maximum blob size
max_allowed_packet=32M
max_connections=20
# makes sense when having the same query multiple times
# makes no sense with prepared statements and/or transactions
query_cache_type=0
query_cache_size=0

innodb_file_per_table=1
innodb_log_buffer_size=1M
innodb_additional_mem_pool_size=1M
# messure database size and adjust
# SELECT sum(data_length) as bla, sum(index_length) as blub FROM information_schema.tables WHERE table_schema not in ("mysql", "information_schema");
innodb_buffer_pool_size=80M
# size of average write burst, keep Innob_log_waits small, keep Innodb_buffer_pool_wait_free small (see show global status like "inno%", show global variables)
innodb_log_file_size=64M
innodb_flush_log_at_trx_commit=2



Test 6: SKIP
--------

MySQL server custom configuration not available.
Details: The custom configuration for the MySQL server was not found but is optional.

Test 7: SUCCESS
--------

MySQL server configuration is usable.
Details: The MySQL server configuration was found at <a href='/home/krog/.local/share/akonadi/mysql.conf'>/home/krog/.local/share/akonadi/mysql.conf</a> and is readable.

File content of '/home/krog/.local/share/akonadi/mysql.conf':
#
# Global Akonadi MySQL server settings,
# These settings can be adjusted using $HOME/.config/akonadi/mysql-local.conf
#
# Based on advice by Kris Köhntopp <kris@mysql.com>
#
[mysqld]
skip_grant_tables
skip_networking

# strict query parsing/interpretation
# TODO: make Akonadi work with those settings enabled
#sql_mode=strict_trans_tables,strict_all_tables,strict_error_for_division_by_zero,no_auto_create_user,no_auto_value_on_zero,no_engine_substitution,no_zero_date,no_zero_in_date,only_full_group_by,pipes_as_concat
#sql_mode=strict_trans_tables

# use InnoDB for transactions and better crash recovery
default_storage_engine=innodb
# case-insensitive table names, avoids trouble on windows
lower_case_table_names=1
character_set_server=latin1
collation_server=latin1_general_ci
table_cache=200
thread_cache_size=3
log_bin=mysql-bin
expire_logs_days=3
#sync_bin_log=0
# error log file name, relative to datadir
log_error=mysql.err
log_warnings=2
# log all queries, useful for debugging but generates an enormous amount of data
#log=mysql.full
# log queries slower than n seconds, log file name relative to datadir
log_slow_queries=mysql.slow
long_query_time=1
# log queries not using indices, debug only, disable for production use
log_queries_not_using_indexes=1
# maximum blob size
max_allowed_packet=32M
max_connections=20
# makes sense when having the same query multiple times
# makes no sense with prepared statements and/or transactions
query_cache_type=0
query_cache_size=0

innodb_file_per_table=1
innodb_log_buffer_size=1M
innodb_additional_mem_pool_size=1M
# messure database size and adjust
# SELECT sum(data_length) as bla, sum(index_length) as blub FROM information_schema.tables WHERE table_schema not in ("mysql", "information_schema");
innodb_buffer_pool_size=80M
# size of average write burst, keep Innob_log_waits small, keep Innodb_buffer_pool_wait_free small (see show global status like "inno%", show global variables)
innodb_log_file_size=64M
innodb_flush_log_at_trx_commit=2



Test 8: ERROR
--------

akonadictl found but not usable
Details: The program '/usr/bin/akonadictl' to control the Akonadi server was found but could not be executed successfully.
Result:
Akonadi Control: stopped
Akonadi Server: stopped

Make sure the Akonadi server is installed correctly.

Test 9: ERROR
--------

Akonadi control process not registered at D-Bus.
Details: The Akonadi control process is not registered at D-Bus which typically means it was not started or encountered a fatal error during startup.

Test 10: ERROR
--------

Akonadi server process not registered at D-Bus.
Details: The Akonadi server process is not registered at D-Bus which typically means it was not started or encountered a fatal error during startup.

Test 11: SKIP
--------

Protocol version check not possible.
Details: Without a connection to the server it is not possible to check if the protocol version meets the requirements.

Test 12: ERROR
--------

No resource agents found.
Details: No resource agents have been found, Akonadi is not usable without at least one. This usually means that no resource agents are installed or that there is a setup problem. The following paths have been searched: '/usr/share/akonadi/agents /usr/share/akonadi/agents'. The XDG_DATA_DIRS environment variable is set to '/usr/share:/usr/share', make sure this includes all paths where Akonadi agents are installed to.

Directory listing of '/usr/share/akonadi/agents':
distlistresource.desktop
icalresource.desktop
imaplibresource.desktop
kabcresource.desktop
kcalresource.desktop
knutresource.desktop
localbookmarksresource.desktop
maildirresource.desktop
mailthreaderagent.desktop
nepomukcontactfeeder.desktop
nepomukemailfeeder.desktop
nepomuktagresource.desktop
nntpresource.desktop
strigifeeder.desktop
vcarddirresource.desktop
vcardresource.desktop
Directory listing of '/usr/share/akonadi/agents':
distlistresource.desktop
icalresource.desktop
imaplibresource.desktop
kabcresource.desktop
kcalresource.desktop
knutresource.desktop
localbookmarksresource.desktop
maildirresource.desktop
mailthreaderagent.desktop
nepomukcontactfeeder.desktop
nepomukemailfeeder.desktop
nepomuktagresource.desktop
nntpresource.desktop
strigifeeder.desktop
vcarddirresource.desktop
vcardresource.desktop

Environment variable XDG_DATA_DIRS is set to '/usr/share:/usr/share'

Test 13: ERROR
--------

Current Akonadi server error log found.
Details: The Akonadi server did report error during startup into <a href='/home/krog/.local/share/akonadi/akonadiserver.error'>/home/krog/.local/share/akonadi/akonadiserver.error</a>.

File content of '/home/krog/.local/share/akonadi/akonadiserver.error':
Could not start database server!
executable: "/var/run/mysqld"
arguments: ("--defaults-file=/home/krog/.local/share/akonadi//mysql.conf", "--datadir=/home/krog/.local/share/akonadi/db_data/", "--socket=/home/krog/.local/share/akonadi/db_misc/mysql.socket")
process error: "Unknown error"
"[
0: akonadiserver(_Z10kBacktracev+0x37) [0x403947]
1: akonadiserver [0x403ea8]
2: /lib/libc.so.6 [0x7f1163fa1430]
3: /lib/libc.so.6(gsignal+0x35) [0x7f1163fa13c5]
4: /lib/libc.so.6(abort+0x10e) [0x7f1163fa273e]
5: /usr/lib64/qt4/libQtCore.so.4(_Z17qt_message_output9QtMsgTypePKc+0x75) [0x7f1164f18c85]
6: akonadiserver(_ZN15FileDebugStream9writeDataEPKcx+0xa8) [0x404b08]
7: /usr/lib64/qt4/libQtCore.so.4(_ZN9QIODevice5writeEPKcx+0x79) [0x7f1164f9e399]
8: /usr/lib64/qt4/libQtCore.so.4 [0x7f1164fa80fe]
9: /usr/lib64/qt4/libQtCore.so.4(_ZN11QTextStreamD1Ev+0x68) [0x7f1164fa8448]
10: /usr/lib/libakonadiprivate.so.1(_ZN6QDebugD1Ev+0x41) [0x7f1165cc8a81]
11: /usr/lib/libakonadiprivate.so.1(_ZN7Akonadi13AkonadiServer20startDatabaseProcessEv+0x12c4) [0x7f1165cc2694]
12: /usr/lib/libakonadiprivate.so.1(_ZN7Akonadi13AkonadiServerC1EP7QObject+0x6c) [0x7f1165cc728c]
13: /usr/lib/libakonadiprivate.so.1(_ZN7Akonadi13AkonadiServer8instanceEv+0x47) [0x7f1165cc8897]
14: akonadiserver(main+0x6a) [0x40357a]
15: /lib/libc.so.6(__libc_start_main+0xf4) [0x7f1163f8eb74]
16: akonadiserver(_ZNK9QIODevice5atEndEv+0x41) [0x403449]
]
"
Could not start database server!
executable: "/var/run/mysqld"
arguments: ("--defaults-file=/home/krog/.local/share/akonadi//mysql.conf", "--datadir=/home/krog/.local/share/akonadi/db_data/", "--socket=/home/krog/.local/share/akonadi/db_misc/mysql.socket")
process error: "Unknown error"
"[
0: akonadiserver(_Z10kBacktracev+0x37) [0x403947]
1: akonadiserver [0x403ea8]
2: /lib/libc.so.6 [0x7f0fed90b430]
3: /lib/libc.so.6(gsignal+0x35) [0x7f0fed90b3c5]
4: /lib/libc.so.6(abort+0x10e) [0x7f0fed90c73e]
5: /usr/lib64/qt4/libQtCore.so.4(_Z17qt_message_output9QtMsgTypePKc+0x75) [0x7f0fee882c85]
6: akonadiserver(_ZN15FileDebugStream9writeDataEPKcx+0xa8) [0x404b08]
7: /usr/lib64/qt4/libQtCore.so.4(_ZN9QIODevice5writeEPKcx+0x79) [0x7f0fee908399]
8: /usr/lib64/qt4/libQtCore.so.4 [0x7f0fee9120fe]
9: /usr/lib64/qt4/libQtCore.so.4(_ZN11QTextStreamD1Ev+0x68) [0x7f0fee912448]
10: /usr/lib/libakonadiprivate.so.1(_ZN6QDebugD1Ev+0x41) [0x7f0fef632a81]
11: /usr/lib/libakonadiprivate.so.1(_ZN7Akonadi13AkonadiServer20startDatabaseProcessEv+0x12c4) [0x7f0fef62c694]
12: /usr/lib/libakonadiprivate.so.1(_ZN7Akonadi13AkonadiServerC1EP7QObject+0x6c) [0x7f0fef63128c]
13: /usr/lib/libakonadiprivate.so.1(_ZN7Akonadi13AkonadiServer8instanceEv+0x47) [0x7f0fef632897]
14: akonadiserver(main+0x6a) [0x40357a]
15: /lib/libc.so.6(__libc_start_main+0xf4) [0x7f0fed8f8b74]
16: akonadiserver(_ZNK9QIODevice5atEndEv+0x41) [0x403449]
]
"
Could not start database server!
executable: "/var/run/mysqld"
arguments: ("--defaults-file=/home/krog/.local/share/akonadi//mysql.conf", "--datadir=/home/krog/.local/share/akonadi/db_data/", "--socket=/home/krog/.local/share/akonadi/db_misc/mysql.socket")
process error: "Unknown error"
"[
0: akonadiserver(_Z10kBacktracev+0x37) [0x403947]
1: akonadiserver [0x403ea8]
2: /lib/libc.so.6 [0x7ffc0e412430]
3: /lib/libc.so.6(gsignal+0x35) [0x7ffc0e4123c5]
4: /lib/libc.so.6(abort+0x10e) [0x7ffc0e41373e]
5: /usr/lib64/qt4/libQtCore.so.4(_Z17qt_message_output9QtMsgTypePKc+0x75) [0x7ffc0f389c85]
6: akonadiserver(_ZN15FileDebugStream9writeDataEPKcx+0xa8) [0x404b08]
7: /usr/lib64/qt4/libQtCore.so.4(_ZN9QIODevice5writeEPKcx+0x79) [0x7ffc0f40f399]
8: /usr/lib64/qt4/libQtCore.so.4 [0x7ffc0f4190fe]
9: /usr/lib64/qt4/libQtCore.so.4(_ZN11QTextStreamD1Ev+0x68) [0x7ffc0f419448]
10: /usr/lib/libakonadiprivate.so.1(_ZN6QDebugD1Ev+0x41) [0x7ffc10139a81]
11: /usr/lib/libakonadiprivate.so.1(_ZN7Akonadi13AkonadiServer20startDatabaseProcessEv+0x12c4) [0x7ffc10133694]
12: /usr/lib/libakonadiprivate.so.1(_ZN7Akonadi13AkonadiServerC1EP7QObject+0x6c) [0x7ffc1013828c]
13: /usr/lib/libakonadiprivate.so.1(_ZN7Akonadi13AkonadiServer8instanceEv+0x47) [0x7ffc10139897]
14: akonadiserver(main+0x6a) [0x40357a]
15: /lib/libc.so.6(__libc_start_main+0xf4) [0x7ffc0e3ffb74]
16: akonadiserver(_ZNK9QIODevice5atEndEv+0x41) [0x403449]
]
"
Could not start database server!
executable: "/var/run/mysqld"
arguments: ("--defaults-file=/home/krog/.local/share/akonadi//mysql.conf", "--datadir=/home/krog/.local/share/akonadi/db_data/", "--socket=/home/krog/.local/share/akonadi/db_misc/mysql.socket")
process error: "Unknown error"
"[
0: akonadiserver(_Z10kBacktracev+0x37) [0x403947]
1: akonadiserver [0x403ea8]
2: /lib/libc.so.6 [0x7fade7e60430]
3: /lib/libc.so.6(gsignal+0x35) [0x7fade7e603c5]
4: /lib/libc.so.6(abort+0x10e) [0x7fade7e6173e]
5: /usr/lib64/qt4/libQtCore.so.4(_Z17qt_message_output9QtMsgTypePKc+0x75) [0x7fade8dd7c85]
6: akonadiserver(_ZN15FileDebugStream9writeDataEPKcx+0xa8) [0x404b08]
7: /usr/lib64/qt4/libQtCore.so.4(_ZN9QIODevice5writeEPKcx+0x79) [0x7fade8e5d399]
8: /usr/lib64/qt4/libQtCore.so.4 [0x7fade8e670fe]
9: /usr/lib64/qt4/libQtCore.so.4(_ZN11QTextStreamD1Ev+0x68) [0x7fade8e67448]
10: /usr/lib/libakonadiprivate.so.1(_ZN6QDebugD1Ev+0x41) [0x7fade9b87a81]
11: /usr/lib/libakonadiprivate.so.1(_ZN7Akonadi13AkonadiServer20startDatabaseProcessEv+0x12c4) [0x7fade9b81694]
12: /usr/lib/libakonadiprivate.so.1(_ZN7Akonadi13AkonadiServerC1EP7QObject+0x6c) [0x7fade9b8628c]
13: /usr/lib/libakonadiprivate.so.1(_ZN7Akonadi13AkonadiServer8instanceEv+0x47) [0x7fade9b87897]
14: akonadiserver(main+0x6a) [0x40357a]
15: /lib/libc.so.6(__libc_start_main+0xf4) [0x7fade7e4db74]
16: akonadiserver(_ZNK9QIODevice5atEndEv+0x41) [0x403449]
]
"
Could not start database server!
executable: "/var/run/mysqld"
arguments: ("--defaults-file=/home/krog/.local/share/akonadi//mysql.conf", "--datadir=/home/krog/.local/share/akonadi/db_data/", "--socket=/home/krog/.local/share/akonadi/db_misc/mysql.socket")
process error: "Unknown error"
"[
0: akonadiserver(_Z10kBacktracev+0x37) [0x403947]
1: akonadiserver [0x403ea8]
2: /lib/libc.so.6 [0x7f80cf01d430]
3: /lib/libc.so.6(gsignal+0x35) [0x7f80cf01d3c5]
4: /lib/libc.so.6(abort+0x10e) [0x7f80cf01e73e]
5: /usr/lib64/qt4/libQtCore.so.4(_Z17qt_message_output9QtMsgTypePKc+0x75) [0x7f80cff94c85]
6: akonadiserver(_ZN15FileDebugStream9writeDataEPKcx+0xa8) [0x404b08]
7: /usr/lib64/qt4/libQtCore.so.4(_ZN9QIODevice5writeEPKcx+0x79) [0x7f80d001a399]
8: /usr/lib64/qt4/libQtCore.so.4 [0x7f80d00240fe]
9: /usr/lib64/qt4/libQtCore.so.4(_ZN11QTextStreamD1Ev+0x68) [0x7f80d0024448]
10: /usr/lib/libakonadiprivate.so.1(_ZN6QDebugD1Ev+0x41) [0x7f80d0d44a81]
11: /usr/lib/libakonadiprivate.so.1(_ZN7Akonadi13AkonadiServer20startDatabaseProcessEv+0x12c4) [0x7f80d0d3e694]
12: /usr/lib/libakonadiprivate.so.1(_ZN7Akonadi13AkonadiServerC1EP7QObject+0x6c) [0x7f80d0d4328c]
13: /usr/lib/libakonadiprivate.so.1(_ZN7Akonadi13AkonadiServer8instanceEv+0x47) [0x7f80d0d44897]
14: akonadiserver(main+0x6a) [0x40357a]
15: /lib/libc.so.6(__libc_start_main+0xf4) [0x7f80cf00ab74]
16: akonadiserver(_ZNK9QIODevice5atEndEv+0x41) [0x403449]
]
"
Could not start database server!
executable: "/var/run/mysqld"
arguments: ("--defaults-file=/home/krog/.local/share/akonadi//mysql.conf", "--datadir=/home/krog/.local/share/akonadi/db_data/", "--socket=/home/krog/.local/share/akonadi/db_misc/mysql.socket")
process error: "Unknown error"
"[
0: akonadiserver(_Z10kBacktracev+0x37) [0x403947]
1: akonadiserver [0x403ea8]
2: /lib/libc.so.6 [0x7f607833c430]
3: /lib/libc.so.6(gsignal+0x35) [0x7f607833c3c5]
4: /lib/libc.so.6(abort+0x10e) [0x7f607833d73e]
5: /usr/lib64/qt4/libQtCore.so.4(_Z17qt_message_output9QtMsgTypePKc+0x75) [0x7f60792b3c85]
6: akonadiserver(_ZN15FileDebugStream9writeDataEPKcx+0xa8) [0x404b08]
7: /usr/lib64/qt4/libQtCore.so.4(_ZN9QIODevice5writeEPKcx+0x79) [0x7f6079339399]
8: /usr/lib64/qt4/libQtCore.so.4 [0x7f60793430fe]
9: /usr/lib64/qt4/libQtCore.so.4(_ZN11QTextStreamD1Ev+0x68) [0x7f6079343448]
10: /usr/lib/libakonadiprivate.so.1(_ZN6QDebugD1Ev+0x41) [0x7f607a063a81]
11: /usr/lib/libakonadiprivate.so.1(_ZN7Akonadi13AkonadiServer20startDatabaseProcessEv+0x12c4) [0x7f607a05d694]
12: /usr/lib/libakonadiprivate.so.1(_ZN7Akonadi13AkonadiServerC1EP7QObject+0x6c) [0x7f607a06228c]
13: /usr/lib/libakonadiprivate.so.1(_ZN7Akonadi13AkonadiServer8instanceEv+0x47) [0x7f607a063897]
14: akonadiserver(main+0x6a) [0x40357a]
15: /lib/libc.so.6(__libc_start_main+0xf4) [0x7f6078329b74]
16: akonadiserver(_ZNK9QIODevice5atEndEv+0x41) [0x403449]
]
"
Could not start database server!
executable: "/var/run/mysqld"
arguments: ("--defaults-file=/home/krog/.local/share/akonadi//mysql.conf", "--datadir=/home/krog/.local/share/akonadi/db_data/", "--socket=/home/krog/.local/share/akonadi/db_misc/mysql.socket")
process error: "Unknown error"
"[
0: akonadiserver(_Z10kBacktracev+0x37) [0x403947]
1: akonadiserver [0x403ea8]
2: /lib/libc.so.6 [0x7f41303d8430]
3: /lib/libc.so.6(gsignal+0x35) [0x7f41303d83c5]
4: /lib/libc.so.6(abort+0x10e) [0x7f41303d973e]
5: /usr/lib64/qt4/libQtCore.so.4(_Z17qt_message_output9QtMsgTypePKc+0x75) [0x7f413134fc85]
6: akonadiserver(_ZN15FileDebugStream9writeDataEPKcx+0xa8) [0x404b08]
7: /usr/lib64/qt4/libQtCore.so.4(_ZN9QIODevice5writeEPKcx+0x79) [0x7f41313d5399]
8: /usr/lib64/qt4/libQtCore.so.4 [0x7f41313df0fe]
9: /usr/lib64/qt4/libQtCore.so.4(_ZN11QTextStreamD1Ev+0x68) [0x7f41313df448]
10: /usr/lib/libakonadiprivate.so.1(_ZN6QDebugD1Ev+0x41) [0x7f41320ffa81]
11: /usr/lib/libakonadiprivate.so.1(_ZN7Akonadi13AkonadiServer20startDatabaseProcessEv+0x12c4) [0x7f41320f9694]
12: /usr/lib/libakonadiprivate.so.1(_ZN7Akonadi13AkonadiServerC1EP7QObject+0x6c) [0x7f41320fe28c]
13: /usr/lib/libakonadiprivate.so.1(_ZN7Akonadi13AkonadiServer8instanceEv+0x47) [0x7f41320ff897]
14: akonadiserver(main+0x6a) [0x40357a]
15: /lib/libc.so.6(__libc_start_main+0xf4) [0x7f41303c5b74]
16: akonadiserver(_ZNK9QIODevice5atEndEv+0x41) [0x403449]
]
"
Could not start database server!
executable: "/var/run/mysqld"
arguments: ("--defaults-file=/home/krog/.local/share/akonadi//mysql.conf", "--datadir=/home/krog/.local/share/akonadi/db_data/", "--socket=/home/krog/.local/share/akonadi/db_misc/mysql.socket")
process error: "Unknown error"
"[
0: akonadiserver(_Z10kBacktracev+0x37) [0x403947]
1: akonadiserver [0x403ea8]
2: /lib/libc.so.6 [0x7fa0a2700430]
3: /lib/libc.so.6(gsignal+0x35) [0x7fa0a27003c5]
4: /lib/libc.so.6(abort+0x10e) [0x7fa0a270173e]
5: /usr/lib64/qt4/libQtCore.so.4(_Z17qt_message_output9QtMsgTypePKc+0x75) [0x7fa0a3677c85]
6: akonadiserver(_ZN15FileDebugStream9writeDataEPKcx+0xa8) [0x404b08]
7: /usr/lib64/qt4/libQtCore.so.4(_ZN9QIODevice5writeEPKcx+0x79) [0x7fa0a36fd399]
8: /usr/lib64/qt4/libQtCore.so.4 [0x7fa0a37070fe]
9: /usr/lib64/qt4/libQtCore.so.4(_ZN11QTextStreamD1Ev+0x68) [0x7fa0a3707448]
10: /usr/lib/libakonadiprivate.so.1(_ZN6QDebugD1Ev+0x41) [0x7fa0a4427a81]
11: /usr/lib/libakonadiprivate.so.1(_ZN7Akonadi13AkonadiServer20startDatabaseProcessEv+0x12c4) [0x7fa0a4421694]
12: /usr/lib/libakonadiprivate.so.1(_ZN7Akonadi13AkonadiServerC1EP7QObject+0x6c) [0x7fa0a442628c]
13: /usr/lib/libakonadiprivate.so.1(_ZN7Akonadi13AkonadiServer8instanceEv+0x47) [0x7fa0a4427897]
14: akonadiserver(main+0x6a) [0x40357a]
15: /lib/libc.so.6(__libc_start_main+0xf4) [0x7fa0a26edb74]
16: akonadiserver(_ZNK9QIODevice5atEndEv+0x41) [0x403449]
]
"
Could not start database server!
executable: "/var/run/mysqld"
arguments: ("--defaults-file=/home/krog/.local/share/akonadi//mysql.conf", "--datadir=/home/krog/.local/share/akonadi/db_data/", "--socket=/home/krog/.local/share/akonadi/db_misc/mysql.socket")
process error: "Unknown error"
"[
0: akonadiserver(_Z10kBacktracev+0x37) [0x403947]
1: akonadiserver [0x403ea8]
2: /lib/libc.so.6 [0x7f904a59d430]
3: /lib/libc.so.6(gsignal+0x35) [0x7f904a59d3c5]
4: /lib/libc.so.6(abort+0x10e) [0x7f904a59e73e]
5: /usr/lib64/qt4/libQtCore.so.4(_Z17qt_message_output9QtMsgTypePKc+0x75) [0x7f904b514c85]
6: akonadiserver(_ZN15FileDebugStream9writeDataEPKcx+0xa8) [0x404b08]
7: /usr/lib64/qt4/libQtCore.so.4(_ZN9QIODevice5writeEPKcx+0x79) [0x7f904b59a399]
8: /usr/lib64/qt4/libQtCore.so.4 [0x7f904b5a40fe]
9: /usr/lib64/qt4/libQtCore.so.4(_ZN11QTextStreamD1Ev+0x68) [0x7f904b5a4448]
10: /usr/lib/libakonadiprivate.so.1(_ZN6QDebugD1Ev+0x41) [0x7f904c2c4a81]
11: /usr/lib/libakonadiprivate.so.1(_ZN7Akonadi13AkonadiServer20startDatabaseProcessEv+0x12c4) [0x7f904c2be694]
12: /usr/lib/libakonadiprivate.so.1(_ZN7Akonadi13AkonadiServerC1EP7QObject+0x6c) [0x7f904c2c328c]
13: /usr/lib/libakonadiprivate.so.1(_ZN7Akonadi13AkonadiServer8instanceEv+0x47) [0x7f904c2c4897]
14: akonadiserver(main+0x6a) [0x40357a]
15: /lib/libc.so.6(__libc_start_main+0xf4) [0x7f904a58ab74]
16: akonadiserver(_ZNK9QIODevice5atEndEv+0x41) [0x403449]
]
"
Could not start database server!
executable: "/var/run/mysqld"
arguments: ("--defaults-file=/home/krog/.local/share/akonadi//mysql.conf", "--datadir=/home/krog/.local/share/akonadi/db_data/", "--socket=/home/krog/.local/share/akonadi/db_misc/mysql.socket")
process error: "Unknown error"
"[
0: akonadiserver(_Z10kBacktracev+0x37) [0x403947]
1: akonadiserver [0x403ea8]
2: /lib/libc.so.6 [0x7fafe7f5f430]
3: /lib/libc.so.6(gsignal+0x35) [0x7fafe7f5f3c5]
4: /lib/libc.so.6(abort+0x10e) [0x7fafe7f6073e]
5: /usr/lib64/qt4/libQtCore.so.4(_Z17qt_message_output9QtMsgTypePKc+0x75) [0x7fafe8ed6c85]
6: akonadiserver(_ZN15FileDebugStream9writeDataEPKcx+0xa8) [0x404b08]
7: /usr/lib64/qt4/libQtCore.so.4(_ZN9QIODevice5writeEPKcx+0x79) [0x7fafe8f5c399]
8: /usr/lib64/qt4/libQtCore.so.4 [0x7fafe8f660fe]
9: /usr/lib64/qt4/libQtCore.so.4(_ZN11QTextStreamD1Ev+0x68) [0x7fafe8f66448]
10: /usr/lib/libakonadiprivate.so.1(_ZN6QDebugD1Ev+0x41) [0x7fafe9c86a81]
11: /usr/lib/libakonadiprivate.so.1(_ZN7Akonadi13AkonadiServer20startDatabaseProcessEv+0x12c4) [0x7fafe9c80694]
12: /usr/lib/libakonadiprivate.so.1(_ZN7Akonadi13AkonadiServerC1EP7QObject+0x6c) [0x7fafe9c8528c]
13: /usr/lib/libakonadiprivate.so.1(_ZN7Akonadi13AkonadiServer8instanceEv+0x47) [0x7fafe9c86897]
14: akonadiserver(main+0x6a) [0x40357a]
15: /lib/libc.so.6(__libc_start_main+0xf4) [0x7fafe7f4cb74]
16: akonadiserver(_ZNK9QIODevice5atEndEv+0x41) [0x403449]
]
"
Could not start database server!
executable: "/var/run/mysqld"
arguments: ("--defaults-file=/home/krog/.local/share/akonadi//mysql.conf", "--datadir=/home/krog/.local/share/akonadi/db_data/", "--socket=/home/krog/.local/share/akonadi/db_misc/mysql.socket")
process error: "Unknown error"
"[
0: akonadiserver(_Z10kBacktracev+0x37) [0x403947]
1: akonadiserver [0x403ea8]
2: /lib/libc.so.6 [0x7f809245b430]
3: /lib/libc.so.6(gsignal+0x35) [0x7f809245b3c5]
4: /lib/libc.so.6(abort+0x10e) [0x7f809245c73e]
5: /usr/lib64/qt4/libQtCore.so.4(_Z17qt_message_output9QtMsgTypePKc+0x75) [0x7f80933d2c85]
6: akonadiserver(_ZN15FileDebugStream9writeDataEPKcx+0xa8) [0x404b08]
7: /usr/lib64/qt4/libQtCore.so.4(_ZN9QIODevice5writeEPKcx+0x79) [0x7f8093458399]
8: /usr/lib64/qt4/libQtCore.so.4 [0x7f80934620fe]
9: /usr/lib64/qt4/libQtCore.so.4(_ZN11QTextStreamD1Ev+0x68) [0x7f8093462448]
10: /usr/lib/libakonadiprivate.so.1(_ZN6QDebugD1Ev+0x41) [0x7f8094182a81]
11: /usr/lib/libakonadiprivate.so.1(_ZN7Akonadi13AkonadiServer20startDatabaseProcessEv+0x12c4) [0x7f809417c694]
12: /usr/lib/libakonadiprivate.so.1(_ZN7Akonadi13AkonadiServerC1EP7QObject+0x6c) [0x7f809418128c]
13: /usr/lib/libakonadiprivate.so.1(_ZN7Akonadi13AkonadiServer8instanceEv+0x47) [0x7f8094182897]
14: akonadiserver(main+0x6a) [0x40357a]
15: /lib/libc.so.6(__libc_start_main+0xf4) [0x7f8092448b74]
16: akonadiserver(_ZNK9QIODevice5atEndEv+0x41) [0x403449]
]
"
Could not start database server!
executable: "/var/run/mysqld"
arguments: ("--defaults-file=/home/krog/.local/share/akonadi//mysql.conf", "--datadir=/home/krog/.local/share/akonadi/db_data/", "--socket=/home/krog/.local/share/akonadi/db_misc/mysql.socket")
process error: "Unknown error"
"[
0: akonadiserver(_Z10kBacktracev+0x37) [0x403947]
1: akonadiserver [0x403ea8]
2: /lib/libc.so.6 [0x7f73c64bb430]
3: /lib/libc.so.6(gsignal+0x35) [0x7f73c64bb3c5]
4: /lib/libc.so.6(abort+0x10e) [0x7f73c64bc73e]
5: /usr/lib64/qt4/libQtCore.so.4(_Z17qt_message_output9QtMsgTypePKc+0x75) [0x7f73c7432c85]
6: akonadiserver(_ZN15FileDebugStream9writeDataEPKcx+0xa8) [0x404b08]
7: /usr/lib64/qt4/libQtCore.so.4(_ZN9QIODevice5writeEPKcx+0x79) [0x7f73c74b8399]
8: /usr/lib64/qt4/libQtCore.so.4 [0x7f73c74c20fe]
9: /usr/lib64/qt4/libQtCore.so.4(_ZN11QTextStreamD1Ev+0x68) [0x7f73c74c2448]
10: /usr/lib/libakonadiprivate.so.1(_ZN6QDebugD1Ev+0x41) [0x7f73c81e2a81]
11: /usr/lib/libakonadiprivate.so.1(_ZN7Akonadi13AkonadiServer20startDatabaseProcessEv+0x12c4) [0x7f73c81dc694]
12: /usr/lib/libakonadiprivate.so.1(_ZN7Akonadi13AkonadiServerC1EP7QObject+0x6c) [0x7f73c81e128c]
13: /usr/lib/libakonadiprivate.so.1(_ZN7Akonadi13AkonadiServer8instanceEv+0x47) [0x7f73c81e2897]
14: akonadiserver(main+0x6a) [0x40357a]
15: /lib/libc.so.6(__libc_start_main+0xf4) [0x7f73c64a8b74]
16: akonadiserver(_ZNK9QIODevice5atEndEv+0x41) [0x403449]
]
"
Could not start database server!
executable: "/var/run/mysqld"
arguments: ("--defaults-file=/home/krog/.local/share/akonadi//mysql.conf", "--datadir=/home/krog/.local/share/akonadi/db_data/", "--socket=/home/krog/.local/share/akonadi/db_misc/mysql.socket")
process error: "Unknown error"
"[
0: akonadiserver(_Z10kBacktracev+0x37) [0x403947]
1: akonadiserver [0x403ea8]
2: /lib/libc.so.6 [0x7fdb336f4430]
3: /lib/libc.so.6(gsignal+0x35) [0x7fdb336f43c5]
4: /lib/libc.so.6(abort+0x10e) [0x7fdb336f573e]
5: /usr/lib64/qt4/libQtCore.so.4(_Z17qt_message_output9QtMsgTypePKc+0x75) [0x7fdb3466bc85]
6: akonadiserver(_ZN15FileDebugStream9writeDataEPKcx+0xa8) [0x404b08]
7: /usr/lib64/qt4/libQtCore.so.4(_ZN9QIODevice5writeEPKcx+0x79) [0x7fdb346f1399]
8: /usr/lib64/qt4/libQtCore.so.4 [0x7fdb346fb0fe]
9: /usr/lib64/qt4/libQtCore.so.4(_ZN11QTextStreamD1Ev+0x68) [0x7fdb346fb448]
10: /usr/lib/libakonadiprivate.so.1(_ZN6QDebugD1Ev+0x41) [0x7fdb3541ba81]
11: /usr/lib/libakonadiprivate.so.1(_ZN7Akonadi13AkonadiServer20startDatabaseProcessEv+0x12c4) [0x7fdb35415694]
12: /usr/lib/libakonadiprivate.so.1(_ZN7Akonadi13AkonadiServerC1EP7QObject+0x6c) [0x7fdb3541a28c]
13: /usr/lib/libakonadiprivate.so.1(_ZN7Akonadi13AkonadiServer8instanceEv+0x47) [0x7fdb3541b897]
14: akonadiserver(main+0x6a) [0x40357a]
15: /lib/libc.so.6(__libc_start_main+0xf4) [0x7fdb336e1b74]
16: akonadiserver(_ZNK9QIODevice5atEndEv+0x41) [0x403449]
]
"
Could not start database server!
executable: "/var/run/mysqld"
arguments: ("--defaults-file=/home/krog/.local/share/akonadi//mysql.conf", "--datadir=/home/krog/.local/share/akonadi/db_data/", "--socket=/home/krog/.local/share/akonadi/db_misc/mysql.socket")
process error: "Unknown error"
"[
0: akonadiserver(_Z10kBacktracev+0x37) [0x403947]
1: akonadiserver [0x403ea8]
2: /lib/libc.so.6 [0x7fb1ac6ea430]
3: /lib/libc.so.6(gsignal+0x35) [0x7fb1ac6ea3c5]
4: /lib/libc.so.6(abort+0x10e) [0x7fb1ac6eb73e]
5: /usr/lib64/qt4/libQtCore.so.4(_Z17qt_message_output9QtMsgTypePKc+0x75) [0x7fb1ad661c85]
6: akonadiserver(_ZN15FileDebugStream9writeDataEPKcx+0xa8) [0x404b08]
7: /usr/lib64/qt4/libQtCore.so.4(_ZN9QIODevice5writeEPKcx+0x79) [0x7fb1ad6e7399]
8: /usr/lib64/qt4/libQtCore.so.4 [0x7fb1ad6f10fe]
9: /usr/lib64/qt4/libQtCore.so.4(_ZN11QTextStreamD1Ev+0x68) [0x7fb1ad6f1448]
10: /usr/lib/libakonadiprivate.so.1(_ZN6QDebugD1Ev+0x41) [0x7fb1ae411a81]
11: /usr/lib/libakonadiprivate.so.1(_ZN7Akonadi13AkonadiServer20startDatabaseProcessEv+0x12c4) [0x7fb1ae40b694]
12: /usr/lib/libakonadiprivate.so.1(_ZN7Akonadi13AkonadiServerC1EP7QObject+0x6c) [0x7fb1ae41028c]
13: /usr/lib/libakonadiprivate.so.1(_ZN7Akonadi13AkonadiServer8instanceEv+0x47) [0x7fb1ae411897]
14: akonadiserver(main+0x6a) [0x40357a]

15: /lib/libc.so.6(__libc_start_main+0xf4) [0x7fb1ac6d7b74]
16: akonadiserver(_ZNK9QIODevice5atEndEv+0x41) [0x403449]
]
"
Could not start database server!
executable: "/var/run/mysqld"
arguments: ("--defaults-file=/home/krog/.local/share/akonadi//mysql.conf", "--datadir=/home/krog/.local/share/akonadi/db_data/", "--socket=/home/krog/.local/share/akonadi/db_misc/mysql.socket")
process error: "Unknown error"
"[
0: akonadiserver(_Z10kBacktracev+0x37) [0x403947]
1: akonadiserver [0x403ea8]
2: /lib/libc.so.6 [0x7f2b69bf7430]
3: /lib/libc.so.6(gsignal+0x35) [0x7f2b69bf73c5]
4: /lib/libc.so.6(abort+0x10e) [0x7f2b69bf873e]
5: /usr/lib64/qt4/libQtCore.so.4(_Z17qt_message_output9QtMsgTypePKc+0x75) [0x7f2b6ab6ec85]
6: akonadiserver(_ZN15FileDebugStream9writeDataEPKcx+0xa8) [0x404b08]
7: /usr/lib64/qt4/libQtCore.so.4(_ZN9QIODevice5writeEPKcx+0x79) [0x7f2b6abf4399]
8: /usr/lib64/qt4/libQtCore.so.4 [0x7f2b6abfe0fe]
9: /usr/lib64/qt4/libQtCore.so.4(_ZN11QTextStreamD1Ev+0x68) [0x7f2b6abfe448]
10: /usr/lib/libakonadiprivate.so.1(_ZN6QDebugD1Ev+0x41) [0x7f2b6b91ea81]
11: /usr/lib/libakonadiprivate.so.1(_ZN7Akonadi13AkonadiServer20startDatabaseProcessEv+0x12c4) [0x7f2b6b918694]
12: /usr/lib/libakonadiprivate.so.1(_ZN7Akonadi13AkonadiServerC1EP7QObject+0x6c) [0x7f2b6b91d28c]
13: /usr/lib/libakonadiprivate.so.1(_ZN7Akonadi13AkonadiServer8instanceEv+0x47) [0x7f2b6b91e897]
14: akonadiserver(main+0x6a) [0x40357a]
15: /lib/libc.so.6(__libc_start_main+0xf4) [0x7f2b69be4b74]
16: akonadiserver(_ZNK9QIODevice5atEndEv+0x41) [0x403449]
]
"
Could not start database server!
executable: "/var/run/mysqld"
arguments: ("--defaults-file=/home/krog/.local/share/akonadi//mysql.conf", "--datadir=/home/krog/.local/share/akonadi/db_data/", "--socket=/home/krog/.local/share/akonadi/db_misc/mysql.socket")
process error: "Unknown error"
"[
0: akonadiserver(_Z10kBacktracev+0x37) [0x403947]
1: akonadiserver [0x403ea8]
2: /lib/libc.so.6 [0x7fa6e3b7f430]
3: /lib/libc.so.6(gsignal+0x35) [0x7fa6e3b7f3c5]
4: /lib/libc.so.6(abort+0x10e) [0x7fa6e3b8073e]
5: /usr/lib64/qt4/libQtCore.so.4(_Z17qt_message_output9QtMsgTypePKc+0x75) [0x7fa6e4af6c85]
6: akonadiserver(_ZN15FileDebugStream9writeDataEPKcx+0xa8) [0x404b08]
7: /usr/lib64/qt4/libQtCore.so.4(_ZN9QIODevice5writeEPKcx+0x79) [0x7fa6e4b7c399]
8: /usr/lib64/qt4/libQtCore.so.4 [0x7fa6e4b860fe]
9: /usr/lib64/qt4/libQtCore.so.4(_ZN11QTextStreamD1Ev+0x68) [0x7fa6e4b86448]
10: /usr/lib/libakonadiprivate.so.1(_ZN6QDebugD1Ev+0x41) [0x7fa6e58a6a81]
11: /usr/lib/libakonadiprivate.so.1(_ZN7Akonadi13AkonadiServer20startDatabaseProcessEv+0x12c4) [0x7fa6e58a0694]
12: /usr/lib/libakonadiprivate.so.1(_ZN7Akonadi13AkonadiServerC1EP7QObject+0x6c) [0x7fa6e58a528c]
13: /usr/lib/libakonadiprivate.so.1(_ZN7Akonadi13AkonadiServer8instanceEv+0x47) [0x7fa6e58a6897]
14: akonadiserver(main+0x6a) [0x40357a]
15: /lib/libc.so.6(__libc_start_main+0xf4) [0x7fa6e3b6cb74]
16: akonadiserver(_ZNK9QIODevice5atEndEv+0x41) [0x403449]
]
"
Could not start database server!
executable: "/var/run/mysqld"
arguments: ("--defaults-file=/home/krog/.local/share/akonadi//mysql.conf", "--datadir=/home/krog/.local/share/akonadi/db_data/", "--socket=/home/krog/.local/share/akonadi/db_misc/mysql.socket")
process error: "Unknown error"
"[
0: akonadiserver(_Z10kBacktracev+0x37) [0x403947]
1: akonadiserver [0x403ea8]
2: /lib/libc.so.6 [0x7fefdd010430]
3: /lib/libc.so.6(gsignal+0x35) [0x7fefdd0103c5]
4: /lib/libc.so.6(abort+0x10e) [0x7fefdd01173e]
5: /usr/lib64/qt4/libQtCore.so.4(_Z17qt_message_output9QtMsgTypePKc+0x75) [0x7fefddf87c85]
6: akonadiserver(_ZN15FileDebugStream9writeDataEPKcx+0xa8) [0x404b08]
7: /usr/lib64/qt4/libQtCore.so.4(_ZN9QIODevice5writeEPKcx+0x79) [0x7fefde00d399]
8: /usr/lib64/qt4/libQtCore.so.4 [0x7fefde0170fe]
9: /usr/lib64/qt4/libQtCore.so.4(_ZN11QTextStreamD1Ev+0x68) [0x7fefde017448]
10: /usr/lib/libakonadiprivate.so.1(_ZN6QDebugD1Ev+0x41) [0x7fefded37a81]
11: /usr/lib/libakonadiprivate.so.1(_ZN7Akonadi13AkonadiServer20startDatabaseProcessEv+0x12c4) [0x7fefded31694]
12: /usr/lib/libakonadiprivate.so.1(_ZN7Akonadi13AkonadiServerC1EP7QObject+0x6c) [0x7fefded3628c]
13: /usr/lib/libakonadiprivate.so.1(_ZN7Akonadi13AkonadiServer8instanceEv+0x47) [0x7fefded37897]
14: akonadiserver(main+0x6a) [0x40357a]
15: /lib/libc.so.6(__libc_start_main+0xf4) [0x7fefdcffdb74]
16: akonadiserver(_ZNK9QIODevice5atEndEv+0x41) [0x403449]
]
"
Could not start database server!
executable: "/var/run/mysqld"
arguments: ("--defaults-file=/home/krog/.local/share/akonadi//mysql.conf", "--datadir=/home/krog/.local/share/akonadi/db_data/", "--socket=/home/krog/.local/share/akonadi/db_misc/mysql.socket")
process error: "Unknown error"
"[
0: akonadiserver(_Z10kBacktracev+0x37) [0x403947]
1: akonadiserver [0x403ea8]
2: /lib/libc.so.6 [0x7f0fc8ff2430]
3: /lib/libc.so.6(gsignal+0x35) [0x7f0fc8ff23c5]
4: /lib/libc.so.6(abort+0x10e) [0x7f0fc8ff373e]
5: /usr/lib64/qt4/libQtCore.so.4(_Z17qt_message_output9QtMsgTypePKc+0x75) [0x7f0fc9f69c85]
6: akonadiserver(_ZN15FileDebugStream9writeDataEPKcx+0xa8) [0x404b08]
7: /usr/lib64/qt4/libQtCore.so.4(_ZN9QIODevice5writeEPKcx+0x79) [0x7f0fc9fef399]
8: /usr/lib64/qt4/libQtCore.so.4 [0x7f0fc9ff90fe]
9: /usr/lib64/qt4/libQtCore.so.4(_ZN11QTextStreamD1Ev+0x68) [0x7f0fc9ff9448]
10: /usr/lib/libakonadiprivate.so.1(_ZN6QDebugD1Ev+0x41) [0x7f0fcad19a81]
11: /usr/lib/libakonadiprivate.so.1(_ZN7Akonadi13AkonadiServer20startDatabaseProcessEv+0x12c4) [0x7f0fcad13694]
12: /usr/lib/libakonadiprivate.so.1(_ZN7Akonadi13AkonadiServerC1EP7QObject+0x6c) [0x7f0fcad1828c]
13: /usr/lib/libakonadiprivate.so.1(_ZN7Akonadi13AkonadiServer8instanceEv+0x47) [0x7f0fcad19897]
14: akonadiserver(main+0x6a) [0x40357a]
15: /lib/libc.so.6(__libc_start_main+0xf4) [0x7f0fc8fdfb74]
16: akonadiserver(_ZNK9QIODevice5atEndEv+0x41) [0x403449]
]
"
Could not start database server!
executable: "/var/run/mysqld"
arguments: ("--defaults-file=/home/krog/.local/share/akonadi//mysql.conf", "--datadir=/home/krog/.local/share/akonadi/db_data/", "--socket=/home/krog/.local/share/akonadi/db_misc/mysql.socket")
process error: "Unknown error"
"[
0: akonadiserver(_Z10kBacktracev+0x37) [0x403947]
1: akonadiserver [0x403ea8]
2: /lib/libc.so.6 [0x7f98f9942430]
3: /lib/libc.so.6(gsignal+0x35) [0x7f98f99423c5]
4: /lib/libc.so.6(abort+0x10e) [0x7f98f994373e]
5: /usr/lib64/qt4/libQtCore.so.4(_Z17qt_message_output9QtMsgTypePKc+0x75) [0x7f98fa8b9c85]
6: akonadiserver(_ZN15FileDebugStream9writeDataEPKcx+0xa8) [0x404b08]
7: /usr/lib64/qt4/libQtCore.so.4(_ZN9QIODevice5writeEPKcx+0x79) [0x7f98fa93f399]
8: /usr/lib64/qt4/libQtCore.so.4 [0x7f98fa9490fe]
9: /usr/lib64/qt4/libQtCore.so.4(_ZN11QTextStreamD1Ev+0x68) [0x7f98fa949448]
10: /usr/lib/libakonadiprivate.so.1(_ZN6QDebugD1Ev+0x41) [0x7f98fb669a81]
11: /usr/lib/libakonadiprivate.so.1(_ZN7Akonadi13AkonadiServer20startDatabaseProcessEv+0x12c4) [0x7f98fb663694]
12: /usr/lib/libakonadiprivate.so.1(_ZN7Akonadi13AkonadiServerC1EP7QObject+0x6c) [0x7f98fb66828c]
13: /usr/lib/libakonadiprivate.so.1(_ZN7Akonadi13AkonadiServer8instanceEv+0x47) [0x7f98fb669897]
14: akonadiserver(main+0x6a) [0x40357a]
15: /lib/libc.so.6(__libc_start_main+0xf4) [0x7f98f992fb74]
16: akonadiserver(_ZNK9QIODevice5atEndEv+0x41) [0x403449]
]
"
Could not start database server!
executable: "/var/run/mysqld"
arguments: ("--defaults-file=/home/krog/.local/share/akonadi//mysql.conf", "--datadir=/home/krog/.local/share/akonadi/db_data/", "--socket=/home/krog/.local/share/akonadi/db_misc/mysql.socket")
process error: "Unknown error"
"[
0: akonadiserver(_Z10kBacktracev+0x37) [0x403947]
1: akonadiserver [0x403ea8]
2: /lib/libc.so.6 [0x7f487e076430]
3: /lib/libc.so.6(gsignal+0x35) [0x7f487e0763c5]
4: /lib/libc.so.6(abort+0x10e) [0x7f487e07773e]
5: /usr/lib64/qt4/libQtCore.so.4(_Z17qt_message_output9QtMsgTypePKc+0x75) [0x7f487efedc85]
6: akonadiserver(_ZN15FileDebugStream9writeDataEPKcx+0xa8) [0x404b08]
7: /usr/lib64/qt4/libQtCore.so.4(_ZN9QIODevice5writeEPKcx+0x79) [0x7f487f073399]
8: /usr/lib64/qt4/libQtCore.so.4 [0x7f487f07d0fe]
9: /usr/lib64/qt4/libQtCore.so.4(_ZN11QTextStreamD1Ev+0x68) [0x7f487f07d448]
10: /usr/lib/libakonadiprivate.so.1(_ZN6QDebugD1Ev+0x41) [0x7f487fd9da81]
11: /usr/lib/libakonadiprivate.so.1(_ZN7Akonadi13AkonadiServer20startDatabaseProcessEv+0x12c4) [0x7f487fd97694]
12: /usr/lib/libakonadiprivate.so.1(_ZN7Akonadi13AkonadiServerC1EP7QObject+0x6c) [0x7f487fd9c28c]
13: /usr/lib/libakonadiprivate.so.1(_ZN7Akonadi13AkonadiServer8instanceEv+0x47) [0x7f487fd9d897]
14: akonadiserver(main+0x6a) [0x40357a]
15: /lib/libc.so.6(__libc_start_main+0xf4) [0x7f487e063b74]
16: akonadiserver(_ZNK9QIODevice5atEndEv+0x41) [0x403449]
]
"
Unable to open database "Can't connect to local MySQL server through socket '/home/krog/.local/share/akonadi/db_misc/mysql.socket' (111) QMYSQL: Unable to connect"
"[
0: akonadiserver(_Z10kBacktracev+0x37) [0x403947]
1: akonadiserver [0x403ea8]
2: /lib/libc.so.6 [0x7f7148bbe430]
3: /lib/libc.so.6(gsignal+0x35) [0x7f7148bbe3c5]
4: /lib/libc.so.6(abort+0x10e) [0x7f7148bbf73e]
5: /usr/lib64/qt4/libQtCore.so.4(_Z17qt_message_output9QtMsgTypePKc+0x75) [0x7f7149b35c85]
6: akonadiserver(_ZN15FileDebugStream9writeDataEPKcx+0xa8) [0x404b08]
7: /usr/lib64/qt4/libQtCore.so.4(_ZN9QIODevice5writeEPKcx+0x79) [0x7f7149bbb399]
8: /usr/lib64/qt4/libQtCore.so.4 [0x7f7149bc50fe]
9: /usr/lib64/qt4/libQtCore.so.4(_ZN11QTextStreamD1Ev+0x68) [0x7f7149bc5448]
10: /usr/lib/libakonadiprivate.so.1(_ZN7Akonadi13AkonadiServerC1EP7QObject+0x558) [0x7f714a8e4778]
11: /usr/lib/libakonadiprivate.so.1(_ZN7Akonadi13AkonadiServer8instanceEv+0x47) [0x7f714a8e5897]
12: akonadiserver(main+0x6a) [0x40357a]
13: /lib/libc.so.6(__libc_start_main+0xf4) [0x7f7148babb74]
14: akonadiserver(_ZNK9QIODevice5atEndEv+0x41) [0x403449]
]
"
Unable to open database "Can't connect to local MySQL server through socket '/home/krog/.local/share/akonadi/db_misc/mysql.socket' (111) QMYSQL: Unable to connect"
"[
0: akonadiserver(_Z10kBacktracev+0x37) [0x403947]
1: akonadiserver [0x403ea8]
2: /lib/libc.so.6 [0x7f38a6846430]
3: /lib/libc.so.6(gsignal+0x35) [0x7f38a68463c5]
4: /lib/libc.so.6(abort+0x10e) [0x7f38a684773e]
5: /usr/lib64/qt4/libQtCore.so.4(_Z17qt_message_output9QtMsgTypePKc+0x75) [0x7f38a77bdc85]
6: akonadiserver(_ZN15FileDebugStream9writeDataEPKcx+0xa8) [0x404b08]
7: /usr/lib64/qt4/libQtCore.so.4(_ZN9QIODevice5writeEPKcx+0x79) [0x7f38a7843399]
8: /usr/lib64/qt4/libQtCore.so.4 [0x7f38a784d0fe]
9: /usr/lib64/qt4/libQtCore.so.4(_ZN11QTextStreamD1Ev+0x68) [0x7f38a784d448]
10: /usr/lib/libakonadiprivate.so.1(_ZN7Akonadi13AkonadiServerC1EP7QObject+0x558) [0x7f38a856c778]
11: /usr/lib/libakonadiprivate.so.1(_ZN7Akonadi13AkonadiServer8instanceEv+0x47) [0x7f38a856d897]
12: akonadiserver(main+0x6a) [0x40357a]
13: /lib/libc.so.6(__libc_start_main+0xf4) [0x7f38a6833b74]
14: akonadiserver(_ZNK9QIODevice5atEndEv+0x41) [0x403449]
]
"
Unable to open database "Can't connect to local MySQL server through socket '/home/krog/.local/share/akonadi/db_misc/mysql.socket' (111) QMYSQL: Unable to connect"
"[
0: akonadiserver(_Z10kBacktracev+0x37) [0x403947]
1: akonadiserver [0x403ea8]
2: /lib/libc.so.6 [0x7f792f91d430]
3: /lib/libc.so.6(gsignal+0x35) [0x7f792f91d3c5]
4: /lib/libc.so.6(abort+0x10e) [0x7f792f91e73e]
5: /usr/lib64/qt4/libQtCore.so.4(_Z17qt_message_output9QtMsgTypePKc+0x75) [0x7f7930894c85]
6: akonadiserver(_ZN15FileDebugStream9writeDataEPKcx+0xa8) [0x404b08]
7: /usr/lib64/qt4/libQtCore.so.4(_ZN9QIODevice5writeEPKcx+0x79) [0x7f793091a399]
8: /usr/lib64/qt4/libQtCore.so.4 [0x7f79309240fe]
9: /usr/lib64/qt4/libQtCore.so.4(_ZN11QTextStreamD1Ev+0x68) [0x7f7930924448]
10: /usr/lib/libakonadiprivate.so.1(_ZN7Akonadi13AkonadiServerC1EP7QObject+0x558) [0x7f7931643778]
11: /usr/lib/libakonadiprivate.so.1(_ZN7Akonadi13AkonadiServer8instanceEv+0x47) [0x7f7931644897]
12: akonadiserver(main+0x6a) [0x40357a]
13: /lib/libc.so.6(__libc_start_main+0xf4) [0x7f792f90ab74]
14: akonadiserver(_ZNK9QIODevice5atEndEv+0x41) [0x403449]
]
"
Unable to open database "Can't connect to local MySQL server through socket '/home/krog/.local/share/akonadi/db_misc/mysql.socket' (111) QMYSQL: Unable to connect"
"[
0: akonadiserver(_Z10kBacktracev+0x37) [0x403947]
1: akonadiserver [0x403ea8]
2: /lib/libc.so.6 [0x7f8cf0df3430]
3: /lib/libc.so.6(gsignal+0x35) [0x7f8cf0df33c5]
4: /lib/libc.so.6(abort+0x10e) [0x7f8cf0df473e]
5: /usr/lib64/qt4/libQtCore.so.4(_Z17qt_message_output9QtMsgTypePKc+0x75) [0x7f8cf1d6ac85]
6: akonadiserver(_ZN15FileDebugStream9writeDataEPKcx+0xa8) [0x404b08]
7: /usr/lib64/qt4/libQtCore.so.4(_ZN9QIODevice5writeEPKcx+0x79) [0x7f8cf1df0399]
8: /usr/lib64/qt4/libQtCore.so.4 [0x7f8cf1dfa0fe]
9: /usr/lib64/qt4/libQtCore.so.4(_ZN11QTextStreamD1Ev+0x68) [0x7f8cf1dfa448]
10: /usr/lib/libakonadiprivate.so.1(_ZN7Akonadi13AkonadiServerC1EP7QObject+0x558) [0x7f8cf2b19778]
11: /usr/lib/libakonadiprivate.so.1(_ZN7Akonadi13AkonadiServer8instanceEv+0x47) [0x7f8cf2b1a897]
12: akonadiserver(main+0x6a) [0x40357a]
13: /lib/libc.so.6(__libc_start_main+0xf4) [0x7f8cf0de0b74]
14: akonadiserver(_ZNK9QIODevice5atEndEv+0x41) [0x403449]
]
"
Could not start database server!
executable: "/var/run/mysqld"
arguments: ("--defaults-file=/home/krog/.local/share/akonadi//mysql.conf", "--datadir=/home/krog/.local/share/akonadi/db_data/", "--socket=/home/krog/.local/share/akonadi/db_misc/mysql.socket")
process error: "Unknown error"
"[
0: akonadiserver(_Z10kBacktracev+0x37) [0x403947]
1: akonadiserver [0x403ea8]
2: /lib/libc.so.6 [0x7fd947061430]
3: /lib/libc.so.6(gsignal+0x35) [0x7fd9470613c5]
4: /lib/libc.so.6(abort+0x10e) [0x7fd94706273e]
5: /usr/lib64/qt4/libQtCore.so.4(_Z17qt_message_output9QtMsgTypePKc+0x75) [0x7fd947fd8c85]
6: akonadiserver(_ZN15FileDebugStream9writeDataEPKcx+0xa8) [0x404b08]
7: /usr/lib64/qt4/libQtCore.so.4(_ZN9QIODevice5writeEPKcx+0x79) [0x7fd94805e399]
8: /usr/lib64/qt4/libQtCore.so.4 [0x7fd9480680fe]
9: /usr/lib64/qt4/libQtCore.so.4(_ZN11QTextStreamD1Ev+0x68) [0x7fd948068448]
10: /usr/lib/libakonadiprivate.so.1(_ZN6QDebugD1Ev+0x41) [0x7fd948d88a81]
11: /usr/lib/libakonadiprivate.so.1(_ZN7Akonadi13AkonadiServer20startDatabaseProcessEv+0x12c4) [0x7fd948d82694]
12: /usr/lib/libakonadiprivate.so.1(_ZN7Akonadi13AkonadiServerC1EP7QObject+0x6c) [0x7fd948d8728c]
13: /usr/lib/libakonadiprivate.so.1(_ZN7Akonadi13AkonadiServer8instanceEv+0x47) [0x7fd948d88897]
14: akonadiserver(main+0x6a) [0x40357a]
15: /lib/libc.so.6(__libc_start_main+0xf4) [0x7fd94704eb74]
16: akonadiserver(_ZNK9QIODevice5atEndEv+0x41) [0x403449]
]
"
Could not start database server!
executable: "/var/run/mysqld"
arguments: ("--defaults-file=/home/krog/.local/share/akonadi//mysql.conf", "--datadir=/home/krog/.local/share/akonadi/db_data/", "--socket=/home/krog/.local/share/akonadi/db_misc/mysql.socket")
process error: "Unknown error"
"[
0: akonadiserver(_Z10kBacktracev+0x37) [0x403947]
1: akonadiserver [0x403ea8]
2: /lib/libc.so.6 [0x7fb54ae98430]
3: /lib/libc.so.6(gsignal+0x35) [0x7fb54ae983c5]
4: /lib/libc.so.6(abort+0x10e) [0x7fb54ae9973e]
5: /usr/lib64/qt4/libQtCore.so.4(_Z17qt_message_output9QtMsgTypePKc+0x75) [0x7fb54be0fc85]
6: akonadiserver(_ZN15FileDebugStream9writeDataEPKcx+0xa8) [0x404b08]
7: /usr/lib64/qt4/libQtCore.so.4(_ZN9QIODevice5writeEPKcx+0x79) [0x7fb54be95399]
8: /usr/lib64/qt4/libQtCore.so.4 [0x7fb54be9f0fe]
9: /usr/lib64/qt4/libQtCore.so.4(_ZN11QTextStreamD1Ev+0x68) [0x7fb54be9f448]
10: /usr/lib/libakonadiprivate.so.1(_ZN6QDebugD1Ev+0x41) [0x7fb54cbbfa81]
11: /usr/lib/libakonadiprivate.so.1(_ZN7Akonadi13AkonadiServer20startDatabaseProcessEv+0x12c4) [0x7fb54cbb9694]
12: /usr/lib/libakonadiprivate.so.1(_ZN7Akonadi13AkonadiServerC1EP7QObject+0x6c) [0x7fb54cbbe28c]
13: /usr/lib/libakonadiprivate.so.1(_ZN7Akonadi13AkonadiServer8instanceEv+0x47) [0x7fb54cbbf897]
14: akonadiserver(main+0x6a) [0x40357a]
15: /lib/libc.so.6(__libc_start_main+0xf4) [0x7fb54ae85b74]
16: akonadiserver(_ZNK9QIODevice5atEndEv+0x41) [0x403449]
]
"
Could not start database server!
executable: "/var/run/mysqld"
arguments: ("--defaults-file=/home/krog/.local/share/akonadi//mysql.conf", "--datadir=/home/krog/.local/share/akonadi/db_data/", "--socket=/home/krog/.local/share/akonadi/db_misc/mysql.socket")
process error: "Unknown error"
"[
0: akonadiserver(_Z10kBacktracev+0x37) [0x403947]
1: akonadiserver [0x403ea8]
2: /lib/libc.so.6 [0x7f0aeac56430]
3: /lib/libc.so.6(gsignal+0x35) [0x7f0aeac563c5]
4: /lib/libc.so.6(abort+0x10e) [0x7f0aeac5773e]
5: /usr/lib64/qt4/libQtCore.so.4(_Z17qt_message_output9QtMsgTypePKc+0x75) [0x7f0aebbcdc85]
6: akonadiserver(_ZN15FileDebugStream9writeDataEPKcx+0xa8) [0x404b08]
7: /usr/lib64/qt4/libQtCore.so.4(_ZN9QIODevice5writeEPKcx+0x79) [0x7f0aebc53399]
8: /usr/lib64/qt4/libQtCore.so.4 [0x7f0aebc5d0fe]
9: /usr/lib64/qt4/libQtCore.so.4(_ZN11QTextStreamD1Ev+0x68) [0x7f0aebc5d448]
10: /usr/lib/libakonadiprivate.so.1(_ZN6QDebugD1Ev+0x41) [0x7f0aec97da81]
11: /usr/lib/libakonadiprivate.so.1(_ZN7Akonadi13AkonadiServer20startDatabaseProcessEv+0x12c4) [0x7f0aec977694]
12: /usr/lib/libakonadiprivate.so.1(_ZN7Akonadi13AkonadiServerC1EP7QObject+0x6c) [0x7f0aec97c28c]
13: /usr/lib/libakonadiprivate.so.1(_ZN7Akonadi13AkonadiServer8instanceEv+0x47) [0x7f0aec97d897]
14: akonadiserver(main+0x6a) [0x40357a]
15: /lib/libc.so.6(__libc_start_main+0xf4) [0x7f0aeac43b74]
16: akonadiserver(_ZNK9QIODevice5atEndEv+0x41) [0x403449]
]
"
Could not start database server!
executable: "/var/run/mysqld"
arguments: ("--defaults-file=/home/krog/.local/share/akonadi//mysql.conf", "--datadir=/home/krog/.local/share/akonadi/db_data/", "--socket=/home/krog/.local/share/akonadi/db_misc/mysql.socket")
process error: "Unknown error"
"[
0: akonadiserver(_Z10kBacktracev+0x37) [0x403947]
1: akonadiserver [0x403ea8]
2: /lib/libc.so.6 [0x7f2bd7269430]
3: /lib/libc.so.6(gsignal+0x35) [0x7f2bd72693c5]
4: /lib/libc.so.6(abort+0x10e) [0x7f2bd726a73e]
5: /usr/lib64/qt4/libQtCore.so.4(_Z17qt_message_output9QtMsgTypePKc+0x75) [0x7f2bd81e0c85]
6: akonadiserver(_ZN15FileDebugStream9writeDataEPKcx+0xa8) [0x404b08]
7: /usr/lib64/qt4/libQtCore.so.4(_ZN9QIODevice5writeEPKcx+0x79) [0x7f2bd8266399]
8: /usr/lib64/qt4/libQtCore.so.4 [0x7f2bd82700fe]
9: /usr/lib64/qt4/libQtCore.so.4(_ZN11QTextStreamD1Ev+0x68) [0x7f2bd8270448]
10: /usr/lib/libakonadiprivate.so.1(_ZN6QDebugD1Ev+0x41) [0x7f2bd8f90a81]
11: /usr/lib/libakonadiprivate.so.1(_ZN7Akonadi13AkonadiServer20startDatabaseProcessEv+0x12c4) [0x7f2bd8f8a694]
12: /usr/lib/libakonadiprivate.so.1(_ZN7Akonadi13AkonadiServerC1EP7QObject+0x6c) [0x7f2bd8f8f28c]
13: /usr/lib/libakonadiprivate.so.1(_ZN7Akonadi13AkonadiServer8instanceEv+0x47) [0x7f2bd8f90897]
14: akonadiserver(main+0x6a) [0x40357a]
15: /lib/libc.so.6(__libc_start_main+0xf4) [0x7f2bd7256b74]
16: akonadiserver(_ZNK9QIODevice5atEndEv+0x41) [0x403449]
]
"
Could not start database server!
executable: "/var/run/mysqld"
arguments: ("--defaults-file=/home/krog/.local/share/akonadi//mysql.conf", "--datadir=/home/krog/.local/share/akonadi/db_data/", "--socket=/home/krog/.local/share/akonadi/db_misc/mysql.socket")
process error: "Unknown error"
"[
0: akonadiserver(_Z10kBacktracev+0x37) [0x403947]
1: akonadiserver [0x403ea8]
2: /lib/libc.so.6 [0x7f23cbd23430]
3: /lib/libc.so.6(gsignal+0x35) [0x7f23cbd233c5]
4: /lib/libc.so.6(abort+0x10e) [0x7f23cbd2473e]
5: /usr/lib64/qt4/libQtCore.so.4(_Z17qt_message_output9QtMsgTypePKc+0x75) [0x7f23ccc9ac85]
6: akonadiserver(_ZN15FileDebugStream9writeDataEPKcx+0xa8) [0x404b08]
7: /usr/lib64/qt4/libQtCore.so.4(_ZN9QIODevice5writeEPKcx+0x79) [0x7f23ccd20399]
8: /usr/lib64/qt4/libQtCore.so.4 [0x7f23ccd2a0fe]
9: /usr/lib64/qt4/libQtCore.so.4(_ZN11QTextStreamD1Ev+0x68) [0x7f23ccd2a448]
10: /usr/lib/libakonadiprivate.so.1(_ZN6QDebugD1Ev+0x41) [0x7f23cda4aa81]
11: /usr/lib/libakonadiprivate.so.1(_ZN7Akonadi13AkonadiServer20startDatabaseProcessEv+0x12c4) [0x7f23cda44694]
12: /usr/lib/libakonadiprivate.so.1(_ZN7Akonadi13AkonadiServerC1EP7QObject+0x6c) [0x7f23cda4928c]
13: /usr/lib/libakonadiprivate.so.1(_ZN7Akonadi13AkonadiServer8instanceEv+0x47) [0x7f23cda4a897]
14: akonadiserver(main+0x6a) [0x40357a]
15: /lib/libc.so.6(__libc_start_main+0xf4) [0x7f23cbd10b74]
16: akonadiserver(_ZNK9QIODevice5atEndEv+0x41) [0x403449]
]
"
Could not start database server!
executable: "/var/run/mysqld"
arguments: ("--defaults-file=/home/krog/.local/share/akonadi//mysql.conf", "--datadir=/home/krog/.local/share/akonadi/db_data/", "--socket=/home/krog/.local/share/akonadi/db_misc/mysql.socket")
process error: "Unknown error"
"[
0: akonadiserver(_Z10kBacktracev+0x37) [0x403947]
1: akonadiserver [0x403ea8]
2: /lib/libc.so.6 [0x7f926d18a430]
3: /lib/libc.so.6(gsignal+0x35) [0x7f926d18a3c5]
4: /lib/libc.so.6(abort+0x10e) [0x7f926d18b73e]
5: /usr/lib64/qt4/libQtCore.so.4(_Z17qt_message_output9QtMsgTypePKc+0x75) [0x7f926e101c85]
6: akonadiserver(_ZN15FileDebugStream9writeDataEPKcx+0xa8) [0x404b08]
7: /usr/lib64/qt4/libQtCore.so.4(_ZN9QIODevice5writeEPKcx+0x79) [0x7f926e187399]
8: /usr/lib64/qt4/libQtCore.so.4 [0x7f926e1910fe]
9: /usr/lib64/qt4/libQtCore.so.4(_ZN11QTextStreamD1Ev+0x68) [0x7f926e191448]
10: /usr/lib/libakonadiprivate.so.1(_ZN6QDebugD1Ev+0x41) [0x7f926eeb1a81]
11: /usr/lib/libakonadiprivate.so.1(_ZN7Akonadi13AkonadiServer20startDatabaseProcessEv+0x12c4) [0x7f926eeab694]
12: /usr/lib/libakonadiprivate.so.1(_ZN7Akonadi13AkonadiServerC1EP7QObject+0x6c) [0x7f926eeb028c]
13: /usr/lib/libakonadiprivate.so.1(_ZN7Akonadi13AkonadiServer8instanceEv+0x47) [0x7f926eeb1897]
14: akonadiserver(main+0x6a) [0x40357a]
15: /lib/libc.so.6(__libc_start_main+0xf4) [0x7f926d177b74]
16: akonadiserver(_ZNK9QIODevice5atEndEv+0x41) [0x403449]
]
"
Could not start database server!
executable: "/var/run/mysqld"
arguments: ("--defaults-file=/home/krog/.local/share/akonadi//mysql.conf", "--datadir=/home/krog/.local/share/akonadi/db_data/", "--socket=/home/krog/.local/share/akonadi/db_misc/mysql.socket")
process error: "Unknown error"
"[
0: akonadiserver(_Z10kBacktracev+0x37) [0x403947]
1: akonadiserver [0x403ea8]
2: /lib/libc.so.6 [0x7f644af3e430]
3: /lib/libc.so.6(gsignal+0x35) [0x7f644af3e3c5]
4: /lib/libc.so.6(abort+0x10e) [0x7f644af3f73e]
5: /usr/lib64/qt4/libQtCore.so.4(_Z17qt_message_output9QtMsgTypePKc+0x75) [0x7f644beb5c85]
6: akonadiserver(_ZN15FileDebugStream9writeDataEPKcx+0xa8) [0x404b08]
7: /usr/lib64/qt4/libQtCore.so.4(_ZN9QIODevice5writeEPKcx+0x79) [0x7f644bf3b399]
8: /usr/lib64/qt4/libQtCore.so.4 [0x7f644bf450fe]
9: /usr/lib64/qt4/libQtCore.so.4(_ZN11QTextStreamD1Ev+0x68) [0x7f644bf45448]
10: /usr/lib/libakonadiprivate.so.1(_ZN6QDebugD1Ev+0x41) [0x7f644cc65a81]
11: /usr/lib/libakonadiprivate.so.1(_ZN7Akonadi13AkonadiServer20startDatabaseProcessEv+0x12c4) [0x7f644cc5f694]
12: /usr/lib/libakonadiprivate.so.1(_ZN7Akonadi13AkonadiServerC1EP7QObject+0x6c) [0x7f644cc6428c]
13: /usr/lib/libakonadiprivate.so.1(_ZN7Akonadi13AkonadiServer8instanceEv+0x47) [0x7f644cc65897]
14: akonadiserver(main+0x6a) [0x40357a]
15: /lib/libc.so.6(__libc_start_main+0xf4) [0x7f644af2bb74]
16: akonadiserver(_ZNK9QIODevice5atEndEv+0x41) [0x403449]
]
"
Could not start database server!
executable: "/var/run/mysqld"
arguments: ("--defaults-file=/home/krog/.local/share/akonadi//mysql.conf", "--datadir=/home/krog/.local/share/akonadi/db_data/", "--socket=/home/krog/.local/share/akonadi/db_misc/mysql.socket")
Back to top
View user's profile Send private message
mikedee
Apprentice
Apprentice


Joined: 05 Jul 2006
Posts: 158

PostPosted: Sun Nov 30, 2008 2:37 pm    Post subject: Reply with quote

Krog: Do you have qt-sql installed with the mysql use flag?

Also what happens if you type this

Code:
/var/run/mysqld --defaults-file=/home/krog/.local/share/akonadi//mysql.conf --datadir=/home/krog/.local/share/akonadi/db_data/ --socket=/home/krog/.local/share/akonadi/db_misc/mysql.socket


Personally I installed mysql and then set up akonadi to use the external server rather than its internal one.

It seems to think that mysqld is in /var/run/ which does not look right. Mine is in /usr/sbin/.
Back to top
View user's profile Send private message
Benni123
Tux's lil' helper
Tux's lil' helper


Joined: 13 Mar 2005
Posts: 110

PostPosted: Sun Nov 30, 2008 4:59 pm    Post subject: Reply with quote

apparently, one can only compile akonadi with nepomuk together. Nepomuk needs USE="semantic-desktop" enabled. If one has this useflag disabled, the command
Quote:

emerge -u @kdeadmin-4.2 @kdenetwork-4.2 @kdebase-4.2 @kdeutils-4.2 @kdegraphics-4.2@kdemultimedia-4.2 @kdepim-4.2 @kdesdk-4.2

still wants to install nepomuk, akonadi and packages dependent on them, and therefore fails. However, with the useflag enabled, one can compile, at least if one has no python useflag in.

With USE=python, it wants to install pykde4 before plasma-workspace and then I get:

Quote:
Linking CXX shared library ../../lib/pykde/soprano.so
[100%] Built target python_module_PyKDE4_soprano
Linking CXX shared library ../../lib/pykde/plasma.so
CMakeFiles/python_module_PyKDE4_plasma.dir/sip/plasma/sipplasmapart0.o: In function `void* qMetaTypeConstructHelper<Plasma::Containment::StyleOption>(Plasma::Containment::StyleOption const*)':
sipplasmapart0.cpp:(.text._Z24qMetaTypeConstructHelperIN6Plasma11Containment11StyleOptionEEPvPKT_[void* qMetaTypeConstructHelper<Plasma::Containment::StyleOption>(Plasma::Containment::StyleOption const*)]+0x2f): undefined reference to `Plasma::Containment::StyleOption::StyleOption(Plasma::Containment::StyleOption const&)'
sipplasmapart0.cpp:(.text._Z24qMetaTypeConstructHelperIN6Plasma11Containment11StyleOptionEEPvPKT_[void* qMetaTypeConstructHelper<Plasma::Containment::StyleOption>(Plasma::Containment::StyleOption const*)]+0x4e): undefined reference to `Plasma::Containment::StyleOption::StyleOption()'
CMakeFiles/python_module_PyKDE4_plasma.dir/sip/plasma/sipplasmapart6.o: In function `init_Plasma_Containment_StyleOption':
sipplasmapart6.cpp:(.text+0x4c8f): undefined reference to `Plasma::Containment::StyleOption::StyleOption(QStyleOptionGraphicsItem const&)'
sipplasmapart6.cpp:(.text+0x4cbe): undefined reference to `Plasma::Containment::StyleOption::StyleOption()'
sipplasmapart6.cpp:(.text+0x4cfd): undefined reference to `Plasma::Containment::StyleOption::StyleOption(Plasma::Containment::StyleOption const&)'
collect2: ld gab 1 als Ende-Status zurück
make[2]: *** [lib/pykde/plasma.so] Fehler 1
make[1]: *** [python/pykde4/CMakeFiles/python_module_PyKDE4_plasma.dir/all] Fehler 2
make: *** [all] Fehler 2
*
* ERROR: kde-base/pykde4-4.1.80 failed.
* Call stack:
Back to top
View user's profile Send private message
ravloony
n00b
n00b


Joined: 04 Feb 2005
Posts: 54
Location: France

PostPosted: Sun Nov 30, 2008 7:47 pm    Post subject: Reply with quote

Krog wrote:
Benni123 wrote:


pkde4 still fails
Quote:

...

Linking CXX shared library ../../lib/pykde/soprano.so
[ 98%] Built target python_module_PyKDE4_soprano
make: *** [all] error 2
*
* ERROR: kde-base/pykde4-4.1.80 failed.
* Call stack:
* ebuild.sh, line 49: Called src_compile
* environment, line 3512: Called kde4-meta_src_compile
* environment, line 2685: Called kde4-meta_src_make
* environment, line 2778: Called kde4-base_src_make
* environment, line 2



same here

I'm stil getting this too.
Here's the actual error:
Code:

[  4%] Generating sip/kdeui/sipkdeuipart0.cpp, sip/kdeui/sipkdeuipart1.cpp, sip/kdeui/sipkdeuipart2.cpp, sip/kdeui sipkdeuipart3.cpp, sip/kdeui/sipkdeuipart4.cpp, sip/kdeui/sipkdeuipart5.cpp, sip/kdeui/sipkdeuipart6.cpp, sip/kdeui/sipkdeuipart7.cpp

sip: /usr/share/sip/qt/versions.sip:34: Version is already defined
make[2]: *** [python/pykde4/sip/dnssd/sipdnssdpart0.cpp] Error 1
make[1]: *** [python/pykde4/CMakeFiles/python_module_PyKDE4_dnssd.dir/all] Error 2
make[1]: *** Waiting for unfinished jobs....
sip: /usr/share/sip/qt/versions.sip:34: Version is already defined
make[2]: *** [python/pykde4/sip/akonadi/sipakonadipart0.cpp] Error 1
make[1]: *** [python/pykde4/CMakeFiles/python_module_PyKDE4_akonadi.dir/all] Error 2
sip: /usr/share/sip/qt/versions.sip:34: Version is already defined
make[2]: *** [python/pykde4/sip/kdeui/sipkdeuipart0.cpp] Error 1
make[1]: *** [python/pykde4/CMakeFiles/python_module_PyKDE4_kdeui.dir/all] Error 2

_________________
No sig yet, sig ebuild up soon :-)
Back to top
View user's profile Send private message
Krog
Guru
Guru


Joined: 26 Jun 2007
Posts: 330
Location: Roma, Italy

PostPosted: Mon Dec 01, 2008 7:11 pm    Post subject: Reply with quote

for my akonadi problem, nothing worked except after
Code:

rm -r /home/krog/.local/share/akonadi/
rm -r /home/krog/.config/akonadi

now it's all ok!
Back to top
View user's profile Send private message
Krog
Guru
Guru


Joined: 26 Jun 2007
Posts: 330
Location: Roma, Italy

PostPosted: Tue Dec 02, 2008 6:56 am    Post subject: Reply with quote

Code:
>>> Emerging (5 of 5) media-video/kdenlive-0.7
 * kdenlive-0.7.tar.bz2 RMD160 SHA1 SHA256 size ;-) ...                                                                                         [ ok ]
 * checking ebuild checksums ;-) ...                                                                                                            [ ok ]
 * checking auxfile checksums ;-) ...                                                                                                           [ ok ]
 * checking miscfile checksums ;-) ...                                                                                                          [ ok ]
>>> Unpacking source...                                                                                                                               
>>> Unpacking kdenlive-0.7.tar.bz2 to /var/tmp/portage/media-video/kdenlive-0.7/work                                                                 
>>> Source unpacked.                                                                                                                                 

 * Cannot find $EPATCH_SOURCE!  Value for $EPATCH_SOURCE is:
 *                                                         
 *   /usr/portage/local/layman/kde-crazy/media-video/kdenlive/files/kdenlive-0.7-avcodeclink.patch
 *   ( kdenlive-0.7-avcodeclink.patch )                                                           

 *
 * ERROR: media-video/kdenlive-0.7 failed.
 * Call stack:                           
 *               ebuild.sh, line   49:  Called src_prepare
 *             environment, line 3203:  Called epatch '/usr/portage/local/layman/kde-crazy/media-video/kdenlive/files/kdenlive-0.7-avcodeclink.patch'
 *             environment, line 1520:  Called die                                                                                                   
 * The specific snippet of code:                                                                                                                     
 *                   die "Cannot find $EPATCH_SOURCE!";                                                                                             
 *  The die message:                                                                                                                                 
 *   Cannot find $EPATCH_SOURCE!                                   
Back to top
View user's profile Send private message
hunky
l33t
l33t


Joined: 19 Nov 2003
Posts: 821
Location: Alaska

PostPosted: Wed Dec 03, 2008 8:55 am    Post subject: Reply with quote

Curious if anyone knows the trick to get an audio cd working in kde-crazy (4.1.80)?

K3B sees it as /dev/hda but other programs don't. There's no window popup asking to open up the cd or anything. I tried going back to 3.5.10 and a cd shows up in the systray but clicking on it brings an error that dolphin executable can't be found (I didn't install dolphin on 3.5.10 so it is bleeding over from kde-4.1.80). Also some error about ioslave "audiocd" doesn't exist or somesuch (in 3.5.10)

In kde-crazy there is no dmesg or /var/log/messages errors references to the cd. Hal is running, I've emerged @kdemultimedia-4.2 set.

cheers, JD
Back to top
View user's profile Send private message
wrc1944
Advocate
Advocate


Joined: 15 Aug 2002
Posts: 3234
Location: Gainesville, Florida

PostPosted: Wed Dec 03, 2008 4:44 pm    Post subject: Reply with quote

I'm back after 10 days vacation- just tried to sync kde-crazy, and got this.
Code:
kdesvn wrc # layman -s kde-crazy
* Running command "cd "/usr/local/portage/layman/kde-crazy" && /usr/bin/git pull"...
remote: Counting objects: 4438, done.
remote: Compressing objects: 100% (2875/2875), done.
remote: Total 3704 (delta 2495), reused 1335 (delta 796)
Receiving objects: 100% (3704/3704), 739.95 KiB | 151 KiB/s, done.
Resolving deltas: 100% (2495/2495), completed with 462 local objects.
From git://git.overlays.gentoo.org/proj/kde-crazy
   1e58999..c66e456  master     -> origin/master
Updating 1e58999..c66e456
error: Entry 'app-office/koffice-libs/Manifest' not uptodate. Cannot merge.
*
* Errors:
* ------
*
* Failed to sync overlay "kde-crazy".
* Error was: Syncing overlay "kde-crazy" returned status 256!

What's the correct procedure- remove kde-crazy and do another layman -a kde-crazy?
_________________
Main box- AsRock x370 Gaming K4
Ryzen 1700, 3.0GHz, 16GB GSkill Flare DDR4 3200mhz
Samsung SATA 1000GB, Radeon HD R7 350 2GB DDR5
Gentoo ~amd64 plasma, glibc-2.29-r2, gcc-9.1.0 kernel-5.1.12-gentoo USE=experimental
Back to top
View user's profile Send private message
pehop
n00b
n00b


Joined: 16 Oct 2005
Posts: 50
Location: Oxford, UK

PostPosted: Wed Dec 03, 2008 5:10 pm    Post subject: Reply with quote

Quote:
error: Entry 'app-office/koffice-libs/Manifest' not uptodate. Cannot merge.

is the key - you have to remove the file and if there is no other out-of-sync or changed by you file, you will be able to sync kde-crazy
Back to top
View user's profile Send private message
gimpel
Advocate
Advocate


Joined: 15 Oct 2004
Posts: 2720
Location: Munich, Bavaria

PostPosted: Wed Dec 03, 2008 5:17 pm    Post subject: Reply with quote

or a git reset --hard HEAD
_________________
http://proaudio.tuxfamily.org/wiki - pro-audio software overlay
Back to top
View user's profile Send private message
wrc1944
Advocate
Advocate


Joined: 15 Aug 2002
Posts: 3234
Location: Gainesville, Florida

PostPosted: Wed Dec 03, 2008 7:26 pm    Post subject: Reply with quote

Thanks guys,
That fixed me up. :D
_________________
Main box- AsRock x370 Gaming K4
Ryzen 1700, 3.0GHz, 16GB GSkill Flare DDR4 3200mhz
Samsung SATA 1000GB, Radeon HD R7 350 2GB DDR5
Gentoo ~amd64 plasma, glibc-2.29-r2, gcc-9.1.0 kernel-5.1.12-gentoo USE=experimental
Back to top
View user's profile Send private message
wrc1944
Advocate
Advocate


Joined: 15 Aug 2002
Posts: 3234
Location: Gainesville, Florida

PostPosted: Wed Dec 03, 2008 7:53 pm    Post subject: Reply with quote

Anyone know what this probem is? I tried commenting out the bluetooth stuff (I don't use it anyway) in CMakeLists.txt- doesn't help.
Code:
[ 82%] Built target solid_fakenet
[ 84%] Generating serviceadaptor.cpp, serviceadaptor.h
Generating solid-bluetooth.moc
[ 85%] Generating clientadaptor.moc
[ 86%] Generating serviceadaptor.moc
Scanning dependencies of target kded_networkstatus
[ 87%] Building CXX object solid/networking/kded/CMakeFiles/kded_networkstatus.dir/networkstatus.o
Scanning dependencies of target solid-bluetooth
[ 89%] Building CXX object solid/solidshell/CMakeFiles/solid-bluetooth.dir/solid-bluetooth.o
/var/tmp/portage/kde-base/solid-9999/work/solid/solid/solidshell/solid-bluetooth.cpp: In member function 'bool SolidBluetooth::bluetoothListAdapters()':
/var/tmp/portage/kde-base/solid-9999/work/solid/solid/solidshell/solid-bluetooth.cpp:417: error: conversion from 'Solid::Control::BluetoothInterfaceList' to non-scalar type 'QStringList' requested
make[2]: *** [solid/solidshell/CMakeFiles/solid-bluetooth.dir/solid-bluetooth.o] Error 1
make[1]: *** [solid/solidshell/CMakeFiles/solid-bluetooth.dir/all] Error 2
make[1]: *** Waiting for unfinished jobs....
[ 90%] Building CXX object solid/networking/kded/CMakeFiles/kded_networkstatus.dir/network.o
[ 91%] Building CXX object solid/networking/kded/CMakeFiles/kded_networkstatus.dir/serviceadaptor.o
[ 92%] Building CXX object solid/networking/kded/CMakeFiles/kded_networkstatus.dir/clientadaptor.o
[ 93%] Building CXX object solid/networking/kded/CMakeFiles/kded_networkstatus.dir/kded_networkstatus_automoc.o
Linking CXX shared module ../../../lib/kded_networkstatus.so
[ 93%] Built target kded_networkstatus
make: *** [all] Error 2
 *
 * ERROR: kde-base/solid-9999 failed.

I just did a --resume --skipfirst, and kdebase-live is proceeding without solid. :?

EDIT: Hmmm.. Also commented out 4 bluetooth lines in solidshell CMakeLists.text, and then solid compiled OK- so, all of kdebase-live compiled OK. Guess I'm OK, except no bluetooth stuff, but I don't need it. :) What's strange to me is I did notice some bluetooth items compiling, even though I had commented all of them out- or at least I thought I did. :?

UPDATE: On reboot, plasma-workspace crashed, kde would not boot. A rebuild of plasma-workspace fixed it.

Are others seeing this "solid/bluetooth" problem?
_________________
Main box- AsRock x370 Gaming K4
Ryzen 1700, 3.0GHz, 16GB GSkill Flare DDR4 3200mhz
Samsung SATA 1000GB, Radeon HD R7 350 2GB DDR5
Gentoo ~amd64 plasma, glibc-2.29-r2, gcc-9.1.0 kernel-5.1.12-gentoo USE=experimental
Back to top
View user's profile Send private message
Display posts from previous:   
This topic is locked: you cannot edit posts or make replies.    Gentoo Forums Forum Index Unsupported Software All times are GMT
Goto page Previous  1, 2, 3 ... 18, 19, 20 ... 28, 29, 30  Next
Page 19 of 30

 
Jump to:  
You cannot post new topics in this forum
You cannot reply to topics in this forum
You cannot edit your posts in this forum
You cannot delete your posts in this forum
You cannot vote in polls in this forum