Gentoo Forums
Gentoo Forums
Gentoo Forums
Quick Search: in
[kde-testing] and [kde-crazy] KDE4 overlays thread (part 2)
View unanswered posts
View posts from last 24 hours

Goto page Previous  1, 2, 3 ... 24, 25, 26 ... 28, 29, 30  Next  
This topic is locked: you cannot edit posts or make replies.    Gentoo Forums Forum Index Unsupported Software
View previous topic :: View next topic  
Author Message
tux2
Apprentice
Apprentice


Joined: 09 Jun 2004
Posts: 172
Location: Germany

PostPosted: Wed Dec 17, 2008 12:27 pm    Post subject: Reply with quote

Finswimmer wrote:

They told me that the earliest release date will be tomorrow.


and here is the link:
http://mail.kde.org/pipermail/release-team/2008-December/002710.html
Back to top
View user's profile Send private message
sgao
Tux's lil' helper
Tux's lil' helper


Joined: 22 Apr 2006
Posts: 149

PostPosted: Wed Dec 17, 2008 7:00 pm    Post subject: can't emerge kdebase-4.2 (4.1.82) Reply with quote

After sync up to latest updates, emerge gives follow error:

Quote:
# emerge @kdebase-4.2
!!! '@kdebase-4.2' is not a valid package atom.
!!! Please check ebuild(5) for full details.


"emerge @kdebase-4.2" has been working up to 4.1.80. Something has changed? What's new way to emerge 4.2 crazy tree?
Back to top
View user's profile Send private message
drescherjm
Advocate
Advocate


Joined: 05 Jun 2004
Posts: 2779
Location: Pittsburgh, PA, USA

PostPosted: Wed Dec 17, 2008 7:34 pm    Post subject: Reply with quote

looks fine here:

Code:
# emerge --list-sets
downgrade
installed
kde
kde-3.5
kde-4.1
kde-4.2
kde-live
kdeaccessibility
kdeaccessibility-4.1
kdeaccessibility-4.2
kdeadmin
kdeadmin-4.1
kdeadmin-4.2
kdeadmin-live
kdeartwork
kdeartwork-4.1
kdeartwork-4.2
kdeartwork-live
kdebase
kdebase-4.1
kdebase-4.2
kdebase-live
kdebindings-4.2
kdedeps
kdedeps-4.1
kdedeps-4.2
kdedeps-live
kdeedu
kdeedu-4.1
kdeedu-4.2
kdeedu-live
kdegames
kdegames-4.1
kdegames-4.2
kdegames-live
kdegraphics
kdegraphics-4.1
kdegraphics-4.2
kdegraphics-live
kdemultimedia
kdemultimedia-4.1
kdemultimedia-4.2
kdemultimedia-live
kdenetwork
kdenetwork-4.1
kdenetwork-4.2
kdenetwork-live
kdeoptional
kdeoptional-4.1
kdeoptional-4.2
kdepim
kdepim-4.1
kdepim-4.2
kdepim-live
kdesdk
kdesdk-4.1
kdesdk-4.2
kdesdk-live
kdetoys
kdetoys-4.1
kdetoys-4.2
kdetoys-live
kdeutils
kdeutils-4.1
kdeutils-4.2
kdeutils-live
kdewebdev
kdewebdev-4.1
kdewebdev-4.2
koffice
koffice-2
koffice-live
live-rebuild
module-rebuild
plasmoids
preserved-rebuild
security
system
unavailable
world


I generally just do:
emerge -auDvN @kde-4.2

Code:
jmd0 ~ # emerge -auDvN @kde-4.2

These are the packages that would be merged, in order:

Calculating dependencies... done!

Total: 0 packages, Size of downloads: 0 kB

Nothing to merge; would you like to auto-clean packages?



Hmm. Did you allow portage to be downgraded to 2.1.6 so it has no concept of sets?
_________________
John

My gentoo overlay
Instructons for overlay
Back to top
View user's profile Send private message
sgao
Tux's lil' helper
Tux's lil' helper


Joined: 22 Apr 2006
Posts: 149

PostPosted: Thu Dec 18, 2008 1:09 am    Post subject: Reply with quote

You are right. The portage was downgraded to 2.1.6. Upgrading to 2.2.x did the trick. Thanks.
Back to top
View user's profile Send private message
sgao
Tux's lil' helper
Tux's lil' helper


Joined: 22 Apr 2006
Posts: 149

PostPosted: Thu Dec 18, 2008 2:11 am    Post subject: nepomuk-4.1.82 failed compiling Reply with quote

nepomuk failed compiling with following error:

Quote:
>>> Source configured.
>>> Compiling source in /var/tmp/portage/kde-base/nepomuk-4.1.82/work/nepomuk-4.1.82 ...
make
>>> Source compiled.
>>> Test phase [not enabled]: kde-base/nepomuk-4.1.82

>>> Install nepomuk-4.1.82 into /var/tmp/portage/kde-base/nepomuk-4.1.82/image/ category kde-base
make install DESTDIR=/var/tmp/portage/kde-base/nepomuk-4.1.82/image/
make: *** No rule to make target `install'. Stop.
*
* ERROR: kde-base/nepomuk-4.1.82 failed.
* Call stack:
* ebuild.sh, line 49: Called src_install
* environment, line 3653: Called kde4-meta_src_install
* environment, line 2862: Called cmake-utils_src_install
* environment, line 943: Called die
* The specific snippet of code:
* emake install DESTDIR="${D}" || die "Make install failed";
* The die message:
* Make install failed
*
* If you need support, post the topmost build error, and the call stack if relevant.
* A complete build log is located at '/var/tmp/portage/kde-base/nepomuk-4.1.82/temp/build.log'.
* The ebuild environment file is located at '/var/tmp/portage/kde-base/nepomuk-4.1.82/temp/environment'.
* This ebuild used the following eclasses from overlays:
* /usr/portage/local/layman/kde-crazy/eclass/kde4-meta.eclass
* /usr/portage/local/layman/kde-crazy/eclass/kde4-base.eclass
* /usr/portage/local/layman/kde-crazy/eclass/kde4-functions.eclass
*

>>> Failed to emerge kde-base/nepomuk-4.1.82, Log file:

>>> '/var/tmp/portage/kde-base/nepomuk-4.1.82/temp/build.log'

* Messages for package kde-base/solid-4.1.82:

* If you want to be notified about new plugged devices by a popup,
* install kde-base/soliduiserver

* Messages for package kde-base/nepomuk-4.1.82:

*
* ERROR: kde-base/nepomuk-4.1.82 failed.
* Call stack:
* ebuild.sh, line 49: Called src_install
* environment, line 3653: Called kde4-meta_src_install
* environment, line 2862: Called cmake-utils_src_install
* environment, line 943: Called die
* The specific snippet of code:
* emake install DESTDIR="${D}" || die "Make install failed";
* The die message:
* Make install failed
*
* If you need support, post the topmost build error, and the call stack if relevant.
* A complete build log is located at '/var/tmp/portage/kde-base/nepomuk-4.1.82/temp/build.log'.
* The ebuild environment file is located at '/var/tmp/portage/kde-base/nepomuk-4.1.82/temp/environment'.


Anyone else see this problem?
Back to top
View user's profile Send private message
dmitchell
Veteran
Veteran


Joined: 17 May 2003
Posts: 1159
Location: Austin, Texas

PostPosted: Thu Dec 18, 2008 9:57 am    Post subject: Reply with quote

So java is now required? :?

It appears that kde-crazy has dependencies: @kdebase-4.2 <- nepomuk <- soprano[clucene] <- java.

Or am I missing something?

Edit: reading the soprano ebuild reveals:

Code:
COMMON_DEPEND="
        clucene? ( ... )
        redland? ( ... )
        sesame2? ( virtual/jdk)
        !redland? (
                !sesame2? (
                        virtual/jdk
                )
        )
"


In plain english, if you enable sesame2 or disable both redland and sesame2, then java gets pulled in. So to avoid pulling in java, enable redland and disable sesame2.
_________________
Your argument is invalid.


Last edited by dmitchell on Fri Dec 19, 2008 12:06 am; edited 1 time in total
Back to top
View user's profile Send private message
husku
n00b
n00b


Joined: 18 Apr 2005
Posts: 19
Location: Finland

PostPosted: Thu Dec 18, 2008 11:14 am    Post subject: Reply with quote

I unmasked the 4.1.85 ebuilds, but portage cannot find the sources, does someone know whats up?

>>> Downloading 'http://ibiblio.org/pub/mirrors/kde/unstable/4.1.85/src/kdelibs-4.1.85.tar.bz2'
--2008-12-18 13:14:05-- http://ibiblio.org/pub/mirrors/kde/unstable/4.1.85/src/kdelibs-4.1.85.tar.bz2
Resolving ibiblio.org... 152.46.7.80
Connecting to ibiblio.org|152.46.7.80|:80... connected.
HTTP request sent, awaiting response... 301 Moved Permanently
Location: http://mirrors.ibiblio.org/pub/mirrors/kde/unstable/4.1.85/src/kdelibs-4.1.85.tar.bz2 [following]
--2008-12-18 13:14:05-- http://mirrors.ibiblio.org/pub/mirrors/kde/unstable/4.1.85/src/kdelibs-4.1.85.tar.bz2
Resolving mirrors.ibiblio.org... 152.46.7.65
Connecting to mirrors.ibiblio.org|152.46.7.65|:80... connected.
HTTP request sent, awaiting response... 404 Not Found
2008-12-18 13:14:06 ERROR 404: Not Found.

>>> Downloading 'ftp://ftp.solnet.ch/mirror/KDE/unstable/4.1.85/src/kdelibs-4.1.85.tar.bz2'
--2008-12-18 13:14:06-- ftp://ftp.solnet.ch/mirror/KDE/unstable/4.1.85/src/kdelibs-4.1.85.tar.bz2
=> `/usr/portage/distfiles/kdelibs-4.1.85.tar.bz2'
Resolving ftp.solnet.ch... 212.101.4.244
Connecting to ftp.solnet.ch|212.101.4.244|:21... connected.
Logging in as anonymous ... Logged in!
==> SYST ... done. ==> PWD ... done.
==> TYPE I ... done. ==> CWD /mirror/KDE/unstable/4.1.85/src ...
No such directory `mirror/KDE/unstable/4.1.85/src'.

EDIT:

- it works now
_________________
Mr. Right


Last edited by husku on Thu Dec 18, 2008 12:58 pm; edited 1 time in total
Back to top
View user's profile Send private message
asturm
Developer
Developer


Joined: 05 Apr 2007
Posts: 6929
Location: Austria

PostPosted: Thu Dec 18, 2008 12:08 pm    Post subject: Reply with quote

The sources aren't there yet, or shouldn't have been there in the first place. Be patient.
_________________
backend.cpp:92:2: warning: #warning TODO - this error message is about as useful as a cooling unit in the arctic
Back to top
View user's profile Send private message
Finswimmer
Moderator
Moderator


Joined: 02 Sep 2004
Posts: 5467
Location: Langen (Hessen), Germany

PostPosted: Thu Dec 18, 2008 12:30 pm    Post subject: Reply with quote

ftp.kde.org :)

Good luck!
_________________
Bitte auf Rechtschreibung, korrekte Formatierung und Höflichkeit achten!
Danke
Back to top
View user's profile Send private message
kernelOfTruth
Watchman
Watchman


Joined: 20 Dec 2005
Posts: 6108
Location: Vienna, Austria; Germany; hello world :)

PostPosted: Thu Dec 18, 2008 12:56 pm    Post subject: Reply with quote

several things still don't seem to work (yet):

e.g. the mouse-wheel

I'm trying to associate it with the zoom function but it doesn't do anything if I turn it / scroll it

at least the meta(windows)-key works now :)

also multimedia keyboard keys don't work yet (aren't recognized at all): e.g. volume up volume down, ...

"keeps gettin' better" :D
_________________
https://github.com/kernelOfTruth/ZFS-for-SystemRescueCD/tree/ZFS-for-SysRescCD-4.9.0
https://github.com/kernelOfTruth/pulseaudio-equalizer-ladspa

Hardcore Gentoo Linux user since 2004 :D
Back to top
View user's profile Send private message
drescherjm
Advocate
Advocate


Joined: 05 Jun 2004
Posts: 2779
Location: Pittsburgh, PA, USA

PostPosted: Thu Dec 18, 2008 1:37 pm    Post subject: Reply with quote

Quote:
ftp.kde.org


Some users were able to grab them 2 days ago but then the files were pulled. They appear to be back now.
_________________
John

My gentoo overlay
Instructons for overlay
Back to top
View user's profile Send private message
marcus84
Tux's lil' helper
Tux's lil' helper


Joined: 23 Apr 2008
Posts: 87

PostPosted: Thu Dec 18, 2008 1:52 pm    Post subject: Reply with quote

drescherjm wrote:
Quote:
ftp.kde.org


Some users were able to grab them 2 days ago but then the files were pulled. They appear to be back now.


All compilling except pyKDE as allways get an error linking with plasma.so :'(


P.D.

Other packages failing:

marble-4.1.85

/home/tmp_portage/portage/kde-base/marble-4.1.85/work/marble-4.1.85/marble/src/plasmoid/worldclock.cpp:268: warning: passing ‘double’ for argument 2 to ‘QPoint::QPoint(int, int)’
/home/tmp_portage/portage/kde-base/marble-4.1.85/work/marble-4.1.85/marble/src/plasmoid/worldclock.cpp:269: warning: passing ‘double’ for argument 1 to ‘QPoint::QPoint(int, int)’
/home/tmp_portage/portage/kde-base/marble-4.1.85/work/marble-4.1.85/marble/src/plasmoid/worldclock.cpp:269: warning: passing ‘double’ for argument 2 to ‘QPoint::QPoint(int, int)’
/home/tmp_portage/portage/kde-base/marble-4.1.85/work/marble-4.1.85/marble/src/plasmoid/worldclock.cpp:270: warning: passing ‘double’ for argument 1 to ‘QPoint::QPoint(int, int)’
/home/tmp_portage/portage/kde-base/marble-4.1.85/work/marble-4.1.85/marble/src/plasmoid/worldclock.cpp:270: warning: passing ‘double’ for argument 2 to ‘QPoint::QPoint(int, int)’
/home/tmp_portage/portage/kde-base/marble-4.1.85/work/marble-4.1.85/marble/src/plasmoid/worldclock.cpp:271: warning: passing ‘double’ for argument 1 to ‘QPoint::QPoint(int, int)’
/home/tmp_portage/portage/kde-base/marble-4.1.85/work/marble-4.1.85/marble/src/plasmoid/worldclock.cpp:271: warning: passing ‘double’ for argument 2 to ‘QPoint::QPoint(int, int)’
/home/tmp_portage/portage/kde-base/marble-4.1.85/work/marble-4.1.85/marble/src/plasmoid/worldclock.cpp:272: warning: passing ‘double’ for argument 1 to ‘QPoint::QPoint(int, int)’
/home/tmp_portage/portage/kde-base/marble-4.1.85/work/marble-4.1.85/marble/src/plasmoid/worldclock.cpp:272: warning: passing ‘double’ for argument 2 to ‘QPoint::QPoint(int, int)’
[ 96%] Building CXX object marble/src/plasmoid/CMakeFiles/plasma_applet_worldclock.dir/plasma_applet_worldclock_automoc.o
Generating MarbleWidgetSpeedTest.moc
Linking CXX shared module ../../../lib/plasma_applet_worldclock.so
Scanning dependencies of target MarbleWidgetSpeedTest
[ 97%] Building CXX object marble/tests/CMakeFiles/GeoPolygonTest.dir/GeoPolygonTest_automoc.o
Linking CXX executable GeoPolygonTest
[ 97%] Built target plasma_applet_worldclock
[ 98%] [ 98%] Building CXX object marble/tests/CMakeFiles/MarbleWidgetSpeedTest.dir/MarbleWidgetSpeedTest.o
Built target GeoPolygonTest
[ 98%] Building CXX object marble/tests/CMakeFiles/MarbleWidgetSpeedTest.dir/MarbleWidgetSpeedTest_automoc.o
Linking CXX executable MarbleWidgetSpeedTest
[ 98%] Built target MarbleWidgetSpeedTest
sip: MarblePlacemarkModel is undefined
make[2]: *** [marble/src/bindings/python/sip/sipmarblepart0.cpp] Error 1
make[1]: *** [marble/src/bindings/python/CMakeFiles/python_module_PyKDE4_marble.dir/all] Error 2
make: *** [all] Error 2


Last edited by marcus84 on Thu Dec 18, 2008 2:40 pm; edited 1 time in total
Back to top
View user's profile Send private message
Finswimmer
Moderator
Moderator


Joined: 02 Sep 2004
Posts: 5467
Location: Langen (Hessen), Germany

PostPosted: Thu Dec 18, 2008 2:25 pm    Post subject: Reply with quote

drescherjm wrote:
Quote:
ftp.kde.org


Some users were able to grab them 2 days ago but then the files were pulled. They appear to be back now.


This were pre-releases. Now it is the official and *final* beta2.

Tobi
_________________
Bitte auf Rechtschreibung, korrekte Formatierung und Höflichkeit achten!
Danke
Back to top
View user's profile Send private message
mkyral
Apprentice
Apprentice


Joined: 06 May 2007
Posts: 152
Location: Czech Republic

PostPosted: Thu Dec 18, 2008 3:29 pm    Post subject: Reply with quote

rahulthewall3000 wrote:
I was able to download 4.1.85 and install 125 of the 126 packages that I use from KDE.

kdeplasma-addons-4.1.85 fails with the following error:

Code:

Linking CXX shared module ../../lib/plasma_applet_calculator.so                 
Linking CXX shared module ../../lib/plasma_applet_binaryclock.so               
/usr/lib/gcc/i686-pc-linux-gnu/4.3.2/../../../../i686-pc-linux-gnu/bin/ld: cannot find -lKDE4Workspace__plasmaclock                                             
collect2: ld returned 1 exit status                                             
make[2]: *** [lib/plasma_applet_binaryclock.so] Error 1                         
make[1]: *** [applets/binary-clock/CMakeFiles/plasma_applet_binaryclock.dir/all] Error 2                                                                       




The same error here. And also with kde-base/kdeartwork-kscreensaver-4.1.85

Code:

[  1%] Building CXX object kscreensaver/kdesavers/CMakeFiles/kclock.kss.dir/kclock.o                                                                                                                     
[  3%] Building CXX object kscreensaver/kdesavers/CMakeFiles/kbanner.kss.dir/banner.o                                                                                                                   
[  4%] Building CXX object kscreensaver/kdesavers/CMakeFiles/kblob.kss.dir/blob.o                                                                                                                       
[  6%] Building CXX object kscreensaver/kdesavers/CMakeFiles/kblob.kss.dir/kblob.kss_automoc.o                                                                                                           
Linking CXX executable kblob.kss                                                                                                                                                                         
/usr/lib/gcc/x86_64-pc-linux-gnu/4.3.2/../../../../x86_64-pc-linux-gnu/bin/ld: cannot find -lKDE4Workspace__kscreensaver                                                                                 
collect2: ld returned 1 exit status                                                                                                                                                                     
make[2]: *** [kscreensaver/kdesavers/kblob.kss] Error 1                                                                                                                                                 
make[1]: *** [kscreensaver/kdesavers/CMakeFiles/kblob.kss.dir/all] Error 2                                                                                                                               
make[1]: *** Waiting for unfinished jobs....                                                                                                                                                             
[  7%] Building CXX object kscreensaver/kdesavers/CMakeFiles/kclock.kss.dir/kclock.kss_automoc.o                                                                                                         
[  9%] Building CXX object kscreensaver/kdesavers/CMakeFiles/kbanner.kss.dir/kbanner.kss_automoc.o                                                                                                       
Linking CXX executable kbanner.kss                                                                                                                                                                       
Linking CXX executable kclock.kss                                                                                                                                                                       
/usr/lib/gcc/x86_64-pc-linux-gnu/4.3.2/../../../../x86_64-pc-linux-gnu/bin/ld: cannot find -lKDE4Workspace__kscreensaver                                                                                 
collect2: ld returned 1 exit status                                                                                                                                                                     
/usr/lib/gcc/x86_64-pc-linux-gnu/4.3.2/../../../../x86_64-pc-linux-gnu/bin/ld: cannot find -lKDE4Workspace__kscreensaver                                                                                 
collect2: ld returned 1 exit status                                                                                                                                                                     
make[2]: *** [kscreensaver/kdesavers/kbanner.kss] Error 1                                                                                                                                               
make[1]: *** [kscreensaver/kdesavers/CMakeFiles/kbanner.kss.dir/all] Error 2                                                                                                                             
make[2]: *** [kscreensaver/kdesavers/kclock.kss] Error 1                                                                                                                                                 
make[1]: *** [kscreensaver/kdesavers/CMakeFiles/kclock.kss.dir/all] Error 2                                                                                                                             
make: *** [all] Error 2
Back to top
View user's profile Send private message
ssmaxss
Apprentice
Apprentice


Joined: 28 Jun 2005
Posts: 160
Location: Moscow, Russia.

PostPosted: Thu Dec 18, 2008 3:30 pm    Post subject: Reply with quote

Same problem as marcus84, marble doesn't compiles
Back to top
View user's profile Send private message
tampakrap
Retired Dev
Retired Dev


Joined: 27 Nov 2007
Posts: 71
Location: Prague, Czech Republic

PostPosted: Thu Dec 18, 2008 4:39 pm    Post subject: KDE 4.2 Beta 2 Released! Reply with quote

kde-crazy now provides KDE 4.2 Beta 2 (4.1.85) unmasked! Enjoy!
Back to top
View user's profile Send private message
ssmaxss
Apprentice
Apprentice


Joined: 28 Jun 2005
Posts: 160
Location: Moscow, Russia.

PostPosted: Thu Dec 18, 2008 5:00 pm    Post subject: Reply with quote

For me several packages do not build. For example ktux. it fails with
Code:
Linking CXX executable ktux
/usr/lib/gcc/i686-pc-linux-gnu/4.3.2/../../../../i686-pc-linux-gnu/bin/ld: cannot find -lKDE4Workspace__kscreensaver
collect2: ld returned 1 exit status

but if I find calling file and change -lKDE4Workspace__kscreensaver to -lkscreensaver then everything goes ok.
several other packages related to screensaver fails too. Rebuild kscreensaver doesn't help.
Back to top
View user's profile Send private message
Benni123
Tux's lil' helper
Tux's lil' helper


Joined: 13 Mar 2005
Posts: 110

PostPosted: Thu Dec 18, 2008 6:01 pm    Post subject: Reply with quote

pkde4 still doesn't work. Kopete also fails with
Quote:
:handleURL(const QString&, const KUrl&) const« war versteckt
/var/tmp/portage/kde-base/kopete-4.1.85/work/kopete-4.1.85/kopete/protocols/jabber/jabberprotocol.h:151: Warnung: von »virtual void JabberProtocol::handleURL(const KUrl&) const«
/var/tmp/portage/kde-base/kopete-4.1.85/work/kopete-4.1.85/kopete/libkopete/kopetemimetypehandler.h:74: Warnung: »virtual void Kopete::MimeTypeHandler::handleURL(const KUrl&) const« war versteckt
/var/tmp/portage/kde-base/kopete-4.1.85/work/kopete-4.1.85/kopete/libkopete/kopetemimetypehandler.h:128: Warnung: von »virtual void Kopete::EmoticonMimeTypeHandler::handleURL(const QString&, const KUrl&) const«
/var/tmp/portage/kde-base/kopete-4.1.85/work/kopete-4.1.85/kopete/libkopete/kopetemimetypehandler.h:82: Warnung: »virtual void Kopete::MimeTypeHandler::handleURL(const QString&, const KUrl&) const« war versteckt
/var/tmp/portage/kde-base/kopete-4.1.85/work/kopete-4.1.85/kopete/protocols/jabber/jabberprotocol.h:151: Warnung: von »virtual void JabberProtocol::handleURL(const KUrl&) const«
[ 88%] Building CXX object kopete/protocols/jabber/CMakeFiles/kopete_jabber.dir/kopete_jabber_automoc.o
Linking CXX shared module ../../../lib/kopete_jabber.so
[ 88%] Built target kopete_jabber
make: *** [all] Fehler 2
*
* ERROR: kde-base/kopete-4.1.85 failed.
* Call stack:
* ebuild.sh, line 49: Called src_compile
* environment, line 3688: Called kde4-meta_src_compile
* environment, line 2820: Called kde4-base_src_make
* environment, line 2581: Called cmake-utils_src_make
* environment, line 992: Called die
* The specific snippet of code:
* emake "$@" || die "Make failed!";
* The die message:
* Make failed!

k3b-9999 fails with
Quote:
[ 88%] Building CXX object src/CMakeFiles/k3b_bin.dir/rip/videodvd/k3bvideodvdrippingtitlelistview.o
[ 88%] Building CXX object src/CMakeFiles/k3b_bin.dir/rip/videodvd/k3bvideodvdrippingjob.o
/var/tmp/portage/app-cdr/k3b-9999/work/k3b-9999/src/rip/videodvd/k3bvideodvdrippingtitlelistview.cpp: In member function »virtual void K3bVideoDVDRippingTitleListView::TitleViewItem::paintK3bCell(QPainter*, const QColorGroup&, int, int, int)«:
/var/tmp/portage/app-cdr/k3b-9999/work/k3b-9999/src/rip/videodvd/k3bvideodvdrippingtitlelistview.cpp:160: Warnung: »highlightedText« ist veraltet (deklariert bei /usr/include/qt4/QtGui/qpalette.h:235)
/var/tmp/portage/app-cdr/k3b-9999/work/k3b-9999/src/rip/videodvd/k3bvideodvdrippingtitlelistview.cpp:163: Warnung: »base« ist veraltet (deklariert bei /usr/include/qt4/QtGui/qpalette.h:228)
/var/tmp/portage/app-cdr/k3b-9999/work/k3b-9999/src/rip/videodvd/k3bvideodvdrippingtitlelistview.cpp:164: Warnung: »text« ist veraltet (deklariert bei /usr/include/qt4/QtGui/qpalette.h:227)
/var/tmp/portage/app-cdr/k3b-9999/work/k3b-9999/src/rip/videodvd/k3bvideodvdrippingtitlelistview.cpp:213: Warnung: »highlightedText« ist veraltet (deklariert bei /usr/include/qt4/QtGui/qpalette.h:235)
/var/tmp/portage/app-cdr/k3b-9999/work/k3b-9999/src/rip/videodvd/k3bvideodvdrippingtitlelistview.cpp:216: Warnung: »base« ist veraltet (deklariert bei /usr/include/qt4/QtGui/qpalette.h:228)
[ 89%] Building CXX object src/CMakeFiles/k3b_bin.dir/rip/videodvd/k3bvideodvdrippingwidget.o
[ 89%] Building CXX object src/CMakeFiles/k3b_bin.dir/rip/videodvd/k3bvideodvdrippingdialog.o
[ 89%] Building CXX object src/CMakeFiles/k3b_bin.dir/rip/videodvd/k3bvideodvdrippingpreview.o
[ 90%] Building CXX object src/CMakeFiles/k3b_bin.dir/k3b_bin_automoc.o
Linking CXX executable k3b
[ 90%] Built target k3b_bin
make: *** [all] Fehler 2
*
* ERROR: app-cdr/k3b-9999 failed.
* Call stack:


Kdevelop-9999 wants in any case the kde live ebuilds installed...
Back to top
View user's profile Send private message
drescherjm
Advocate
Advocate


Joined: 05 Jun 2004
Posts: 2779
Location: Pittsburgh, PA, USA

PostPosted: Thu Dec 18, 2008 6:06 pm    Post subject: Reply with quote

Quote:
pkde4 still doesn't work. Kopete also fails with



Installed for me as well as all ~216 packages

Code:
jmd0 ~ # equery list kde-base/ | grep pykde
kde-base/pykde4-4.1.85


BTW, The actual error seems to be above the output you posted in both cases. You need to scroll back and find the first part that has the word Error in it.
_________________
John

My gentoo overlay
Instructons for overlay
Back to top
View user's profile Send private message
marcus84
Tux's lil' helper
Tux's lil' helper


Joined: 23 Apr 2008
Posts: 87

PostPosted: Thu Dec 18, 2008 7:37 pm    Post subject: Reply with quote

Benni123 wrote:
pkde4 still doesn't work. Kopete also fails with
Quote:
:handleURL(const QString&, const KUrl&) const« war versteckt
/var/tmp/portage/kde-base/kopete-4.1.85/work/kopete-4.1.85/kopete/protocols/jabber/jabberprotocol.h:151: Warnung: von »virtual void JabberProtocol::handleURL(const KUrl&) const«
/var/tmp/portage/kde-base/kopete-4.1.85/work/kopete-4.1.85/kopete/libkopete/kopetemimetypehandler.h:74: Warnung: »virtual void Kopete::MimeTypeHandler::handleURL(const KUrl&) const« war versteckt
/var/tmp/portage/kde-base/kopete-4.1.85/work/kopete-4.1.85/kopete/libkopete/kopetemimetypehandler.h:128: Warnung: von »virtual void Kopete::EmoticonMimeTypeHandler::handleURL(const QString&, const KUrl&) const«
/var/tmp/portage/kde-base/kopete-4.1.85/work/kopete-4.1.85/kopete/libkopete/kopetemimetypehandler.h:82: Warnung: »virtual void Kopete::MimeTypeHandler::handleURL(const QString&, const KUrl&) const« war versteckt
/var/tmp/portage/kde-base/kopete-4.1.85/work/kopete-4.1.85/kopete/protocols/jabber/jabberprotocol.h:151: Warnung: von »virtual void JabberProtocol::handleURL(const KUrl&) const«
[ 88%] Building CXX object kopete/protocols/jabber/CMakeFiles/kopete_jabber.dir/kopete_jabber_automoc.o
Linking CXX shared module ../../../lib/kopete_jabber.so
[ 88%] Built target kopete_jabber
make: *** [all] Fehler 2
*
* ERROR: kde-base/kopete-4.1.85 failed.
* Call stack:
* ebuild.sh, line 49: Called src_compile
* environment, line 3688: Called kde4-meta_src_compile
* environment, line 2820: Called kde4-base_src_make
* environment, line 2581: Called cmake-utils_src_make
* environment, line 992: Called die
* The specific snippet of code:
* emake "$@" || die "Make failed!";
* The die message:
* Make failed!

k3b-9999 fails with
Quote:
[ 88%] Building CXX object src/CMakeFiles/k3b_bin.dir/rip/videodvd/k3bvideodvdrippingtitlelistview.o
[ 88%] Building CXX object src/CMakeFiles/k3b_bin.dir/rip/videodvd/k3bvideodvdrippingjob.o
/var/tmp/portage/app-cdr/k3b-9999/work/k3b-9999/src/rip/videodvd/k3bvideodvdrippingtitlelistview.cpp: In member function »virtual void K3bVideoDVDRippingTitleListView::TitleViewItem::paintK3bCell(QPainter*, const QColorGroup&, int, int, int)«:
/var/tmp/portage/app-cdr/k3b-9999/work/k3b-9999/src/rip/videodvd/k3bvideodvdrippingtitlelistview.cpp:160: Warnung: »highlightedText« ist veraltet (deklariert bei /usr/include/qt4/QtGui/qpalette.h:235)
/var/tmp/portage/app-cdr/k3b-9999/work/k3b-9999/src/rip/videodvd/k3bvideodvdrippingtitlelistview.cpp:163: Warnung: »base« ist veraltet (deklariert bei /usr/include/qt4/QtGui/qpalette.h:228)
/var/tmp/portage/app-cdr/k3b-9999/work/k3b-9999/src/rip/videodvd/k3bvideodvdrippingtitlelistview.cpp:164: Warnung: »text« ist veraltet (deklariert bei /usr/include/qt4/QtGui/qpalette.h:227)
/var/tmp/portage/app-cdr/k3b-9999/work/k3b-9999/src/rip/videodvd/k3bvideodvdrippingtitlelistview.cpp:213: Warnung: »highlightedText« ist veraltet (deklariert bei /usr/include/qt4/QtGui/qpalette.h:235)
/var/tmp/portage/app-cdr/k3b-9999/work/k3b-9999/src/rip/videodvd/k3bvideodvdrippingtitlelistview.cpp:216: Warnung: »base« ist veraltet (deklariert bei /usr/include/qt4/QtGui/qpalette.h:228)
[ 89%] Building CXX object src/CMakeFiles/k3b_bin.dir/rip/videodvd/k3bvideodvdrippingwidget.o
[ 89%] Building CXX object src/CMakeFiles/k3b_bin.dir/rip/videodvd/k3bvideodvdrippingdialog.o
[ 89%] Building CXX object src/CMakeFiles/k3b_bin.dir/rip/videodvd/k3bvideodvdrippingpreview.o
[ 90%] Building CXX object src/CMakeFiles/k3b_bin.dir/k3b_bin_automoc.o
Linking CXX executable k3b
[ 90%] Built target k3b_bin
make: *** [all] Fehler 2
*
* ERROR: app-cdr/k3b-9999 failed.
* Call stack:


Kdevelop-9999 wants in any case the kde live ebuilds installed...



For me the list of doesn't compile is:
* The following packages have failed to build or install:
*
* ('ebuild', '/', 'kde-base/marble-4.1.85', 'merge')
* ('ebuild', '/', 'kde-base/kdeartwork-kscreensaver-4.1.85', 'merge')
* ('ebuild', '/', 'kde-base/kdeplasma-addons-4.1.85', 'merge')
* ('ebuild', '/', 'kde-base/ktux-4.1.85', 'merge')
* ('ebuild', '/', 'kde-base/pykde4-4.1.85', 'merge')

Emerge info:
Code:

Portage 2.2_rc17 (default/linux/amd64/2008.0/desktop, gcc-4.1.2, glibc-2.7-r2, 2.6.26-gentoo-r4 x86_64)
=================================================================                                     
System uname: Linux-2.6.26-gentoo-r4-x86_64-Intel-R-_Core-TM-2_Duo_CPU_T8100_@_2.10GHz-with-glibc2.2.5
Timestamp of tree: Thu, 18 Dec 2008 09:07:03 +0000                                                     
app-shells/bash:     3.2_p33                                                                           
dev-java/java-config: 1.3.7-r1, 2.1.6-r1                                                               
dev-lang/python:     2.4.4-r13, 2.5.2-r7                                                               
dev-util/cmake:      2.6.2                                                                             
sys-apps/baselayout: 2.0.0                                                                             
sys-apps/openrc:     0.3.0-r1
sys-apps/sandbox:    1.2.18.1-r2
sys-devel/autoconf:  2.13, 2.61-r2
sys-devel/automake:  1.5, 1.7.9-r1, 1.8.5-r3, 1.9.6-r2, 1.10.1-r1
sys-devel/binutils:  2.18-r3
sys-devel/gcc-config: 1.4.0-r4
sys-devel/libtool:   1.5.26
virtual/os-headers:  2.6.23-r3
ACCEPT_KEYWORDS="amd64"
CBUILD="x86_64-pc-linux-gnu"
CFLAGS="-O2 -pipe"
CHOST="x86_64-pc-linux-gnu"
CONFIG_PROTECT="/etc /usr/kde/3.5/env /usr/kde/3.5/share/config /usr/kde/3.5/shutdown /usr/kde/4.1/env /usr/kde/4.1/share/config /usr/kde/4.1/shutdown /usr/kde/4.2/env /usr/kde/4.2/share/config /usr/kde/4.2/shutdown /usr/share/config /var/lib/hsqldb"
CONFIG_PROTECT_MASK="/etc/ca-certificates.conf /etc/env.d /etc/env.d/java/ /etc/fonts/fonts.conf /etc/gconf /etc/gentoo-release /etc/php/apache2-php5/ext-active/ /etc/php/cgi-php5/ext-active/ /etc/php/cli-php5/ext-active/ /etc/revdep-rebuild /etc/terminfo /etc/udev/rules.d"
CXXFLAGS="-O2 -pipe"
DISTDIR="/usr/portage/distfiles"
FEATURES="distlocks fixpackages parallel-fetch preserve-libs protect-owned sandbox sfperms strict unmerge-orphans userfetch"
GENTOO_MIRRORS="http://gentoo.lagis.at"
LANG="ca_ES.UTF-8"
LDFLAGS="-Wl,-O1"
LINGUAS="es ca"
MAKEOPTS="-j4"
PKGDIR="/usr/portage/packages"
PORTAGE_RSYNC_OPTS="--recursive --links --safe-links --perms --times --compress --force --whole-file --delete --stats --timeout=180 --exclude=/distfiles --exclude=/local --exclude=/packages"
PORTAGE_TMPDIR="/home/tmp_portage/"
PORTDIR="/usr/portage"
PORTDIR_OVERLAY="/usr/portage/local/layman/kde-testing /usr/portage/local/layman/kde-crazy /usr/portage/local/layman/sunrise /usr/portage/local/layman/local"
SYNC="rsync://rsync.gentoo.org/gentoo-portage"
USE="X acl acpi alsa amd64 berkdb bluetooth branding bzip2 cairo cdr cli cracklib crypt cups dbus dri dvd dvdr dvdread eds emboss encode esd evo fam firefox fortran gdbm gif gpm gstreamer gtk hal iconv ipod ipv6 isdnlog java jpeg kde kdeprefix ldap libnotify mad midi mikmod mmx mozilla mp3 mp3tunes mp4 mpeg mudflap multilib mysql ncurses nls nptl nptlonly ogg opengl openmp oss pam pcre pdf perl png ppds pppd python qt3 qt3support qt4 quicktime readline reflection sdl session sha512 spell spl sse sse2 ssl startup-notification svg sysfs tcpd tiff truetype unicode usb visualitzation vorbis wxwindows xcomposite xml xorg xulrunner xv zlib" ALSA_CARDS="hda-intel" ALSA_PCM_PLUGINS="adpcm alaw asym copy dmix dshare dsnoop empty extplug file hooks iec958 ioplug ladspa lfloat linear meter mmap_emul mulaw multi null plug rate route share shm softvol" APACHE2_MODULES="actions alias auth_basic authn_alias authn_anon authn_dbm authn_default authn_file authz_dbm authz_default authz_groupfile authz_host authz_owner authz_user autoindex cache dav dav_fs dav_lock deflate dir disk_cache env expires ext_filter file_cache filter headers include info log_config logio mem_cache mime mime_magic negotiation rewrite setenvif speling status unique_id userdir usertrack vhost_alias" ELIBC="glibc" INPUT_DEVICES="keyboard mouse synaptic" KERNEL="linux" LCD_DEVICES="bayrad cfontz cfontz633 glk hd44780 lb216 lcdm001 mtxorb ncurses text" LINGUAS="es ca" USERLAND="GNU" VIDEO_CARDS="nvidia vesa vga"
Unset:  CPPFLAGS, CTARGET, EMERGE_DEFAULT_OPTS, FFLAGS, INSTALL_MASK, LC_ALL, PORTAGE_COMPRESS, PORTAGE_COMPRESS_FLAGS, PORTAGE_RSYNC_EXTRA_OPTS

Back to top
View user's profile Send private message
ssmaxss
Apprentice
Apprentice


Joined: 28 Jun 2005
Posts: 160
Location: Moscow, Russia.

PostPosted: Thu Dec 18, 2008 7:43 pm    Post subject: Reply with quote

For me all the same packages fails, except kde-base/pykde4-4.1.85. It build ok.
Back to top
View user's profile Send private message
drescherjm
Advocate
Advocate


Joined: 05 Jun 2004
Posts: 2779
Location: Pittsburgh, PA, USA

PostPosted: Thu Dec 18, 2008 7:53 pm    Post subject: Reply with quote

I don't know if this will help but here is my emerge --info for a system where all packages compiled and installed fine:

Code:
# emerge --info
Portage 2.2_rc17 (default/linux/amd64/2008.0, gcc-4.3.2, glibc-2.8_p20080602-r1, 2.6.26-openvz-dvb-ext4-00011-g89451f9 x86_64)
=================================================================
System uname: Linux-2.6.26-openvz-dvb-ext4-00011-g89451f9-x86_64-Intel-R-_Core-TM-2_Quad_CPU_Q9550_@_2.83GHz-with-glibc2.2.5
Timestamp of tree: Thu, 18 Dec 2008 08:00:01 +0000
ccache version 2.4 [enabled]
app-shells/bash:     3.2_p48
dev-java/java-config: 1.3.7-r1, 2.1.6-r1
dev-lang/python:     2.5.2-r7
dev-util/ccache:     2.4-r7
dev-util/cmake:      2.6.2
sys-apps/baselayout: 2.0.0
sys-apps/openrc:     0.3.0-r1
sys-apps/sandbox:    1.2.18.1-r3
sys-devel/autoconf:  2.13, 2.61-r2
sys-devel/automake:  1.5, 1.7.9-r1, 1.8.5-r3, 1.9.6-r2, 1.10.1-r1
sys-devel/binutils:  2.18-r3
sys-devel/gcc-config: 1.4.0-r4
sys-devel/libtool:   1.5.26
virtual/os-headers:  2.6.26
ACCEPT_KEYWORDS="amd64"
CBUILD="x86_64-pc-linux-gnu"
CFLAGS="-march=core2 -O2 -pipe"
CHOST="x86_64-pc-linux-gnu"
CONFIG_PROTECT="/etc /usr/kde/3.5/env /usr/kde/3.5/share/config /usr/kde/3.5/shutdown /usr/share/config"
CONFIG_PROTECT_MASK="/etc/ca-certificates.conf /etc/env.d /etc/env.d/java/ /etc/fonts/fonts.conf /etc/gconf /etc/gentoo-release /etc/revdep-rebuild /etc/terminfo /etc/texmf/web2c /etc/udev/rules.d"
CXXFLAGS="-O2 -pipe"
DISTDIR="/mnt/autofs/distfiles"
EMERGE_DEFAULT_OPTS="--keep-going --jobs 6"
FEATURES="ccache distlocks fixpackages parallel-fetch preserve-libs protect-owned sandbox sfperms strict unmerge-orphans userfetch"
GENTOO_MIRRORS="http://distfiles.gentoo.org http://distro.ibiblio.org/pub/linux/distributions/gentoo"
LDFLAGS="-Wl,-O1"
MAKEOPTS="-j9"
PKGDIR="/usr/portage/packages"
PORTAGE_RSYNC_EXTRA_OPTS="--exclude='/lost+found'"
PORTAGE_RSYNC_OPTS="--recursive --links --safe-links --perms --times --compress --force --whole-file --delete --stats --timeout=180 --exclude=/distfiles --exclude=/local --exclude=/packages"
PORTAGE_TMPDIR="/var/tmp"
PORTDIR="/mnt/autofs/portage"
PORTDIR_OVERLAY="/mnt/autofs/portage/local/layman/sunrise /mnt/autofs/portage/local/layman/kde-crazy /mnt/autofs/portage/local/layman/gnome /mnt/autofs/portage/local/layman/jmd-gentoo"
SYNC="rsync://rsync.gentoo.org/gentoo-portage"
USE="7zip X Xaw3d aac acl acpi alsa amd amd64 auto-completion avahi bacula-console bacula-split-init bash-completion bazaar berkdb boost branding bzip2 c++ cairo caps ccache cdrom cg cgi cli colordiff compress compression contrib corefonts cpudetection cpufreq cracklib crypt cups custom-cflags custom-cpuopts cvs cvsgraph cxx dbus dhcpcd dosbox dri dvb dvd dvdarchive dvdnav dvdr dvi excel expat ffmpeg fftw firefox3 flash font-server fontconfig fontforge foomaticdb fortran gdbm gif git gkrellm glade glib glut gmail gnome gnome-keyring gnome-print gnomecanvas gnomecd gnutls gphoto2 gpm graphviz grub gtk gzip hal hddtemp hibernate-script html hvm iconv ieee1394 image imagemagick ivtv jpeg ldap logrotate lvm lvm2 md5sum mdnsresponder-compat midi mjpeg mmx mp3 mpeg mudflap multilib mysql ncurses nls nptl nptlonly opengl openmp pam pcre perl png pppd python qt3 qt4 readline reflection scenarios sdl sensord session sharedext sharedmem smp sound spell spl sql sqlite sqlite3 sse sse2 sse3 ssl ssse3 stlport subversion svg sysfs syslog tcpd templates themes thesaurus threads threadsafe tiff toolbar tools transcode truetype twolame type1 unicode unzip v4l v4l2 vboxwebsrv wav wavpack webkit wxwindows x264 x86emu xattr xfs xft xine xml xorg xslt xterm xterm-color xulrunner xvid xvmc zip zlib" ALSA_CARDS="snd_ac97_bus snd_intel8x0" ALSA_PCM_PLUGINS="adpcm alaw asym copy dmix dshare dsnoop empty extplug file hooks iec958 ioplug ladspa lfloat linear meter mmap_emul mulaw multi null plug rate route share shm softvol" APACHE2_MODULES="actions alias auth_basic authn_alias authn_anon authn_dbm authn_default authn_file authz_dbm authz_default authz_groupfile authz_host authz_owner authz_user autoindex cache dav dav_fs dav_lock deflate dir disk_cache env expires ext_filter file_cache filter headers include info log_config logio mem_cache mime mime_magic negotiation rewrite setenvif speling status unique_id userdir usertrack vhost_alias" DVB_CARDS="nxt200x" ELIBC="glibc" INPUT_DEVICES="keyboard mouse" KERNEL="linux" LCD_DEVICES="bayrad cfontz cfontz633 glk hd44780 lb216 lcdm001 mtxorb ncurses text" USERLAND="GNU" VIDEO_CARDS="nv nvidia"
Unset:  CPPFLAGS, CTARGET, FFLAGS, INSTALL_MASK, LANG, LC_ALL, LINGUAS, PORTAGE_COMPRESS, PORTAGE_COMPRESS_FLAGS

jmd0 ~ #

_________________
John

My gentoo overlay
Instructons for overlay
Back to top
View user's profile Send private message
ssmaxss
Apprentice
Apprentice


Joined: 28 Jun 2005
Posts: 160
Location: Moscow, Russia.

PostPosted: Thu Dec 18, 2008 8:03 pm    Post subject: Reply with quote

You are not using kdeprefix? Can you ls directory /usr/kde/4.2/lib/KDE4Workspace/ or another one, that corresponds to it with kdeprefix disables.
Back to top
View user's profile Send private message
sgao
Tux's lil' helper
Tux's lil' helper


Joined: 22 Apr 2006
Posts: 149

PostPosted: Thu Dec 18, 2008 8:08 pm    Post subject: Re: nepomuk-4.1.82 failed compiling Reply with quote

[quote="sgao"]nepomuk failed compiling with following error:
[/quot]

nepomuk-4.1.85 compiled without any problem.
Back to top
View user's profile Send private message
drescherjm
Advocate
Advocate


Joined: 05 Jun 2004
Posts: 2779
Location: Pittsburgh, PA, USA

PostPosted: Thu Dec 18, 2008 8:11 pm    Post subject: Reply with quote

ssmaxss wrote:
You are not using kdeprefix?

No, I do not have that enabled. I have not noticed it until now..

Quote:
Can you ls directory /usr/kde/4.2/lib/KDE4Workspace/ or another one, that corresponds to it with kdeprefix disables.


I do not have a /usr/kde/4.2

It looks like most kde4-2 stuff goes to
/usr/lib64/kde4/
_________________
John

My gentoo overlay
Instructons for overlay
Back to top
View user's profile Send private message
Display posts from previous:   
This topic is locked: you cannot edit posts or make replies.    Gentoo Forums Forum Index Unsupported Software All times are GMT
Goto page Previous  1, 2, 3 ... 24, 25, 26 ... 28, 29, 30  Next
Page 25 of 30

 
Jump to:  
You cannot post new topics in this forum
You cannot reply to topics in this forum
You cannot edit your posts in this forum
You cannot delete your posts in this forum
You cannot vote in polls in this forum