Gentoo Forums
Gentoo Forums
Gentoo Forums
Quick Search: in
KDE experimental overlay (genkdesvn) Part 7
View unanswered posts
View posts from last 24 hours

Goto page 1, 2, 3, 4, 5, 6, 7  Next  
Reply to topic    Gentoo Forums Forum Index Unsupported Software
View previous topic :: View next topic  
Author Message
loftwyr
l33t
l33t


Joined: 29 Dec 2004
Posts: 970
Location: 43°38'23.62"N 79°27'8.60"W

PostPosted: Tue Sep 30, 2008 1:44 am    Post subject: KDE experimental overlay (genkdesvn) Part 7 Reply with quote

This is the seventh part of the support thread for the KDE4 experimental overlay. You'll find part 6 here

The KDE overlay contains live ebuilds for KDE4 trunk. The regular KDE 4.0.0 ebuilds are now in the official Portage tree.

The overlay is maintained by:

Bo Ørsted Andresen - zlin (bo.andresen at zlin.dk)
Timo Gurr - tgurr (tgurr at gentoo.org)
Friedrich Kroener - friedrich| (friedrich at polizisten-duzer.de)
Wulf C. Krueger - Philantrop (philantrop at exherbo.org)

Emeriti maintainers:
Emanuele A. Bagnaschi - Zephyrus (zephyrus at mirach.it)
Christian Heim - phreak (phreak at gentoo.org)
Jorge Manuel B. S. Vicetto - jmbsvicetto (jmbsvicetto at gentoo.org)
Tobias Heinlein - keytoaster ( keytoaster at gentoo.org )
Ingmar Vanhassel - Ingmar (ingmar at exherbo.org)
Bernd Steinhauser - berniyh ( berniyh at exherbo.org )

IMPORTANT NOTES


1. Read the docs (details below). We reserve the right to kick you where it hurts if you don't. ;->
2. We're not responsible for any damages these ebuilds can do to your computer.
3. Do _NOT_ report bugs on Gentoo's bugzilla, report them here



You'll find us on Freenode in #genkdesvn and, sometimes, here if you need help. We definitely prefer IRC, though.

To check the overlay Documentation look at the README and ReleaseNotes files and the /Documentation directory in the overlay tree. The KDE 4.0 live packages have been slotted and shouldn't cause any problems with the 3.5 slot.

Note from the maintainers of the live ebuilds:
For users of the this overlay's ebuilds, you will have to use Paludis. You can find all the details in this e-mail.
_________________
My emerge --info
Have you run revdep-rebuild lately? It's in gentoolkit and it's worth a shot if things don't work well.
Celebrating 5 years of Gentoo-ing.
Back to top
View user's profile Send private message
enzobelmont
Guru
Guru


Joined: 06 Apr 2004
Posts: 345
Location: Chiapas, Mexico

PostPosted: Tue Sep 30, 2008 12:00 pm    Post subject: Reply with quote

plasma still broken:
Code:

X Error: BadWindow (invalid Window parameter) 3
  Major opcode: 18 (X_ChangeProperty)
  Resource id:  0x2c00038
QFSFileEngine::open: No file name specified
QLayout: Attempting to add QLayout "" to Plasma::Dialog "", which already has a layout
plasma(23680) Plasma::AppletPrivate::mainConfigGroup: requesting config for "Monitor de batería" without a containment!
plasma(23680) Plasma::AppletPrivate::mainConfigGroup: requesting config for "Monitor de batería" without a containment!
QGraphicsLayout::addChildLayout: layout already has a parent
QGraphicsLayout::addChildLayout: layout already has a parent
sh: plasma: command not found
plasma(23679): Communication problem with  "plasma" , it probably crashed.
Error message was:  "org.freedesktop.DBus.Error.NoReply" : " "Message did not receive a reply (timeout by message bus)" "


any idea?

thanks in advance.
_________________
Mens sana in corpore sano... Gentoo laetificat cor hominis
Back to top
View user's profile Send private message
beso_1717
Apprentice
Apprentice


Joined: 19 Jul 2007
Posts: 263

PostPosted: Tue Sep 30, 2008 1:43 pm    Post subject: Reply with quote

enzobelmont wrote:
plasma still broken:
Code:

X Error: BadWindow (invalid Window parameter) 3
  Major opcode: 18 (X_ChangeProperty)
  Resource id:  0x2c00038
QFSFileEngine::open: No file name specified
QLayout: Attempting to add QLayout "" to Plasma::Dialog "", which already has a layout
plasma(23680) Plasma::AppletPrivate::mainConfigGroup: requesting config for "Monitor de batería" without a containment!
plasma(23680) Plasma::AppletPrivate::mainConfigGroup: requesting config for "Monitor de batería" without a containment!
QGraphicsLayout::addChildLayout: layout already has a parent
QGraphicsLayout::addChildLayout: layout already has a parent
sh: plasma: command not found
plasma(23679): Communication problem with  "plasma" , it probably crashed.
Error message was:  "org.freedesktop.DBus.Error.NoReply" : " "Message did not receive a reply (timeout by message bus)" "


any idea?

thanks in advance.


what dbus version do you have?
Back to top
View user's profile Send private message
enzobelmont
Guru
Guru


Joined: 06 Apr 2004
Posts: 345
Location: Chiapas, Mexico

PostPosted: Tue Sep 30, 2008 2:06 pm    Post subject: Reply with quote

paludis -pi shows this:
Code:
* sys-apps/dbus [R 1.2.3] <target>
    X -debug -doc (-selinux)
    1.49 MBytes to download

Total: 1 package (1 rebuild), 1.49 MBytes to download


qt-dbus:
Code:
* x11-libs/qt-dbus :4 [R 4.4.2] <target>
    Reasons: x11-libs/qt-gui-4.4.2:4::installed
    -debug -pch

Total: 1 package (1 rebuild)

_________________
Mens sana in corpore sano... Gentoo laetificat cor hominis
Back to top
View user's profile Send private message
2dimm
n00b
n00b


Joined: 10 Jun 2005
Posts: 52
Location: Brussels, Belgium

PostPosted: Tue Sep 30, 2008 3:11 pm    Post subject: Reply with quote

hmm - same versions, same problem - have had this for 10 days or so : a clean .kdesvn is no help. If I delete the plasmarc & plasmappletsrc config files then plasma 'works' but i have a large battery monitor helpfully telling me how much life is left in my mouse (though at present that doesn't seem to work either - it did yesterday) & other power controls. If I delete the monitor then plasma crashes & I need to remove config files & start afresh. I presumed this was just a matter of waiting, but if anyone knows different I should be glad to know.


enzobelmont wrote:
paludis -pi shows this:
Code:
* sys-apps/dbus [R 1.2.3] <target>
    X -debug -doc (-selinux)
    1.49 MBytes to download

Total: 1 package (1 rebuild), 1.49 MBytes to download


qt-dbus:
Code:
* x11-libs/qt-dbus :4 [R 4.4.2] <target>
    Reasons: x11-libs/qt-gui-4.4.2:4::installed
    -debug -pch

Total: 1 package (1 rebuild)


On another topic - is anyone able to use the audiocd slave? I can see music cds fine in k3b but unable to read in Dolphin or Konqueror as either user or root when entering audiocd:/ - it goes without saying that audio cds are not automatically detected. I am a member of plugdev, disk, cdrom, cdrw & audio groups. CD device is specified as /dev/dvd which is a link to /dev/hda to which I have read & write permissions. any ideas, or is this just not working? thanks...
Back to top
View user's profile Send private message
loftwyr
l33t
l33t


Joined: 29 Dec 2004
Posts: 970
Location: 43°38'23.62"N 79°27'8.60"W

PostPosted: Tue Sep 30, 2008 3:46 pm    Post subject: Reply with quote

try renaming both .kdesvn AND .local and see if that helps.
_________________
My emerge --info
Have you run revdep-rebuild lately? It's in gentoolkit and it's worth a shot if things don't work well.
Celebrating 5 years of Gentoo-ing.
Back to top
View user's profile Send private message
2dimm
n00b
n00b


Joined: 10 Jun 2005
Posts: 52
Location: Brussels, Belgium

PostPosted: Tue Sep 30, 2008 4:32 pm    Post subject: Reply with quote

loftwyr wrote:
try renaming both .kdesvn AND .local and see if that helps.


Many thanks... but no luck. In fact I had to do just that a week or so back for some other reason but anyway I tried again & even cleared out everything from the user directory - still my lovely battery status monitor. For what it's worth I also deleted /usr/kde & assorted shared kde directories last week, but have obviously either not found the right one or the 'problem' is ongoing - which would seem likely given the rate of change of the monitor. However - given the lack of documentation of this - on Gentoo or other distributions (i think I found just one other reference) it would appear that only some people are experiencing this so could it be hardware (or kernel) related?
Back to top
View user's profile Send private message
chh
Tux's lil' helper
Tux's lil' helper


Joined: 16 May 2002
Posts: 131
Location: Germany

PostPosted: Tue Sep 30, 2008 5:37 pm    Post subject: Reply with quote

Hi,

I have a problem installing digikam.
I get this error:
Package 'media-gfx/digikam-9999' NOT merged due to file collisions. If
necessary, refer to your elog messages for the whole content of the
above message.

Several files in /usr/kde/svn/share/icons/oxygen/ are reported that are owned by kdebase-data.

What can I do here?

Thanks

Christian
Back to top
View user's profile Send private message
Zach_the_Lizard
n00b
n00b


Joined: 20 Jun 2008
Posts: 17
Location: /root

PostPosted: Tue Sep 30, 2008 7:53 pm    Post subject: Reply with quote

I have had trouble updating kde in the past few days. I am trying to compile an update for KDE-svn for a more recent build, but, strangely, running "emerge @kde-svn" now seems to pull in k3b:svn. That's all well and good, but somehow or another I don't have the k3b:svn ebuild. It complains: emerge: there are no ebuilds to satisfy "app-cdr/k3b:kde-svn". I can verify that this is not the case, but how can I remove k3b from the kde-svn? I don't have it installed now. Also, removing, readding, syncing, etc. the kde overlay with layman does not download a k3b ebuild. Any ideas where I could find this evil ebuild?

EDIT:

Well, it appears the problem was solved with another sync. I must have done something wrong. Maybe I typed in the wrong overlay.
Back to top
View user's profile Send private message
2dimm
n00b
n00b


Joined: 10 Jun 2005
Posts: 52
Location: Brussels, Belgium

PostPosted: Wed Oct 01, 2008 7:46 am    Post subject: Reply with quote

loftwyr wrote:
try renaming both .kdesvn AND .local and see if that helps.


After an overnight update the problem is gone - however, I had also deleted /usr/share/kde4 & /usr/lib64/kde4 :) - I suspect that the latter was the problem as I tried the same trick on another box & acheieved the same result after deleting monitor & restarting plasma.

Still no-one able to confirm if they have a working or non-working audiocd? After restoring a missing udev rule I am able to access audiocd:/ in both Dolphin & Konqueror - however the device is not shown in the sidebar & the track listing halts after 5/6 tracks - either freezing dolphin or crashing the session. Nepomuk is essential for track listing - is this the root of the problem? Any ideas?
Back to top
View user's profile Send private message
dracula1985
Apprentice
Apprentice


Joined: 13 May 2005
Posts: 299
Location: Vicenza (Italy)

PostPosted: Thu Oct 02, 2008 8:19 am    Post subject: Reply with quote

Hello everybody, I'm back after a really long absence!

I have some problems with k3b and amarok ebuilds:
Code:
* app-cdr/k3b::kde4-experimental :kde-svn [R scm] <target>
    css -debug dvdr dvdread -emovix encode ffmpeg flac hal -htmlhandbook mp3 musepack musicbrainz sndfile vcd vorbis

Total: 1 package (1 rebuild)

(1 of 1) Installing app-cdr/k3b-scm:kde-svn::kde4-experimental

>>> Running ebuild phase killold as root:root...                                                                                                                           
>>> Starting builtin_killold                                                                                                                                               
>>> Done builtin_killold                                                                                                                                                   
>>> Completed ebuild phase killold                                                                                                                                         
>>> Running ebuild phases init saveenv as root:root...                                                                                                                     
>>> Starting builtin_init                                                                                                                                                   
>>> Done builtin_init                                                                                                                                                       
>>> Starting builtin_saveenv                                                                                                                                               
>>> Done builtin_saveenv                                                                                                                                                   
>>> Completed ebuild phases init saveenv                                                                                                                                   
>>> Running ebuild phases loadenv setup saveenv as root:root...                                                                                                             
>>> Starting builtin_loadenv                                                                                                                                               
>>> Done builtin_loadenv                                                                                                                                                   
>>> Starting pkg_setup                                                                                                                                                     

 * WARNING! This is an experimental ebuild of the extragear/multimedia KDE4 SVN tree.
 * Use at your own risk. File a bug at https://www2.mailstation.de/bugzilla if you   
 * run into problems. Or join #genkdesvn on the great Freenode IRC network.         

>>> Done pkg_setup
>>> Starting builtin_saveenv
>>> Done builtin_saveenv   
>>> Completed ebuild phases loadenv setup saveenv
>>> Running ebuild phases loadenv unpack compile saveenv as root:root...
>>> Starting builtin_loadenv                                           
>>> Done builtin_loadenv                                               
>>> Starting src_unpack                                                 
 * Fetching disabled since 1 hours has not passed since last update.   
 * Using existing repository copy at revision 866884.                   
 *    working copy: /usr/portage/distfiles/svn-src/KDE/extragear/multimedia/multimedia

 * Exporting parts of working copy to /var/tmp/paludis/app-cdr-k3b-scm/work/k3b
 * Applying k3b-scm-ffmpeg-0.4.9_p20080326-includes.patch ...                 

 * Failed Patch: k3b-scm-ffmpeg-0.4.9_p20080326-includes.patch !
 *  ( /var/paludis/repositories/kde/app-cdr/k3b/files/k3b-scm-ffmpeg-0.4.9_p20080326-includes.patch )
 *                                                                                                   
 * Include in your bugreport the contents of:                                                       
 *                                                                                                   
 *   /var/tmp/paludis/app-cdr-k3b-scm/temp//k3b-scm-ffmpeg-0.4.9_p20080326-includes.patch-30443.out 


!!! ERROR in app-cdr/k3b-scm:
!!! In epatch at line 2382   
!!! Failed Patch: k3b-scm-ffmpeg-0.4.9_p20080326-includes.patch!

!!! Call stack:
!!!    * epatch (/var/tmp/paludis/app-cdr-k3b-scm/temp/loadsaveenv:2382)
!!!    * base_src_unpack (/var/tmp/paludis/app-cdr-k3b-scm/temp/loadsaveenv:691)
!!!    * gks-base_apply_patches (/var/tmp/paludis/app-cdr-k3b-scm/temp/loadsaveenv:2822)
!!!    * gks-svn-meta_src_unpack (/var/tmp/paludis/app-cdr-k3b-scm/temp/loadsaveenv:3299)
!!!    * src_unpack (/var/tmp/paludis/app-cdr-k3b-scm/temp/loadsaveenv:4281)             
!!!    * ebuild_f_unpack (/usr/libexec/paludis/0/src_unpack.bash:42)                     
!!!    * ebuild_main (/usr/libexec/paludis/ebuild.bash:470)                             
!!!    * main (/usr/libexec/paludis/ebuild.bash:485)

Code:
* media-sound/amarok::kde4-experimental :kde-svn [R scm] <target>
    cdaudio -daap -debug -ifp -ipod -mp3tunes mp4 -mtp mysql -njb opengl semantic-desktop

Total: 1 package (1 rebuild)

(1 of 1) Installing media-sound/amarok-scm:kde-svn::kde4-experimental

>>> Running ebuild phase killold as root:root...                                                                                                                               
>>> Starting builtin_killold                                                                                                                                                   
>>> Done builtin_killold                                                                                                                                                       
>>> Completed ebuild phase killold                                                                                                                                             
>>> Running ebuild phases init saveenv as root:root...                                                                                                                         
>>> Starting builtin_init                                                                                                                                                     
>>> Done builtin_init                                                                                                                                                         
>>> Starting builtin_saveenv                                                                                                                                                   
>>> Done builtin_saveenv                                                                                                                                                       
>>> Completed ebuild phases init saveenv                                                                                                                                       
>>> Running ebuild phases loadenv setup saveenv as root:root...                                                                                                               
>>> Starting builtin_loadenv                                                                                                                                                   
>>> Done builtin_loadenv                                                                                                                                                       
>>> Starting pkg_setup                                                                                                                                                         
 * amarok-scm is _alpha_ software.                                                                                                                                             
 * Do _NOT_ bother the upstream developers unless you plan to provide them with patches.                                                                                       

 * WARNING! This is an experimental ebuild of the extragear/multimedia KDE4 SVN tree.
 * Use at your own risk. File a bug at https://www2.mailstation.de/bugzilla if you   
 * run into problems. Or join #genkdesvn on the great Freenode IRC network.         

>>> Done pkg_setup
>>> Starting builtin_saveenv
>>> Done builtin_saveenv   
>>> Completed ebuild phases loadenv setup saveenv
>>> Running ebuild phases loadenv unpack compile saveenv as root:root...
>>> Starting builtin_loadenv                                           
>>> Done builtin_loadenv                                               
>>> Starting src_unpack                                                 
 * Fetching disabled since 1 hours has not passed since last update.   
 * Using existing repository copy at revision 866897.                   
 *    working copy: /usr/portage/distfiles/svn-src/KDE/extragear/multimedia/multimedia

 * Exporting parts of working copy to /var/tmp/paludis/media-sound-amarok-scm/work/amarok
>>> Done src_unpack                                                                     
>>> Starting src_compile                                                                 
-- The C compiler identification is GNU                                                 
-- The CXX compiler identification is GNU                                               
-- Check for working C compiler: /usr/bin/x86_64-pc-linux-gnu-gcc                       
-- Check for working C compiler: /usr/bin/x86_64-pc-linux-gnu-gcc -- works               
-- Detecting C compiler ABI info                                                         
-- Detecting C compiler ABI info - done                                                 
-- Check for working CXX compiler: /usr/bin/x86_64-pc-linux-gnu-g++                     
-- Check for working CXX compiler: /usr/bin/x86_64-pc-linux-gnu-g++ -- works             
-- Detecting CXX compiler ABI info                                                       
-- Detecting CXX compiler ABI info - done                                               
-- Looking for Q_WS_X11                                                                 
-- Looking for Q_WS_X11 - found                                                         
-- Looking for Q_WS_WIN                                                                 
-- Looking for Q_WS_WIN - not found.                                                     
-- Looking for Q_WS_QWS                                                                 
-- Looking for Q_WS_QWS - not found.                                                     
-- Looking for Q_WS_MAC                                                                 
-- Looking for Q_WS_MAC - not found.                                                     
-- Found Qt-Version 4.4.2 (using /usr/bin/qmake)                                         
-- Looking for XOpenDisplay in /usr/lib64/libX11.so;/usr/lib64/libXext.so;/usr/lib64/libXft.so;/usr/lib64/libXau.so;/usr/lib64/libXdmcp.so;/usr/lib64/libXpm.so
-- Looking for XOpenDisplay in /usr/lib64/libX11.so;/usr/lib64/libXext.so;/usr/lib64/libXft.so;/usr/lib64/libXau.so;/usr/lib64/libXdmcp.so;/usr/lib64/libXpm.so - found
-- Looking for gethostbyname                                                                                                                                           
-- Looking for gethostbyname - found                                                                                                                                   
-- Looking for connect                                                                                                                                                 
-- Looking for connect - found                                                                                                                                         
-- Looking for remove                                                                                                                                                 
-- Looking for remove - found                                                                                                                                         
-- Looking for shmat                                                                                                                                                   
-- Looking for shmat - found                                                                                                                                           
-- Looking for IceConnectionNumber in ICE                                                                                                                             
-- Looking for IceConnectionNumber in ICE - found                                                                                                                     
-- Found X11: /usr/lib64/libX11.so                                                                                                                                     
-- Looking for include files CMAKE_HAVE_PTHREAD_H                                                                                                                     
-- Looking for include files CMAKE_HAVE_PTHREAD_H - found                                                                                                             
-- Looking for pthread_create in pthreads                                                                                                                             
-- Looking for pthread_create in pthreads - not found                                                                                                                 
-- Looking for pthread_create in pthread                                                                                                                               
-- Looking for pthread_create in pthread - found                                                                                                                       
-- Found Threads: TRUE                                                                                                                                                 
-- Found Automoc4: /usr/bin/automoc4                                                                                                                                   
-- Found Perl: /usr/bin/perl                                                                                                                                           
-- Performing Test _OFFT_IS_64BIT                                                                                                                                     
-- Performing Test _OFFT_IS_64BIT - Success                                                                                                                           
-- Performing Test HAVE_FPIE_SUPPORT                                                                                                                                   
-- Performing Test HAVE_FPIE_SUPPORT - Success                                                                                                                         
-- Performing Test __KDE_HAVE_W_OVERLOADED_VIRTUAL                                                                                                                     
-- Performing Test __KDE_HAVE_W_OVERLOADED_VIRTUAL - Success                                                                                                           
-- Performing Test __KDE_HAVE_GCC_VISIBILITY                                                                                                                           
-- Performing Test __KDE_HAVE_GCC_VISIBILITY - Success                                                                                                                 
-- Found Phonon: /usr/kde/svn/lib64/libphonon.so                                                                                                                       
-- Found Phonon Includes: /usr/kde/svn/include/KDE;/usr/kde/svn/include                                                                                               
-- Found KDE 4.2 include dir: /usr/kde/svn/include                                                                                                                     
-- Found KDE 4.2 library dir: /usr/kde/svn/lib64                                                                                                                       
-- Found KDE4 kconfig_compiler preprocessor: /usr/kde/svn/bin/kconfig_compiler                                                                                         
-- Found automoc4: /usr/bin/automoc4                                                                                                                                   
-- Found KdeMultimedia: /usr/kde/svn/lib64/libkcddb.so;/usr/kde/svn/lib64/libkcompactdisc.so                                                                           
-- WARNING: you are using the obsolete 'PKGCONFIG' macro use FindPkgConfig                                                                                             
-- Performing Test XINE_XCB_FOUND                                                                                                                                     
-- Performing Test XINE_XCB_FOUND - Success                                                                                                                           
-- Found XINE: /usr/lib64/libxine.so                                                                                                                                   
-- Found taglib: -L/usr/lib64 -ltag                                                                                                                                   
-- Taglib found: -L/usr/lib64 -ltag                                                                                                                                   
Qt QTNSPLUGIN library not found.                                                                                                                                       
-- Looking for dlopen in dl                                                                                                                                           
-- Looking for dlopen in dl - found                                                                                                                                   
-- Found taglib: -L/usr/lib64 -ltag                                                                                                                                   
-- Taglib found: -L/usr/lib64 -ltag                                                                                                                                   
-- WARNING: you are using the obsolete 'PKGCONFIG' macro use FindPkgConfig                                                                                             
-- Found Strigi 0.6.0                                                                                                                                                 
-- Found Strigi: /usr/lib64/libstreams.so                                                                                                                             
-- Performing Test HAVE_MYSQL_OPT_EMBEDDED_CONNECTION                                                                                                                 
-- Performing Test HAVE_MYSQL_OPT_EMBEDDED_CONNECTION - Success                                                                                                       
-- Found MySQL: /usr/include/mysql, /usr/lib64/libmysqlclient.so                                                                                                       
-- MySQL Embedded not found.                                                                                                                                           
-- Found ZLIB: /lib64/libz.so                                                                                                                                         
-- WARNING: you are using the obsolete 'PKGCONFIG' macro use FindPkgConfig                                                                                             
-- Found GLIB2: /usr/lib64/libglib-2.0.so                                                                                                                             
-- WARNING: you are using the obsolete 'PKGCONFIG' macro use FindPkgConfig                                                                                             
-- Found Gdk: /usr/include/gtk-2.0                                                                                                                                     
-- Found MP4V2: /usr/lib64/libmp4v2.so                                                                                                                                 
-- Found CURL: /usr/lib64/libcurl.so                                                                                                                                   
-- WARNING: you are using the obsolete 'PKGCONFIG' macro use FindPkgConfig                                                                                             
-- Found LibXml2: /usr/lib64/libxml2.so                                                                                                                               
-- Found OpenSSL: /usr/lib64/libssl.so                                                                                                                                 
-- Looking for include files HAVE_GCRYPT_H                                                                                                                             
-- Looking for include files HAVE_GCRYPT_H - found                                                                                                                     
-- Libgcrypt found: /usr/lib64/libgcrypt.so                                                                                                                           
-- WARNING: you are using the obsolete 'PKGCONFIG' macro use FindPkgConfig                                                                                             
-- Found GObject libraries: /usr/lib64/libgobject-2.0.so;/usr/lib64/libgmodule-2.0.so;/usr/lib64/libgthread-2.0.so;/usr/lib64/libglib-2.0.so                           
-- Found GObject includes : /usr/include/glib-2.0/gobject                                                                                                             
-- WARNING: you are using the obsolete 'PKGCONFIG' macro use FindPkgConfig                                                                                             
-- PKGCONFIG() indicates that loudmouth-1.0 is not installed (install the package which contains loudmouth-1.0.pc if you want to support this feature)                 
-- Could NOT find Loudmouth  (missing:  LOUDMOUTH_INCLUDE_DIR LOUDMOUTH_LIBRARIES)                                                                                     
-- Found Soprano: /usr/lib64/libsoprano.so                                                                                                                             
-- Found Soprano includes: /usr/include                                                                                                                               
-- Found Soprano Index: /usr/lib64/libsopranoindex.so                                                                                                                 
-- Found Soprano Client: /usr/lib64/libsopranoclient.so                                                                                                               
-- Found Soprano Plugins: nquadparser nquadserializer                                                                                                                 
-- Found NEPOMUK: /usr/kde/svn/lib64/libnepomuk.so                                                                                                                     
-- Performing Test QT4_GLIB_SUPPORT                                                                                                                                   
-- Performing Test QT4_GLIB_SUPPORT - Success                                                                                                                         
-- Looking for sys/types.h                                                                                                                                             
-- Looking for sys/types.h - found                                                                                                                                     
-- Looking for stdint.h                                                                                                                                               
-- Looking for stdint.h - found                                                                                                                                       
-- Looking for stddef.h                                                                                                                                               
-- Looking for stddef.h - found                                                                                                                                       
-- Check size of int                                                                                                                                                   
-- Check size of int - done                                                                                                                                           
-- Check size of long                                                                                                                                                 
-- Check size of long - done                                                                                                                                           
-- Performing Test COMPLEX_TAGLIB_FILENAME                                                                                                                             
-- Performing Test COMPLEX_TAGLIB_FILENAME - Failed                                                                                                                   
-- Found Plasma: /usr/kde/svn/lib64/libplasma.so                                                                                                                       
--                                                                                                                                                                     
-----------------------------------------------------------------------------                                                                                         
-- The following REQUIRED packages could NOT be located on your system.                                                                                               
-- Please install them before continuing this software installation.                                                                                                   
-----------------------------------------------------------------------------                                                                                         
+ mysqld: Embedded MySQL <http://www.mysql.com>                                                                                                                       
-----------------------------------------------------------------------------                                                                                         
CMake Error at /usr/kde/svn/share/apps/cmake/modules/MacroLogFeature.cmake:93 (MESSAGE):                                                                               
  Exiting: Missing Requirements                                                                                                                                       
Call Stack (most recent call first):                                                                                                                                   
  amarok/CMakeLists.txt:115 (macro_display_feature_log)                                                                                                               


CMake Error: The following variables are used in this project, but they are set to NOTFOUND.
Please set them or make sure they are set and tested correctly in the CMake files:         
MYSQL_EMBEDDED_LIBRARIES (ADVANCED)                                                         
    linked by target "amarok_collection-sqlcollection" in directory /var/tmp/paludis/media-sound-amarok-scm/work/amarok/amarok/src/collection/sqlcollection

-- Configuring incomplete, errors occurred!

!!! ERROR in media-sound/amarok-scm:
!!! In cmake-utils_src_configureout at line 1099
!!! Cmake failed                               

!!! Call stack:
!!!    * cmake-utils_src_configureout (/var/tmp/paludis/media-sound-amarok-scm/temp/loadsaveenv:1099)
!!!    * gks-base_src_configure (/var/tmp/paludis/media-sound-amarok-scm/temp/loadsaveenv:2938)     
!!!    * gks-meta_src_configure (/var/tmp/paludis/media-sound-amarok-scm/temp/loadsaveenv:3195)     
!!!    * gks-meta_src_compile (/var/tmp/paludis/media-sound-amarok-scm/temp/loadsaveenv:3189)       
!!!    * src_compile (/var/tmp/paludis/media-sound-amarok-scm/temp/loadsaveenv:4262)                 
!!!    * ebuild_f_compile (/usr/libexec/paludis/1/src_compile.bash:49)                               
!!!    * ebuild_main (/usr/libexec/paludis/ebuild.bash:470)                                         
!!!    * main (/usr/libexec/paludis/ebuild.bash:485)


For amarok it seems to be an upstream problem, but it's here since some days, so I can't understand why they resolve this...
_________________
Marco

"Man is least himself when he talks in his own person. Give him a mask, and he will tell you the truth." --Oscar Wilde.
Back to top
View user's profile Send private message
uraes
Tux's lil' helper
Tux's lil' helper


Joined: 28 Nov 2002
Posts: 120
Location: Estonia

PostPosted: Thu Oct 02, 2008 8:54 am    Post subject: Reply with quote

dracula1985 wrote:

-----------------------------------------------------------------------------
-- The following REQUIRED packages could NOT be located on your system.
-- Please install them before continuing this software installation.
-----------------------------------------------------------------------------
+ mysqld: Embedded MySQL <http://www.mysql.com>
-----------------------------------------------------------------------------
CMake Error at /usr/kde/svn/share/apps/cmake/modules/MacroLogFeature.cmake:93 (MESSAGE):
Exiting: Missing Requirements


Re-emerge your mysql with embeded useflag.
Back to top
View user's profile Send private message
beso_1717
Apprentice
Apprentice


Joined: 19 Jul 2007
Posts: 263

PostPosted: Thu Oct 02, 2008 9:42 am    Post subject: Reply with quote

for k3b there's no need anymore for that patch. the issue with the ffmpeg imcludes has been fixed upstream in the 865221 commit for the ffmpeg decoder with an ifdef include that recognizes the correct include paths. so that patch should be removed. until the overlay removes the patch you should comment it manually in the ebuild by adding a # before the patch line.
Back to top
View user's profile Send private message
dracula1985
Apprentice
Apprentice


Joined: 13 May 2005
Posts: 299
Location: Vicenza (Italy)

PostPosted: Thu Oct 02, 2008 10:32 am    Post subject: Reply with quote

uraes wrote:
dracula1985 wrote:

-----------------------------------------------------------------------------
-- The following REQUIRED packages could NOT be located on your system.
-- Please install them before continuing this software installation.
-----------------------------------------------------------------------------
+ mysqld: Embedded MySQL <http://www.mysql.com>
-----------------------------------------------------------------------------
CMake Error at /usr/kde/svn/share/apps/cmake/modules/MacroLogFeature.cmake:93 (MESSAGE):
Exiting: Missing Requirements


Re-emerge your mysql with embeded useflag.

Couldn't it be checked by the ebuild?
_________________
Marco

"Man is least himself when he talks in his own person. Give him a mask, and he will tell you the truth." --Oscar Wilde.
Back to top
View user's profile Send private message
beso_1717
Apprentice
Apprentice


Joined: 19 Jul 2007
Posts: 263

PostPosted: Thu Oct 02, 2008 1:29 pm    Post subject: Reply with quote

dracula1985 wrote:
uraes wrote:
dracula1985 wrote:

-----------------------------------------------------------------------------
-- The following REQUIRED packages could NOT be located on your system.
-- Please install them before continuing this software installation.
-----------------------------------------------------------------------------
+ mysqld: Embedded MySQL <http://www.mysql.com>
-----------------------------------------------------------------------------
CMake Error at /usr/kde/svn/share/apps/cmake/modules/MacroLogFeature.cmake:93 (MESSAGE):
Exiting: Missing Requirements


Re-emerge your mysql with embeded useflag.

Couldn't it be checked by the ebuild?


already reported here:

https://www2.mailstation.de/bugzilla/show_bug.cgi?id=96

read the explanation on why it's not really possible at the moment.
Back to top
View user's profile Send private message
lazx888
Tux's lil' helper
Tux's lil' helper


Joined: 13 Sep 2005
Posts: 118

PostPosted: Thu Oct 02, 2008 4:46 pm    Post subject: Reply with quote

Quote:
[ 9%] Generating GeneralPage.moc
Generating PowerDevilSettings.h, PowerDevilSettings.cpp
[ 11%] Generating screensaver_interface.cpp, screensaver_interface.h
Generating TimerBasedPoller.moc
[ 13%] Generating ui_profileAssignmentPage.h
Generating EditPage.moc
make[2]: *** No rule to make target `/var/tmp/paludis/kde-base-powerdevil-scm/work/powerdevil/ksmserver/org.kde.KSMServerInterface.xml', needed by `powerdevil/daemon/ksmserver_interface.cpp'. Stop.
make[2]: *** Waiting for unfinished jobs....
[ 15%] Generating kscreensaver_interface.cpp, kscreensaver_interface.h
Generating WidgetBasedPoller.moc
[ 18%] Generating ui_profileEditPage.h
[ 20%] Generating PowerDevilKCM.moc
Generating ui_capabilitiesPage.h
[ 22%] Generating ui_error.h
Generating PollSystemLoader.moc
Generating ConfigWidget.moc
Generating PowerManagementConnector.moc
Generating AssignmentPage.moc
Generating XSyncBasedPoller.moc
Generating CapabilitiesPage.moc
Generating PowerDevilDaemon.moc
Generating SuspensionLockHandler.moc
Scanning dependencies of target kcm_powerdevilconfig
make[1]: *** [powerdevil/daemon/CMakeFiles/kded_powerdevil.dir/all] Error 2
make[1]: *** Waiting for unfinished jobs....
[ 25%] [ 27%] [ 29%] Building CXX object powerdevil/kcmodule/CMakeFiles/kcm_powerdevilconfig.dir/ConfigWidget.o
Building CXX object powerdevil/kcmodule/CMakeFiles/kcm_powerdevilconfig.dir/GeneralPage.o
Building CXX object powerdevil/kcmodule/CMakeFiles/kcm_powerdevilconfig.dir/PowerDevilKCM.o
[ 31%] Building CXX object powerdevil/kcmodule/CMakeFiles/kcm_powerdevilconfig.dir/AssignmentPage.o
[ 34%] Building CXX object powerdevil/kcmodule/CMakeFiles/kcm_powerdevilconfig.dir/EditPage.o
[ 36%] Building CXX object powerdevil/kcmodule/CMakeFiles/kcm_powerdevilconfig.dir/CapabilitiesPage.o
[ 38%] Building CXX object powerdevil/kcmodule/CMakeFiles/kcm_powerdevilconfig.dir/ErrorWidget.o
[ 40%] Building CXX object powerdevil/kcmodule/CMakeFiles/kcm_powerdevilconfig.dir/PowerDevilSettings.o
[ 43%] Building CXX object powerdevil/kcmodule/CMakeFiles/kcm_powerdevilconfig.dir/kcm_powerdevilconfig_automoc.o
Linking CXX shared module ../../lib/kcm_powerdevilconfig.so
[ 43%] Built target kcm_powerdevilconfig
make: *** [all] Error 2
/usr/libexec/paludis/utils/emake: emake returned error 2



yargh! powerdevil! ideas?
Back to top
View user's profile Send private message
lazx888
Tux's lil' helper
Tux's lil' helper


Joined: 13 Sep 2005
Posts: 118

PostPosted: Thu Oct 02, 2008 8:10 pm    Post subject: Reply with quote

powerdevil compiled fine after I updated dbus from 1.1.20 to 1.2.3.... maybe this should be a dependency for powerdevil??

lazx888 wrote:
Quote:
[ 9%] Generating GeneralPage.moc
Generating PowerDevilSettings.h, PowerDevilSettings.cpp
[ 11%] Generating screensaver_interface.cpp, screensaver_interface.h
Generating TimerBasedPoller.moc
[ 13%] Generating ui_profileAssignmentPage.h
Generating EditPage.moc
make[2]: *** No rule to make target `/var/tmp/paludis/kde-base-powerdevil-scm/work/powerdevil/ksmserver/org.kde.KSMServerInterface.xml', needed by `powerdevil/daemon/ksmserver_interface.cpp'. Stop.
make[2]: *** Waiting for unfinished jobs....
[ 15%] Generating kscreensaver_interface.cpp, kscreensaver_interface.h
Generating WidgetBasedPoller.moc
[ 18%] Generating ui_profileEditPage.h
[ 20%] Generating PowerDevilKCM.moc
Generating ui_capabilitiesPage.h
[ 22%] Generating ui_error.h
Generating PollSystemLoader.moc
Generating ConfigWidget.moc
Generating PowerManagementConnector.moc
Generating AssignmentPage.moc
Generating XSyncBasedPoller.moc
Generating CapabilitiesPage.moc
Generating PowerDevilDaemon.moc
Generating SuspensionLockHandler.moc
Scanning dependencies of target kcm_powerdevilconfig
make[1]: *** [powerdevil/daemon/CMakeFiles/kded_powerdevil.dir/all] Error 2
make[1]: *** Waiting for unfinished jobs....
[ 25%] [ 27%] [ 29%] Building CXX object powerdevil/kcmodule/CMakeFiles/kcm_powerdevilconfig.dir/ConfigWidget.o
Building CXX object powerdevil/kcmodule/CMakeFiles/kcm_powerdevilconfig.dir/GeneralPage.o
Building CXX object powerdevil/kcmodule/CMakeFiles/kcm_powerdevilconfig.dir/PowerDevilKCM.o
[ 31%] Building CXX object powerdevil/kcmodule/CMakeFiles/kcm_powerdevilconfig.dir/AssignmentPage.o
[ 34%] Building CXX object powerdevil/kcmodule/CMakeFiles/kcm_powerdevilconfig.dir/EditPage.o
[ 36%] Building CXX object powerdevil/kcmodule/CMakeFiles/kcm_powerdevilconfig.dir/CapabilitiesPage.o
[ 38%] Building CXX object powerdevil/kcmodule/CMakeFiles/kcm_powerdevilconfig.dir/ErrorWidget.o
[ 40%] Building CXX object powerdevil/kcmodule/CMakeFiles/kcm_powerdevilconfig.dir/PowerDevilSettings.o
[ 43%] Building CXX object powerdevil/kcmodule/CMakeFiles/kcm_powerdevilconfig.dir/kcm_powerdevilconfig_automoc.o
Linking CXX shared module ../../lib/kcm_powerdevilconfig.so
[ 43%] Built target kcm_powerdevilconfig
make: *** [all] Error 2
/usr/libexec/paludis/utils/emake: emake returned error 2



yargh! powerdevil! ideas?
Back to top
View user's profile Send private message
handyk
n00b
n00b


Joined: 07 Oct 2008
Posts: 2

PostPosted: Tue Oct 07, 2008 8:47 am    Post subject: Reply with quote

enzobelmont wrote:
plasma still broken:
Code:

X Error: BadWindow (invalid Window parameter) 3
  Major opcode: 18 (X_ChangeProperty)
  Resource id:  0x2c00038
QFSFileEngine::open: No file name specified
QLayout: Attempting to add QLayout "" to Plasma::Dialog "", which already has a layout
plasma(23680) Plasma::AppletPrivate::mainConfigGroup: requesting config for "Monitor de batería" without a containment!
plasma(23680) Plasma::AppletPrivate::mainConfigGroup: requesting config for "Monitor de batería" without a containment!
QGraphicsLayout::addChildLayout: layout already has a parent
QGraphicsLayout::addChildLayout: layout already has a parent
sh: plasma: command not found
plasma(23679): Communication problem with  "plasma" , it probably crashed.
Error message was:  "org.freedesktop.DBus.Error.NoReply" : " "Message did not receive a reply (timeout by message bus)" "


any idea?

thanks in advance.


Hello,
I had the same problem with plasma crashing after startup.
I made it work by installing kde-misc/playground-plasma. I don't know why, but now plasma works perfectly.
So try to install it.
Back to top
View user's profile Send private message
dracula1985
Apprentice
Apprentice


Joined: 13 May 2005
Posts: 299
Location: Vicenza (Italy)

PostPosted: Tue Oct 07, 2008 6:02 pm    Post subject: Reply with quote

I'm still having problems with amarok.
Since some days the ebuild fails:
Code:
* media-sound/amarok::kde4-experimental :kde-svn [R scm] <target>
    cdaudio -daap -debug -ipod -mp3tunes mp4 -mtp opengl semantic-desktop

Total: 1 package (1 rebuild)

(1 of 1) Installing media-sound/amarok-scm:kde-svn::kde4-experimental
                                                                                 
>>> Running ebuild phase killold as root:root...                                                                                                                                         
>>> Starting builtin_killold                                                                                                                                                             
>>> Done builtin_killold                                                                                                                                                                 
>>> Completed ebuild phase killold                                                                                                                                                       
>>> Running ebuild phases init saveenv as root:root...                                                                                                                                   
>>> Starting builtin_init                                                                                                                                                               
>>> Done builtin_init                                                                                                                                                                   
>>> Starting builtin_saveenv                                                                                                                                                             
>>> Done builtin_saveenv                                                                                                                                                                 
>>> Completed ebuild phases init saveenv                                                                                                                                                 
>>> Running ebuild phases loadenv setup saveenv as root:root...                                                                                                                         
>>> Starting builtin_loadenv                                                                                                                                                             
>>> Done builtin_loadenv                                                                                                                                                                 
>>> Starting pkg_setup                                                                                                                                                                   

 * WARNING! This is an experimental ebuild of the extragear/multimedia KDE4 SVN tree.
 * Use at your own risk. File a bug at https://www2.mailstation.de/bugzilla if you   
 * run into problems. Or join #genkdesvn on the great Freenode IRC network.         

>>> Done pkg_setup
>>> Starting builtin_saveenv
>>> Done builtin_saveenv   
>>> Completed ebuild phases loadenv setup saveenv
>>> Running ebuild phases loadenv unpack compile saveenv as root:root...
>>> Starting builtin_loadenv                                           
>>> Done builtin_loadenv                                               
>>> Starting src_unpack                                                 
 * Fetching disabled since 1 hours has not passed since last update.   
 * Using existing repository copy at revision 868942.                   
 *    working copy: /usr/portage/distfiles/svn-src/KDE/extragear/multimedia/multimedia

 * Exporting parts of working copy to /var/tmp/paludis/media-sound-amarok-scm/work/amarok
>>> Done src_unpack                                                                     
>>> Starting src_compile                                                                 
sed: can't read /var/tmp/paludis/media-sound-amarok-scm/work/amarok/amarok/src/browsers/servicebrowser/CMakeLists.txt: No such file or directory

!!! ERROR in media-sound/amarok-scm:
!!! In src_compile at line 4244     
!!! Deactivating mp3tunes failed.   

!!! Call stack:
!!!    * src_compile (/var/tmp/paludis/media-sound-amarok-scm/temp/loadsaveenv:4244)
!!!    * ebuild_f_compile (/usr/libexec/paludis/1/src_compile.bash:49)             
!!!    * ebuild_main (/usr/libexec/paludis/ebuild.bash:470)                         
!!!    * main (/usr/libexec/paludis/ebuild.bash:485)

_________________
Marco

"Man is least himself when he talks in his own person. Give him a mask, and he will tell you the truth." --Oscar Wilde.
Back to top
View user's profile Send private message
dracula1985
Apprentice
Apprentice


Joined: 13 May 2005
Posts: 299
Location: Vicenza (Italy)

PostPosted: Tue Oct 07, 2008 6:17 pm    Post subject: Reply with quote

Solved removing the code related to mp3tunes from the ebuild.
I don't know if mp3tunes support has been removed upstream, but this new ebuild stars building right:
Code:
# Copyright 2007-2008 by the individual contributors of the genkdesvn project
# Based in part upon the respective ebuild in Gentoo which is:
# Copyright 1999-2008 Gentoo Foundation
# Distributed under the terms of the GNU General Public License v2

KMNAME="extragear/multimedia"
NEED_KDE="svn"

OPENGL_REQUIRED="optional"
inherit gks-svn-meta

# Install to KDEDIR rather than /usr, to slot properly.
PREFIX="${KDEDIR}"

DESCRIPTION="Advanced audio player based on KDE framework."
HOMEPAGE="http://amarok.kde.org/"

LICENSE="GPL-2"
KEYWORDS=""
SLOT="kde-svn"
#IUSE="cdaudio daap debug ipod mp3tunes mp4 mtp +semantic-desktop"
IUSE="cdaudio daap debug ipod mp4 mtp +semantic-desktop"
# daap are automagic

DEPEND=">=app-misc/strigi-0.5.9[qt4]
   || ( >=dev-db/mysql-5.0[embedded]
      >=dev-db/mysql-community-5.0[embedded] )
   >=dev-lang/ruby-1.8
   kde-base/kdelibs:${SLOT}[opengl?][semantic-desktop?]
   kde-base/libplasma:${SLOT}[opengl?]
   >=media-libs/taglib-1.5
   >=media-sound/phonon-4.1.80
   x11-libs/qt-webkit:4
   cdaudio? ( kde-base/libkcompactdisc:${SLOT}
      kde-base/libkcddb:${SLOT} )
   ipod? ( dev-libs/glib:2
      >=x11-libs/gtk+-2.0:2
      >=media-libs/libgpod-0.6.0 )
   mp4? ( >=media-libs/libmp4v2-1.5 )
   mtp? ( >=media-libs/libmtp-0.3.0 )
   semantic-desktop? ( >=dev-libs/soprano-2.1.0
      kde-base/nepomuk:${SLOT} )
   "
#   mp3tunes? ( dev-libs/glib:2
#      >=x11-libs/gtk+-2.0:2
#      dev-libs/libxml2
#      || ( dev-libs/openssl
#         dev-libs/libgcrypt )
#      >=net-libs/loudmouth-1
#      net-misc/curl
#      x11-libs/qt-core[glib]
#      x11-libs/qt-gui[glib] )
# unzip is used by magnatune
RDEPEND="${DEPEND}
   app-arch/unzip
   daap? ( www-servers/mongrel )
   "

src_compile() {
   if use debug; then
      mycmakeargs="${mycmakeargs} -DCMAKE_BUILD_TYPE=debugfull"
   fi
   # We don't want automagic deps.
#   if ! use mp3tunes; then
#      sed -e'/mp3tunes/ s:^:#DONOTWANT :' \
#         -i "${S}"/${PN}/src/browsers/servicebrowser/CMakeLists.txt \
#         || die "Deactivating mp3tunes failed."
#   fi

#   if use mp3tunes || use ipod; then
   if use ipod; then
      mycmakeargs+=" -DWITH_GLIB2=ON"
   else
      mycmakeargs+=" -DWITH_GLIB2=OFF"
   fi

   # QT_WEBKIT is already defined on Gentoo via /usr/include/qt4/Gentoo/gentoo-qconfig.h.
   sed -e 's/ -DQT_WEBKIT//g' \
      -i "${S}"/${PN}/src/scriptengine/generator/generator/CMakeLists.txt \
      || die "Removing duplicated QT_WEBKIT define failed."

   mycmakeargs="${mycmakeargs}
      -DCMAKE_INSTALL_PREFIX=${PREFIX}
      -DUSE_SYSTEM_SQLITE=ON
      $(cmake-utils_use_with cdaudio KdeMultimedia)
      $(cmake-utils_use_with ipod Gdk)
      $(cmake-utils_use_with ipod Ipod)
#      $(cmake-utils_use_with mp3tunes Loudmouth)
      $(cmake-utils_use_with mp4 Mp4v2)
      $(cmake-utils_use_with mtp Mtp)
      $(cmake-utils_use_with opengl OpenGL)
      $(cmake-utils_use_with semantic-desktop Nepomuk)
      $(cmake-utils_use_with semantic-desktop Soprano)
   "
   gks-meta_src_compile
}

_________________
Marco

"Man is least himself when he talks in his own person. Give him a mask, and he will tell you the truth." --Oscar Wilde.
Back to top
View user's profile Send private message
enzobelmont
Guru
Guru


Joined: 06 Apr 2004
Posts: 345
Location: Chiapas, Mexico

PostPosted: Tue Oct 07, 2008 10:31 pm    Post subject: Reply with quote

handyk wrote:
enzobelmont wrote:
plasma still broken:
Code:

X Error: BadWindow (invalid Window parameter) 3
  Major opcode: 18 (X_ChangeProperty)
  Resource id:  0x2c00038
QFSFileEngine::open: No file name specified
QLayout: Attempting to add QLayout "" to Plasma::Dialog "", which already has a layout
plasma(23680) Plasma::AppletPrivate::mainConfigGroup: requesting config for "Monitor de batería" without a containment!
plasma(23680) Plasma::AppletPrivate::mainConfigGroup: requesting config for "Monitor de batería" without a containment!
QGraphicsLayout::addChildLayout: layout already has a parent
QGraphicsLayout::addChildLayout: layout already has a parent
sh: plasma: command not found
plasma(23679): Communication problem with  "plasma" , it probably crashed.
Error message was:  "org.freedesktop.DBus.Error.NoReply" : " "Message did not receive a reply (timeout by message bus)" "


any idea?

thanks in advance.


Hello,
I had the same problem with plasma crashing after startup.
I made it work by installing kde-misc/playground-plasma. I don't know why, but now plasma works perfectly.
So try to install it.


thanks. a little late, i've reinstalled it all from scratch to make it work. (deleted /usr/kde/svn dir)
thanks anyway.
_________________
Mens sana in corpore sano... Gentoo laetificat cor hominis
Back to top
View user's profile Send private message
KejPi
Tux's lil' helper
Tux's lil' helper


Joined: 17 Jan 2004
Posts: 122
Location: Prague, Czech republic

PostPosted: Fri Oct 10, 2008 9:56 pm    Post subject: Unable to build amarok Reply with quote

Hi, I have some problem to build amarok:

Code:

 * Exporting parts of working copy to /var/tmp/paludis/media-sound-amarok-scm/work/amarok
>>> Done src_unpack
>>> Starting src_compile
sed: can't read /var/tmp/paludis/media-sound-amarok-scm/work/amarok/amarok/src/browsers/servicebrowser/CMakeLists.txt: No such file or directory

!!! ERROR in media-sound/amarok-scm:
!!! In src_compile at line 4265
!!! Deactivating mp3tunes failed.

!!! Call stack:
!!!    * src_compile (/var/tmp/paludis/media-sound-amarok-scm/temp/loadsaveenv:4265)
!!!    * ebuild_f_compile (/usr/libexec/paludis/1/src_compile.bash:49)
!!!    * ebuild_main (/usr/libexec/paludis/ebuild.bash:470)
!!!    * main (/usr/libexec/paludis/ebuild.bash:485)

diefunc: making ebuild PID 29794 exit with error
die trap: exiting with error.

Install error:
  * In program /usr/bin/paludis (--checks none --debug-build none --show-reasons summary --show-use-descriptions changed --dl-downgrade warning --dl-installed-deps-pre pre-or-post --log-level warning --dl-upgrade always --resume-command-template /root/.paludis-resume-XXXXXX) -i amarok:
  * When performing install action from command line:
  * When executing install task:
  * When installing 'media-sound/amarok-scm:kde-svn::kde4-experimental':
  * Install error: Install failed for 'media-sound/amarok-scm:kde-svn::kde4-experimental'



Summary of failures:

* media-sound/amarok-scm:kde-svn::kde4-experimental: failure

Total: 1 package, 0 successes, 0 skipped, 1 failure, 0 unreached


Any hint?

Thank you in advance!

Regards
Petr
_________________
hidentity.org
Back to top
View user's profile Send private message
franzf
Advocate
Advocate


Joined: 29 Mar 2005
Posts: 4407

PostPosted: Sat Oct 11, 2008 7:33 am    Post subject: Reply with quote

enzobelmont wrote:
plasma still broken:
Code:

X Error: BadWindow (invalid Window parameter) 3
  Major opcode: 18 (X_ChangeProperty)
  Resource id:  0x2c00038
QFSFileEngine::open: No file name specified
QLayout: Attempting to add QLayout "" to Plasma::Dialog "", which already has a layout
plasma(23680) Plasma::AppletPrivate::mainConfigGroup: requesting config for "Monitor de batería" without a containment!
plasma(23680) Plasma::AppletPrivate::mainConfigGroup: requesting config for "Monitor de batería" without a containment!
QGraphicsLayout::addChildLayout: layout already has a parent
QGraphicsLayout::addChildLayout: layout already has a parent
sh: plasma: command not found
plasma(23679): Communication problem with  "plasma" , it probably crashed.
Error message was:  "org.freedesktop.DBus.Error.NoReply" : " "Message did not receive a reply (timeout by message bus)" "


any idea?

thanks in advance.

Same here. But i also get a MessageBox. If I view the details, this looks like something else:
Code:
Anwendung: Plasma-ArbeitsflÀche (plasma), Signal SIGSEGV
Using host libthread_db library "/lib/libthread_db.so.1".
0x00007f42f9514d31 in nanosleep () from /lib64/libc.so.6
[Current thread is 0 (LWP 21687)]

Thread 3 (Thread 0x425a5950 (LWP 21764)):
#0  0x00007f42fc8b4d79 in pthread_cond_wait@@GLIBC_2.3.2 () from /lib64/libpthread.so.0
#1  0x00007f42fcb23719 in QWaitCondition::wait () from /usr/lib64/qt4/libQtCore.so.4
#2  0x00007f42f0179a50 in RenderThread::run () from /usr/kde/svn/lib64/kde4/plasma_wallpaper_image.so
#3  0x00007f42fcb22752 in QThreadPrivate::start () from /usr/lib64/qt4/libQtCore.so.4
#4  0x00007f42fc8b1007 in start_thread () from /lib64/libpthread.so.0
#5  0x00007f42f9545d3d in clone () from /lib64/libc.so.6
#6  0x0000000000000000 in ?? ()

Thread 2 (Thread 0x40cdc950 (LWP 21925)):
#0  0x00007f42fc8b4d79 in pthread_cond_wait@@GLIBC_2.3.2 () from /lib64/libpthread.so.0
#1  0x00007f42fcb23719 in QWaitCondition::wait () from /usr/lib64/qt4/libQtCore.so.4
#2  0x00007f42fcf6135c in QHostInfoAgent::run () from /usr/lib64/qt4/libQtNetwork.so.4
#3  0x00007f42fcb22752 in QThreadPrivate::start () from /usr/lib64/qt4/libQtCore.so.4
#4  0x00007f42fc8b1007 in start_thread () from /lib64/libpthread.so.0
#5  0x00007f42f9545d3d in clone () from /lib64/libc.so.6
#6  0x0000000000000000 in ?? ()

Thread 1 (Thread 0x7f43019a7790 (LWP 21687)):
[KCrash Handler]
#5  0x00007f42fc21ef2e in QGraphicsLayoutItemPrivate::effectiveSizeHints () from /usr/lib64/qt4/libQtGui.so.4
#6  0x00007f42fc21f98a in QGraphicsLayoutItem::effectiveSizeHint () from /usr/lib64/qt4/libQtGui.so.4
#7  0x00007f42fc21fa94 in QGraphicsLayoutItem::minimumSize () from /usr/lib64/qt4/libQtGui.so.4
#8  0x00007f430139b947 in Plasma::PopupAppletPrivate::popupConstraintsEvent () from /usr/kde/svn/lib64/libplasma.so.3
#9  0x00007f4301359607 in Plasma::Applet::flushPendingConstraintsEvents () from /usr/kde/svn/lib64/libplasma.so.3
#10 0x00007f43016b8b71 in DesktopCorona::loadDefaultLayout () from /usr/kde/svn/lib64/libkdeinit4_plasma.so
#11 0x00007f430137ed6d in Plasma::Corona::initializeLayout () from /usr/kde/svn/lib64/libplasma.so.3
#12 0x00007f43016c76f0 in PlasmaApp::corona () from /usr/kde/svn/lib64/libkdeinit4_plasma.so
#13 0x00007f43016c91c1 in PlasmaApp::PlasmaApp () from /usr/kde/svn/lib64/libkdeinit4_plasma.so
#14 0x00007f43016c927f in PlasmaApp::self () from /usr/kde/svn/lib64/libkdeinit4_plasma.so
#15 0x00007f43016bc40c in kdemain () from /usr/kde/svn/lib64/libkdeinit4_plasma.so
#16 0x00007f42f94941b6 in __libc_start_main () from /lib64/libc.so.6
#17 0x00000000004009d9 in _start ()

So just a simple segfault in qt-gui?!?
Anybody the same backtrace? (Doing one with gdb just told me "no stack")
Back to top
View user's profile Send private message
beso_1717
Apprentice
Apprentice


Joined: 19 Jul 2007
Posts: 263

PostPosted: Sat Oct 11, 2008 7:33 am    Post subject: Reply with quote

for the people who want to use both kde-4.1.2 and kde-scm togheter, they need to change the phonon slot in kde-scm to kde-svn so that they can install both phonon-4.2.0 of portage and phonon-scm from kde-svn.
Back to top
View user's profile Send private message
dracula1985
Apprentice
Apprentice


Joined: 13 May 2005
Posts: 299
Location: Vicenza (Italy)

PostPosted: Sat Oct 11, 2008 7:46 am    Post subject: Reply with quote

I'm still having build problems with amarok and playground-plasma.
It's since almost a month that those two packages doesn't build right.

Those are the build outputs:
amarok: http://pastebin.com/m50ad4d23
I think the main error is here:
Code:
Linking CXX shared module ../../../../lib/libamarok_collection-sqlcollection.so
/usr/lib/gcc/x86_64-pc-linux-gnu/4.3.2/../../../../x86_64-pc-linux-gnu/bin/ld: /usr/lib64/mysql/libmysqld.a(client.o): relocation R_X86_64_32 against `mysql_server_last_error' can not be used when making a shared object; recompile with -fPIC
/usr/lib64/mysql/libmysqld.a: could not read symbols: Bad value
collect2: ld returned 1 exit status
make[2]: *** [lib/libamarok_collection-sqlcollection.so] Error 1
make[1]: *** [amarok/src/collection/sqlcollection/CMakeFiles/amarok_collection-sqlcollection.dir/all] Error 2


playground-plasma: http://pastebin.com/m32f4f005
I think the main error is here:
Code:
[ 31%] Built target plasma_applet_stockwidget
make[2]: *** No rule to make target `/usr/share/dbus-1/interfaces/org.freedesktop.ScreenSaver.xml', needed by `containments/cluttereddesktop/screensaver_interface.cpp'.  Stop.
make[1]: *** [containments/cluttereddesktop/CMakeFiles/plasma_containment_cluttereddesktop.dir/all] Error 2
make[1]: *** Waiting for unfinished jobs....

The needed xml is in /usr/kde/svn/share/dbus-1/interfaces/ and not in /usr/share/dbus-1/interfaces/
How could I tell it to cmake?

Maybe there is some dependency missing or to be rebuild?
_________________
Marco

"Man is least himself when he talks in his own person. Give him a mask, and he will tell you the truth." --Oscar Wilde.
Back to top
View user's profile Send private message
Display posts from previous:   
Reply to topic    Gentoo Forums Forum Index Unsupported Software All times are GMT
Goto page 1, 2, 3, 4, 5, 6, 7  Next
Page 1 of 7

 
Jump to:  
You cannot post new topics in this forum
You cannot reply to topics in this forum
You cannot edit your posts in this forum
You cannot delete your posts in this forum
You cannot vote in polls in this forum