Gentoo Forums
Gentoo Forums
Gentoo Forums
Quick Search: in
KDE experimental overlay (genkdesvn) Part 7
View unanswered posts
View posts from last 24 hours

Goto page Previous  1, 2, 3, 4, 5, 6, 7  Next  
Reply to topic    Gentoo Forums Forum Index Unsupported Software
View previous topic :: View next topic  
Author Message
Stefano Crocco
Apprentice
Apprentice


Joined: 28 Sep 2006
Posts: 157

PostPosted: Fri Oct 31, 2008 9:40 pm    Post subject: Reply with quote

Ceniza wrote:
After following a lot of "discussion continues here" links I got to this one.

My question is quite simple. It might be answered before, but it's a bit difficult to search for it considering the huge amount of posts.

I installed 4.1.2 from portage. I also have 3.5.10 installed. I tried to build 4.svn, but many packages are finding the header and lib paths of 4.1. That causes many of them to fail (almost 70 of 212). I'd like to build 4.svn without removing 4.1.2 first. Is there anything I can do about it, or do I really must remove 4.1.2 before running paludis?

Sorry in advance if this question has been answered a million times before.


Warning: this isn't completely tested, but it should work and shouldn't damage your system if it fails.

You can try modifying some environment variables which are used by kde svn. The most important ones are PATH, LDPATH and KDEDIRS, but I would also change ROOTPATH, just to be on the safe side. This is the code you need:
Code:

export PATH=/usr/kde/svn/bin:$PATH
export LDPATH=/usr/kde/svn/lib:$LDPATH
export ROOTPATH=/usr/kde/svn/sbin:/usr/kde/svn/bin:$ROOTPATH
export KDEDIRS=/usr:/usr/kde/svn

Having done this, you can install kde-scm, but you need to do this from the same shell where you issued the above commands. To be on the safe side, I'd move the file /etc/env.d/43kdepaths-4.1 somewhere else, so that there's no chance that the 4.1 paths pollute the installation environment of kde svn, then restart and either login to a terminal or use a non-kde4 session (you can use kde 3, for example). Then, you can issue the above commands and start installing.

I hope this helps
_________________
Stefano
Back to top
View user's profile Send private message
gimpel
Advocate
Advocate


Joined: 15 Oct 2004
Posts: 2720
Location: Munich, Bavaria

PostPosted: Sun Nov 02, 2008 11:33 am    Post subject: Reply with quote

gimpel wrote:
Back on topic.. about solving the plasma-workspace compile error...

It misses that result.h, which is part of libnepomukquery in runtime, or libs/nepomuk in workspace. Adding latter one to KMEXTRACTONLY doesn't help here.

Looking at KDE4 on my OpenSUSE box at work, libnepomukquery.so is part of kdebase4-workspace (monolithik there). But I do not have this lib nor its headers here on the Gentoo box, though I do have nepomuk installed, of course. Are we missing a package/kdebuild maybe?


Found some time to look at this issue..

kde-base/nepomukquery.kdebuild-1
Code:
# Copyright 2008 /dev/wtf
# Distributed under the terms of the GNU General Public License v2

KMNAME=kdebase-workspace
KMMODULE=libs/${PN}
inherit gks-svn-meta

DESCRIPTION=""
KEYWORDS=""
IUSE="debug"

DEPEND=">=kde-base/nepomuk-${PV}:${SLOT}
        >=dev-libs/soprano-${PV}"
RDEPEND="${DEPEND}"

and...
Code:
diff --git a/kde-base/plasma-workspace/plasma-workspace-scm.kdebuild-1 b/kde-base/plasma-workspace/plasma-workspace-scm.kdebuild-1
index b2db3a8..141d695 100644
--- a/kde-base/plasma-workspace/plasma-workspace-scm.kdebuild-1
+++ b/kde-base/plasma-workspace/plasma-workspace-scm.kdebuild-1
@@ -24,6 +24,7 @@ COMMONDEPEND="!kde-base/plasma:${SLOT}
        x11-libs/libXtst
        python? ( kde-base/pykde4:${SLOT} )
        semantic-desktop? ( >=kde-base/nepomuk-${PV}:${SLOT}
+                           >=kde-base/nepomukquery-${PV}:${SLOT}
                            >=dev-libs/soprano-${PV} )
        xcomposite? ( x11-libs/libXcomposite )
        xinerama? ( x11-libs/libXinerama )"

_________________
http://proaudio.tuxfamily.org/wiki - pro-audio software overlay
Back to top
View user's profile Send private message
nyback
n00b
n00b


Joined: 27 Aug 2004
Posts: 30

PostPosted: Thu Nov 06, 2008 9:22 am    Post subject: change of overlay? Reply with quote

is it time to switch over to the kde-crazy overlay instead?
Seems to be more buzz in there then here? Has anyone made the switch and how did it go? Any hands-on on how to switch? pro's and con's?

since libplasma moved over to kdelibs a lot of things are broken in both overlays it seems, but at least in the other thread there is some mention about it and maybe the ebuilds there are worked on to fix it?

would it still be possible to use reinstall scm weekly on the kde-crazy overlay?

/Andreas
Back to top
View user's profile Send private message
Phlogiston
Veteran
Veteran


Joined: 27 Jan 2004
Posts: 1925
Location: Europe, Swizerland

PostPosted: Thu Nov 06, 2008 11:44 am    Post subject: Reply with quote

No problem here so fare... You just have to remerge that packages that want to install libplasma and you should be fine.
_________________
Workstation: 5.1 SurroundSound, LIRC remote control; Laptop [IBM-T43]: patched sources, s2disk/ram, fingerprint sensor
Back to top
View user's profile Send private message
KejPi
Tux's lil' helper
Tux's lil' helper


Joined: 17 Jan 2004
Posts: 122
Location: Prague, Czech republic

PostPosted: Thu Nov 06, 2008 7:57 pm    Post subject: Amarok again :-( Reply with quote

Hello, for a long time I am not able to compile Amarok on x86 platform. I always get this error :-(
Code:
-- Performing Test HAVE_MYSQL_OPT_EMBEDDED_CONNECTION
-- Performing Test HAVE_MYSQL_OPT_EMBEDDED_CONNECTION - Success
-- Found MySQL: /usr/include/mysql, /usr/lib/libmysqlclient.so
-- MySQL Embedded not found.
--

-- Configuring done
-- Generating done
-- Build files have been written to: /var/tmp/paludis/media-sound-amarok-scm/work/amarok_build
make -j2
>>> Done src_compile
>>> Starting builtin_saveenv
>>> Done builtin_saveenv
>>> Completed ebuild phases loadenv unpack compile saveenv
>>> Running ebuild phases loadenv install saveenv as root:root...
>>> Starting builtin_loadenv
>>> Done builtin_loadenv
>>> Starting src_install
make -j2 install DESTDIR=/var/tmp/paludis/media-sound-amarok-scm/image/
make: *** No rule to make target `install'.  Stop.
/usr/libexec/paludis/utils/emake: emake returned error 2

!!! ERROR in media-sound/amarok-scm:
!!! In cmake-utils_src_install at line 1266
!!! Make install failed

!!! Call stack:
!!!    * cmake-utils_src_install (/var/tmp/paludis/media-sound-amarok-scm/temp/loadsaveenv:1266)
!!!    * gks-meta_src_install (/var/tmp/paludis/media-sound-amarok-scm/temp/loadsaveenv:3496)
!!!    * src_install (/var/tmp/paludis/media-sound-amarok-scm/temp/loadsaveenv:4684)
!!!    * ebuild_f_install (/usr/libexec/paludis/0/src_install.bash:46)
!!!    * ebuild_main (/usr/libexec/paludis/ebuild.bash:477)
!!!    * main (/usr/libexec/paludis/ebuild.bash:492)

diefunc: making ebuild PID 27750 exit with error
die trap: exiting with error.

Install error:
  * In program /usr/bin/paludis (--checks none --debug-build none --show-reasons summary --show-use-descriptions changed --dl-downgrade warning --dl-installed-deps-pre pre-or-post --log-level warning --dl-upgrade always --resume-command-template /root/.paludis-resume-XXXXXX) -i amarok:
  * When performing install action from command line:
  * When executing install task:
  * When installing 'media-sound/amarok-scm:kde-svn::kde4-experimental':
  * Install error: Install failed for 'media-sound/amarok-scm:kde-svn::kde4-experimental'


But I have compiled mysql with embedded use flag:

Code:
paludis -q dev-db/mysql
* dev-db/mysql
    gentoo:                  (3.23.58-r1)R 4.0.27-r1 4.1.22-r1 (4.1.23_alpha20070101-r61)KR 5.0.26-r2 (5.0.32)K (5.0.34)K 5.0.38 5.0.40 5.0.42 5.0.44 5.0.44-r1 5.0.44-r2 5.0.54 (5.0.56)K (5.0.60)K 5.0.60-r1 {:0}
    installed:               5.0.60-r1* {:0}
    Description:             A fast, multi-threaded, multi-user SQL database server.
    Homepage:                http://www.mysql.com/
    Relevant USE flags:      (-berkdb) (-big-tables) (-cluster) (-debug) (embedded) (-extraengine) (-latin1) (-max-idx-128) (minimal) (perl) (-selinux) (ssl) (-static)
    License:                 GPL-2
    Installed time:          Thu Nov  6 19:46:05 2008
    From repositories:       gentoo
    Installed using:         paludis-0.30.3

Key to mask reasons:

* K: keyword
* R: repository


Does anybody know where could be a problem?

Thanks in advance!

Regards,
Petr
_________________
hidentity.org
Back to top
View user's profile Send private message
svarog
n00b
n00b


Joined: 16 Mar 2005
Posts: 25
Location: tampa bay, florida

PostPosted: Fri Nov 07, 2008 3:38 am    Post subject: Reply with quote

I have phonon installed and I reinstalled it too!!!!! What is the problem!? Is it upstream or my end? Thanks for any help.

Code:
- Performing Test __KDE_HAVE_GCC_VISIBILITY - Success                                                                                                     
-- Phonon includes NOT found!                                                                                                                             
-- Phonon library NOT found!                                                                                                                               
CMake Error at cmake/modules/FindPhonon.cmake:49 (message):                                                                                               
  Phonon library or includes NOT found!                                                                                                                   
Call Stack (most recent call first):                                                                                                                       
  cmake/modules/FindKDE4Internal.cmake:1154 (find_package)                                                                                                 
  CMakeLists.txt:29 (find_package)                                                                                                                         


-- Configuring incomplete, errors occurred!

!!! ERROR in kde-base/kdelibs-4.1.2-r1:
!!! In cmake-utils_src_configureout at line 1163
!!! Cmake failed                       
Back to top
View user's profile Send private message
Stefano Crocco
Apprentice
Apprentice


Joined: 28 Sep 2006
Posts: 157

PostPosted: Fri Nov 07, 2008 6:46 am    Post subject: Reply with quote

svarog wrote:
I have phonon installed and I reinstalled it too!!!!! What is the problem!? Is it upstream or my end? Thanks for any help.

Code:
- Performing Test __KDE_HAVE_GCC_VISIBILITY - Success                                                                                                     
-- Phonon includes NOT found!                                                                                                                             
-- Phonon library NOT found!                                                                                                                               
CMake Error at cmake/modules/FindPhonon.cmake:49 (message):                                                                                               
  Phonon library or includes NOT found!                                                                                                                   
Call Stack (most recent call first):                                                                                                                       
  cmake/modules/FindKDE4Internal.cmake:1154 (find_package)                                                                                                 
  CMakeLists.txt:29 (find_package)                                                                                                                         


-- Configuring incomplete, errors occurred!

!!! ERROR in kde-base/kdelibs-4.1.2-r1:
!!! In cmake-utils_src_configureout at line 1163
!!! Cmake failed                       

Which phonon version do you have installed?
_________________
Stefano
Back to top
View user's profile Send private message
svarog
n00b
n00b


Joined: 16 Mar 2005
Posts: 25
Location: tampa bay, florida

PostPosted: Fri Nov 07, 2008 7:00 am    Post subject: Reply with quote

* media-sound/phonon::kde4-experimental :kde-svn [R scm] <target>
-debug -gstreamer

Maybe I should just mask this ebuild!! It is not going to play well with the scm stuff. I thought it was newer than my scm stuff and was confused!!!
Back to top
View user's profile Send private message
Stefano Crocco
Apprentice
Apprentice


Joined: 28 Sep 2006
Posts: 157

PostPosted: Fri Nov 07, 2008 7:07 am    Post subject: Reply with quote

svarog wrote:
* media-sound/phonon::kde4-experimental :kde-svn [R scm] <target>
-debug -gstreamer

Then the problem is that phonon is installed in /usr/kde/svn, and so it can't be found by kde-4.1.2, which searches for it either in the /usr/kde/4.1 or in the /usr directory. To solve this problem, I think you can install media-sound/phonon-4.2.0, but I haven't tried it, so I can't tell whether this actually works or not.

If you're trying to install both kde-4.1.2 and kde-svn, however, be aware that making them work together is quite difficult (if not impossible). I tried it (not too hard, I'll[/post] admit), and failed.
_________________
Stefano
Back to top
View user's profile Send private message
raphy
n00b
n00b


Joined: 08 Nov 2006
Posts: 35
Location: France

PostPosted: Fri Nov 07, 2008 1:21 pm    Post subject: Reply with quote

Is it me or the anonsvn.kde.org server is down?
Back to top
View user's profile Send private message
raphy
n00b
n00b


Joined: 08 Nov 2006
Posts: 35
Location: France

PostPosted: Fri Nov 07, 2008 1:23 pm    Post subject: Reply with quote

Does anyone now how to bypass svn check in paludis, so that it uses code that it already has instead of checking for svn updates and raising an error because it can't connect to the server?
Back to top
View user's profile Send private message
Stefano Crocco
Apprentice
Apprentice


Joined: 28 Sep 2006
Posts: 157

PostPosted: Fri Nov 07, 2008 1:51 pm    Post subject: Reply with quote

dafirewallfucker wrote:
Does anyone now how to bypass svn check in paludis, so that it uses code that it already has instead of checking for svn updates and raising an error because it can't connect to the server?


Set the ESVN_OFFLINE environment variable to something.
_________________
Stefano
Back to top
View user's profile Send private message
raphy
n00b
n00b


Joined: 08 Nov 2006
Posts: 35
Location: France

PostPosted: Fri Nov 07, 2008 2:25 pm    Post subject: Reply with quote

Indeed,
Code:
ESVN_OFFLINE=true paludis -i kde-scm*
and I can safely continue the installation.

tack :)
Back to top
View user's profile Send private message
Phlogiston
Veteran
Veteran


Joined: 27 Jan 2004
Posts: 1925
Location: Europe, Swizerland

PostPosted: Fri Nov 07, 2008 3:39 pm    Post subject: Reply with quote

dafirewallfucker wrote:
Indeed,
Code:
ESVN_OFFLINE=true paludis -i kde-scm*
and I can safely continue the installation.

tack :)


thats good to know :)
_________________
Workstation: 5.1 SurroundSound, LIRC remote control; Laptop [IBM-T43]: patched sources, s2disk/ram, fingerprint sensor
Back to top
View user's profile Send private message
KejPi
Tux's lil' helper
Tux's lil' helper


Joined: 17 Jan 2004
Posts: 122
Location: Prague, Czech republic

PostPosted: Tue Nov 11, 2008 8:47 pm    Post subject: Reply with quote

Hi,

Is anyone able to build pykde4? I am not able to rebuild kde now as pykde4 is a dependency and it fails linking plasma.so :-(

Code:

...
[ 92%] Generating sip/soprano/sipsopranopart0.cpp, sip/soprano/sipsopranopart1.cpp, sip/soprano/sipsopranopart2.cpp, sip/soprano/sipsopranopart3.cpp, sip/soprano/sipsopranopart4.cpp, sip/soprano/sipsopranopart5.cpp, sip/soprano/sipsopranopart6.cpp, sip/soprano/sipsopranopart7.cpp

Linking CXX shared library ../../lib/pykde/plasma.so
CMakeFiles/python_module_PyKDE4_plasma.dir/sip/plasma/sipplasmapart0.o: In function `void* qMetaTypeConstructHelper<Plasma::Containment::StyleOption>(Plasma::Containment::StyleOption const*)':
sipplasmapart0.cpp:(.text._Z24qMetaTypeConstructHelperIN6Plasma11Containment11StyleOptionEEPvPKT_[void* qMetaTypeConstructHelper<Plasma::Containment::StyleOption>(Plasma::Containment::StyleOption const*)]+0x38): undefined reference to `Plasma::Containment::StyleOption::StyleOption(Plasma::Containment::StyleOption const&)'
sipplasmapart0.cpp:(.text._Z24qMetaTypeConstructHelperIN6Plasma11Containment11StyleOptionEEPvPKT_[void* qMetaTypeConstructHelper<Plasma::Containment::StyleOption>(Plasma::Containment::StyleOption const*)]+0x62): undefined reference to `Plasma::Containment::StyleOption::StyleOption()'
CMakeFiles/python_module_PyKDE4_plasma.dir/sip/plasma/sipplasmapart6.o: In function `init_Plasma_Containment_StyleOption':
sipplasmapart6.cpp:(.text+0x4c71): undefined reference to `Plasma::Containment::StyleOption::StyleOption(QStyleOptionGraphicsItem const&)'
sipplasmapart6.cpp:(.text+0x4c99): undefined reference to `Plasma::Containment::StyleOption::StyleOption()'
sipplasmapart6.cpp:(.text+0x4cd1): undefined reference to `Plasma::Containment::StyleOption::StyleOption(Plasma::Containment::StyleOption const&)'
collect2: ld returned 1 exit status
make[2]: *** [lib/pykde/plasma.so] Error 1
make[1]: *** [python/pykde4/CMakeFiles/python_module_PyKDE4_plasma.dir/all] Error 2
make[1]: *** Waiting for unfinished jobs....
Scanning dependencies of target python_module_PyKDE4_soprano
[ 93%] Building CXX object python/pykde4/CMakeFiles/python_module_PyKDE4_soprano.dir/sip/soprano/sipsopranopart0.o
[ 94%] Building CXX object python/pykde4/CMakeFiles/python_module_PyKDE4_soprano.dir/sip/soprano/sipsopranopart1.o
In file included from /usr/include/python2.5/Python.h:13,
from /usr/include/python2.5/sip.h:28,
from /var/tmp/paludis/kde-base-pykde4-scm/work/pykde4_build/python/pykde4/sip/soprano/sipAPIsoprano.h:11,
from /var/tmp/paludis/kde-base-pykde4-scm/work/pykde4_build/python/pykde4/sip/soprano/sipsopranopart0
...


Does anybody know where could be a problem?

Thank you in advance!

Regards,
Petr
_________________
hidentity.org
Back to top
View user's profile Send private message
Phlogiston
Veteran
Veteran


Joined: 27 Jan 2004
Posts: 1925
Location: Europe, Swizerland

PostPosted: Tue Nov 11, 2008 9:03 pm    Post subject: Reply with quote

I had a similar issue and couldn't solve it. Just get rid of python for now....
_________________
Workstation: 5.1 SurroundSound, LIRC remote control; Laptop [IBM-T43]: patched sources, s2disk/ram, fingerprint sensor
Back to top
View user's profile Send private message
vaticano666
n00b
n00b


Joined: 30 Oct 2003
Posts: 4

PostPosted: Wed Nov 12, 2008 2:15 am    Post subject: kde-base/kdelibs not compile Reply with quote

Code:
-----------------------------------------------------------------------------
-- The following external packages were located on your system.
-- This installation will have the extra features provided by these packages.
+ BZip2
+ OpenSSL
+ Libintl
+ OpenGL
+ Soprano
+ PCRE
+ DNSSD
-----------------------------------------------------------------------------
-- The following OPTIONAL packages could NOT be located on your system.
-- Consider installing them to enable more features from this software.
+ FAM: File Alteration Monitor <http://oss.sgi.com/projects/fam>
Provides file alteration notification facilities using a separate service.
+ GSSAPI: Generic Security Services API <http://web.mit.edu/kerberos/www>
A MIT or HEIMDAL flavor of GSSAPI to provide HTTP authentication services.
+ Aspell: GNU Aspell spell checker <http://aspell.net/>
Provides a spell checker for dozens of languages.
+ HSpell: Hebrew spell checker <http://ivrix.org.il/projects/spell-checker/>
Provides spell checking for Hebrew.
+ Enchant: Enchant Package <http://www.abisource.com/projects/enchant/>
Provides a way to access many spell checking backends.
+ JasPer: JasPer JPEG2000 Library <http://www.ece.uvic.ca/~mdadams/jasper/>
Provides support for JPEG-2000 images.
+ OpenEXR: OpenEXR Package <http://www.openexr.com/>
High dynamic range image manipulation library.
+ Avahi: For Linux and BSDs: a system which facilitates service discovery on a local network, based on the Zeroconf standard <http://avahi.org>
Enables KDE applications access to multicast DNS/DNS-SD service discovery.
-----------------------------------------------------------------------------

CMake Error: The following variables are used in this project, but they are set to NOTFOUND.
Please set them or make sure they are set and tested correctly in the CMake files:
QT_QTWEBKIT_LIBRARY (ADVANCED)
    linked by target "plasma" in directory /var/tmp/paludis/kde-base-kdelibs-scm/work/kdelibs-scm/plasma
    linked by target "packagemetadatatest" in directory /var/tmp/paludis/kde-base-kdelibs-scm/work/kdelibs-scm/plasma/tests
    linked by target "packagestructuretest" in directory /var/tmp/paludis/kde-base-kdelibs-scm/work/kdelibs-scm/plasma/tests
    linked by target "plasmoidpackagetest" in directory /var/tmp/paludis/kde-base-kdelibs-scm/work/kdelibs-scm/plasma/tests

-- Configuring incomplete, errors occurred!

!!! ERROR in kde-base/kdelibs-scm:
!!! In cmake-utils_src_configureout at line 1182
!!! Cmake failed

!!! Call stack:
!!!    * cmake-utils_src_configureout (/var/tmp/paludis/kde-base-kdelibs-scm/temp/loadsaveenv:1182)
!!!    * gks-base_src_configure (/var/tmp/paludis/kde-base-kdelibs-scm/temp/loadsaveenv:3080)
!!!    * gks-base_src_compile (/var/tmp/paludis/kde-base-kdelibs-scm/temp/loadsaveenv:3059)
!!!    * src_compile (/var/tmp/paludis/kde-base-kdelibs-scm/temp/loadsaveenv:4260)
!!!    * ebuild_f_compile (/usr/libexec/paludis/1/src_compile.bash:49)
!!!    * ebuild_main (/usr/libexec/paludis/ebuild.bash:477)
!!!    * main (/usr/libexec/paludis/ebuild.bash:492)

diefunc: making ebuild PID 6392 exit with error
die trap: exiting with error.

Install error:
  * In program paludis -i kde-base/phonon-xine dev-libs/soprano automoc dev-libs/pth dev-libs/libksba dev-libs/libassuan app-crypt/gnupg app-crypt/gpgme dev-libs/libical:
  * When performing install action from command line:
  * When executing install task:
  * When installing 'kde-base/kdelibs-scm:kde-svn::kde4-experimental':
  * Install error: Install failed for 'kde-base/kdelibs-scm:kde-svn::kde4-experimental'


It seems that is because i've not install qt-webkit.
Souldn't be that checked by paludis or ebuilds as dependencies?
Sorry for my english.

EDIT: installing x11-libs/qt-webkit kdelibs are well installed
Back to top
View user's profile Send private message
KejPi
Tux's lil' helper
Tux's lil' helper


Joined: 17 Jan 2004
Posts: 122
Location: Prague, Czech republic

PostPosted: Wed Nov 12, 2008 9:40 am    Post subject: Reply with quote

Phlogiston wrote:
I had a similar issue and couldn't solve it. Just get rid of python for now....


Thanks for answer. Do you have any idea if this a a problem of KDE itself or problem of ebuilds and should be reported as overlay bug?
_________________
hidentity.org
Back to top
View user's profile Send private message
vaticano666
n00b
n00b


Joined: 30 Oct 2003
Posts: 4

PostPosted: Wed Nov 12, 2008 11:32 am    Post subject: "libkdepim directory not found" error Reply with quote

Code:
-- Found the following Boost libraries:
-- Found Akonadi: /usr/lib/libakonadiprotocolinternals.so
-- Found Akonadi includes: /usr/include
-- Found Akonadi common libraries: /usr/lib/libakonadiprotocolinternals.so
-- Found Akonadi dbus-interfaces: /usr/share/dbus-1/interfaces
CMake Error at CMakeLists.txt:82 (message):
  libkdepim directory not found


-- Configuring incomplete, errors occurred!

!!! ERROR in kde-base/libkleo-scm:
!!! In cmake-utils_src_configureout at line 1245
!!! Cmake failed

!!! Call stack:
!!!    * cmake-utils_src_configureout (/var/tmp/paludis/kde-base-libkleo-scm/temp/loadsaveenv:1245)
!!!    * gks-base_src_configure (/var/tmp/paludis/kde-base-libkleo-scm/temp/loadsaveenv:3143)
!!!    * gks-meta_src_configure (/var/tmp/paludis/kde-base-libkleo-scm/temp/loadsaveenv:3409)
!!!    * gks-meta_src_compile (/var/tmp/paludis/kde-base-libkleo-scm/temp/loadsaveenv:3403)
!!!    * src_compile (/var/tmp/paludis/kde-base-libkleo-scm/temp/loadsaveenv:4605)
!!!    * ebuild_f_compile (/usr/libexec/paludis/1/src_compile.bash:49)
!!!    * ebuild_main (/usr/libexec/paludis/ebuild.bash:477)
!!!    * main (/usr/libexec/paludis/ebuild.bash:492)

diefunc: making ebuild PID 4151 exit with error
die trap: exiting with error.

Install error:
  * In program paludis -i kde-base/kmail:
  * When performing install action from command line:
  * When executing install task:
  * When installing 'kde-base/libkleo-scm:kde-svn::kde4-experimental':
  * Install error: Install failed for 'kde-base/libkleo-scm:kde-svn::kde4-experimental'


I've an error installing kmail.
It says : libkdepim directory not found
Help please.
Thanks
Back to top
View user's profile Send private message
cracki
n00b
n00b


Joined: 12 Oct 2005
Posts: 34

PostPosted: Sat Nov 15, 2008 2:47 pm    Post subject: Reply with quote

Hi,
I updated from the old overlay to kde-crazy, now I cant even emerge world...
Any ideas?
:?
emerge: the given set 'world' contains a non-existent set named 'kde-svn-minimal'
Back to top
View user's profile Send private message
gimpel
Advocate
Advocate


Joined: 15 Oct 2004
Posts: 2720
Location: Munich, Bavaria

PostPosted: Sat Nov 15, 2008 2:49 pm    Post subject: Reply with quote

cracki wrote:
Hi,
I updated from the old overlay to kde-crazy, now I cant even emerge world...
Any ideas?
:?
emerge: the given set 'world' contains a non-existent set named 'kde-svn-minimal'

This is the wrong thread.

Anyways.. emerge -Cav @kde-svn-minimal
_________________
http://proaudio.tuxfamily.org/wiki - pro-audio software overlay
Back to top
View user's profile Send private message
cracki
n00b
n00b


Joined: 12 Oct 2005
Posts: 34

PostPosted: Sat Nov 15, 2008 4:01 pm    Post subject: Reply with quote

gimpel wrote:

This is the wrong thread.

Anyways.. emerge -Cav @kde-svn-minimal


Opps sry youre right, wrong thread.
Back to top
View user's profile Send private message
beso_1717
Apprentice
Apprentice


Joined: 19 Jul 2007
Posts: 263

PostPosted: Sat Nov 15, 2008 7:53 pm    Post subject: Reply with quote

i'm experiencing some errors building kwin, plasma-workspace and some other packages.
the kwin error is the following:

Quote:
Scanning dependencies of target kwin_plastik_config
Generating config.moc
Scanning dependencies of target kwin_b2_config
[ 16%] [ 16%] Building CXX object kwin/clients/plastik/config/CMakeFiles/kwin_plastik_config.dir/config.o
Building CXX object kwin/lib/CMakeFiles/kdecorations.dir/kcommondecoration.o
/var/tmp/paludis/kde-base-kwin-scm/work/kwin/kwin/lib/kcommondecoration.cpp:41:28: error: kephal/screens.h: No such file or directory
[ 17%] Building CXX object kwin/clients/b2/config/CMakeFiles/kwin_b2_config.dir/config.o
[ 18%] Building CXX object kwin/lib/CMakeFiles/kwineffects.dir/kwinxrenderutils.o
[ 19%] Building CXX object kwin/kcmkwin/kwincompositing/CMakeFiles/kcm_kwincompositing.dir/monitor.o
/var/tmp/paludis/kde-base-kwin-scm/work/kwin/kwin/clients/plastik/config/config.cpp:36: warning: unused parameter 'config'
/var/tmp/paludis/kde-base-kwin-scm/work/kwin/kwin/lib/kcommondecoration.cpp: In member function 'virtual void KCommonDecoration::updateWindowShape()':
/var/tmp/paludis/kde-base-kwin-scm/work/kwin/kwin/lib/kcommondecoration.cpp:804: error: 'Kephal' has not been declared
/var/tmp/paludis/kde-base-kwin-scm/work/kwin/kwin/lib/kcommondecoration.cpp:806: error: 'Kephal' has not been declared
make[2]: *** [kwin/lib/CMakeFiles/kdecorations.dir/kcommondecoration.o] Error 1
make[1]: *** [kwin/lib/CMakeFiles/kdecorations.dir/all] Error 2
[ 20%] Building CXX object kwin/kcmkwin/kwinrules/CMakeFiles/kcm_kwinrules.dir/ruleslist.o
make[1]: *** Waiting for unfinished jobs....
/var/tmp/paludis/kde-base-kwin-scm/work/kwin/kwin/clients/b2/config/config.cpp:49: warning: unused parameter 'conf'
[ 20%] Building CXX object kwin/clients/plastik/config/CMakeFiles/kwin_plastik_config.dir/kwin_plastik_config_automoc.o
Linking CXX shared module ../../../../lib/kwin_plastik_config.so
Linking CXX shared library ../../lib/libkwineffects.so
make[1]: *** [kwin/kcmkwin/kwinoptions/CMakeFiles/kcm_kwinoptions.dir/all] Error 2
[ 20%] Building CXX object kwin/kcmkwin/kwinrules/CMakeFiles/kdeinit_kwin_rules_dialog.dir/ruleslist.o
[ 20%] Building CXX object kwin/clients/b2/config/CMakeFiles/kwin_b2_config.dir/kwin_b2_config_automoc.o
/usr/lib/gcc/x86_64-pc-linux-gnu/4.3.2/../../../../x86_64-pc-linux-gnu/bin/ld: cannot find -lkephal
collect2: ld returned 1 exit status
make[2]: *** [lib/libkwineffects.so.1.0.0] Error 1
make[1]: *** [kwin/lib/CMakeFiles/kwineffects.dir/all] Error 2
[ 20%] Building CXX object kwin/kcmkwin/kwincompositing/CMakeFiles/kcm_kwincompositing.dir/__/__/compositingprefs.o
Linking CXX shared module ../../../../lib/kwin_b2_config.so
[ 20%] Built target kwin_plastik_config
[ 20%] Building CXX object kwin/kcmkwin/kwinrules/CMakeFiles/kcm_kwinrules.dir/kwinsrc.o
[ 20%] Building CXX object kwin/kcmkwin/kwinrules/CMakeFiles/kdeinit_kwin_rules_dialog.dir/kwinsrc.o
[ 20%] Built target kwin_b2_config
[ 21%] Building CXX object kwin/kcmkwin/kwincompositing/CMakeFiles/kcm_kwincompositing.dir/__/__/lib/kwinglobals.o
[ 22%] [ 22%] Building CXX object kwin/kcmkwin/kwinrules/CMakeFiles/kcm_kwinrules.dir/detectwidget.o
Building CXX object kwin/kcmkwin/kwincompositing/CMakeFiles/kcm_kwincompositing.dir/kwin_interface.o
[ 22%] Building CXX object kwin/kcmkwin/kwinrules/CMakeFiles/kcm_kwinrules.dir/kcm_kwinrules_automoc.o
[ 23%] Building CXX object kwin/kcmkwin/kwinrules/CMakeFiles/kdeinit_kwin_rules_dialog.dir/detectwidget.o
[ 24%] Building CXX object kwin/kcmkwin/kwinrules/CMakeFiles/kdeinit_kwin_rules_dialog.dir/kdeinit_kwin_rules_dialog_automoc.o
Linking CXX shared module ../../../lib/kcm_kwinrules.so
Linking CXX shared library ../../../lib/libkdeinit4_kwin_rules_dialog.so
[ 24%] Building CXX object kwin/kcmkwin/kwincompositing/CMakeFiles/kcm_kwincompositing.dir/kcm_kwincompositing_automoc.o
Linking CXX shared module ../../../lib/kcm_kwincompositing.so
[ 24%] Built target kdeinit_kwin_rules_dialog
[ 24%] Built target kcm_kwinrules
[ 24%] Built target kcm_kwincompositing
make: *** [all] Error 2


plasma-workspace:

Quote:
make -j8 -s
[ 1%] Generating ui_clockConfig.h
[ 1%] Generating clock.moc
Generating defaultAnimator.moc
Generating activitybar.moc
Generating ui_batteryConfig.h
Generating battery.moc
Generating calendar.moc
[ 1%] Generating devicenotifier.moc
Generating ui_clockConfig.h
Generating clock.moc
Generating icon.moc
Generating notifierview.moc
Generating notifierdialog.moc
Scanning dependencies of target plasma_animator_default
Scanning dependencies of target plasma_applet_activitybar
Scanning dependencies of target plasma_applet_calendar
Scanning dependencies of target plasma_applet_clock
Scanning dependencies of target plasma_applet_battery
Scanning dependencies of target plasma_applet_dig_clock
Scanning dependencies of target plasma_applet_icon
Scanning dependencies of target plasma_applet_devicenotifier
[ 1%] Building CXX object plasma/animators/default/CMakeFiles/plasma_animator_default.dir/defaultAnimator.o
[ 1%] Building CXX object plasma/applets/activitybar/CMakeFiles/plasma_applet_activitybar.dir/activitybar.o
[ 1%] Building CXX object plasma/applets/calendar/CMakeFiles/plasma_applet_calendar.dir/calendar.o
[ 2%] Building CXX object plasma/applets/icon/CMakeFiles/plasma_applet_icon.dir/icon.o
[ 3%] [ 3%] [ 3%] Building CXX object plasma/applets/analog-clock/CMakeFiles/plasma_applet_clock.dir/clock.o
Building CXX object plasma/applets/battery/CMakeFiles/plasma_applet_battery.dir/battery.o
Building CXX object plasma/applets/digital-clock/CMakeFiles/plasma_applet_dig_clock.dir/clock.o
[ 3%] Building CXX object plasma/applets/devicenotifier/CMakeFiles/plasma_applet_devicenotifier.dir/devicenotifier.o
[ 3%] Building CXX object plasma/animators/default/CMakeFiles/plasma_animator_default.dir/plasma_animator_default_automoc.o
Linking CXX shared module ../../../lib/plasma_animator_default.so
[ 3%] Building CXX object plasma/applets/calendar/CMakeFiles/plasma_applet_calendar.dir/plasma_applet_calendar_automoc.o
Linking CXX shared module ../../../lib/plasma_applet_calendar.so
[ 3%] Built target plasma_animator_default
[ 3%] Building CXX object plasma/applets/devicenotifier/CMakeFiles/plasma_applet_devicenotifier.dir/notifierdialog.o
/var/tmp/paludis/kde-base-plasma-workspace-scm/work/plasma-workspace/plasma/applets/icon/icon.cpp: In member function 'void IconApplet::openUrl()':
/var/tmp/paludis/kde-base-plasma-workspace-scm/work/plasma-workspace/plasma/applets/icon/icon.cpp:141: warning: unused variable 'run'
[ 3%] Built target plasma_applet_calendar
[ 3%] Building CXX object plasma/applets/devicenotifier/CMakeFiles/plasma_applet_devicenotifier.dir/notifierview.o
[ 3%] Building CXX object plasma/applets/activitybar/CMakeFiles/plasma_applet_activitybar.dir/plasma_applet_activitybar_automoc.o
Linking CXX shared module ../../../lib/plasma_applet_activitybar.so
[ 3%] Built target plasma_applet_activitybar
Generating trash.moc
[ 3%] [ 3%] Building CXX object plasma/applets/icon/CMakeFiles/plasma_applet_icon.dir/plasma_applet_icon_automoc.o
Building CXX object plasma/applets/analog-clock/CMakeFiles/plasma_applet_clock.dir/plasma_applet_clock_automoc.o
Linking CXX shared module ../../../lib/plasma_applet_clock.so
Linking CXX shared module ../../../lib/plasma_applet_icon.so
Scanning dependencies of target plasma_applet_trash
[ 4%] Building CXX object plasma/applets/devicenotifier/CMakeFiles/plasma_applet_devicenotifier.dir/plasma_applet_devicenotifier_automoc.o
[ 4%] Built target plasma_applet_clock
[ 4%] Generating ksmserver_interface.cpp, ksmserver_interface.h
[ 5%] Generating ksmserver_interface.cpp, ksmserver_interface.h
Generating launcher.moc
[ 5%] Built target plasma_applet_icon
Generating launcher.moc
[ 5%] Generating kickoffadaptor.cpp, kickoffadaptor.h
[ 5%] Generating kickoffadaptor.cpp, kickoffadaptor.h
[ 6%] [ 7%] Building CXX object plasma/applets/digital-clock/CMakeFiles/plasma_applet_dig_clock.dir/plasma_applet_dig_clock_automoc.o
Generating ksmserver_interface.cpp, ksmserver_interface.h
Linking CXX shared module ../../../lib/plasma_applet_dig_clock.so
Generating lockout.moc
Generating recentlyusedmodel.moc
Generating recentlyusedmodel.moc
Generating systemmodel.moc
Generating applet.moc
[ 8%] Linking CXX shared module ../../../lib/plasma_applet_devicenotifier.so
Generating recentadaptor.cpp, recentadaptor.h
Generating systemmodel.moc
[ 8%] Building CXX object plasma/applets/trash/CMakeFiles/plasma_applet_trash.dir/trash.o
Generating kickoffproxymodel.moc
[ 8%] Generating screensaver_interface.cpp, screensaver_interface.h
[ 8%] Generating recentadaptor.cpp, recentadaptor.h
[ 8%] Building CXX object plasma/applets/battery/CMakeFiles/plasma_applet_battery.dir/plasma_applet_battery_automoc.o
[ 8%] Generating screensaver_interface.cpp, screensaver_interface.h
Generating kickoffabstractmodel.moc
Linking CXX shared module ../../../lib/plasma_applet_battery.so
[ 8%] Generating ksmserver_interface.moc
Generating kickoffproxymodel.moc
[ 9%] Generating screensaver_interface.cpp, screensaver_interface.h
Generating kickoffmodel.moc
[ 9%] Generating screensaver_interface.moc
Generating kickoffabstractmodel.moc
[ 9%] Generating ui_webbrowserconfig.h
[ 9%] Generating contextmenufactory.moc
Built target plasma_applet_dig_clock
[ 10%] Generating krunner_interface.cpp, krunner_interface.h
[ 10%] Generating webbrowser.moc
Generating krunner_interface.cpp, krunner_interface.h
[ 10%] Generating kickoffmodel.moc
Generating ui_pagerConfig.h
Generating pager.moc
Scanning dependencies of target plasma_applet_lockout
[ 10%] Built target plasma_applet_devicenotifier
[ 10%] Generating ksmserver_interface.moc
Generating contextmenufactory.moc
Generating menuview.moc
[ 10%] Generating ksmserver_interface.moc
Generating historycombobox.moc
Generating searchbar.moc
Generating moc_bookmarksdelegate.cpp
Generating monitoricon.moc
Generating searchbar.moc
Generating leavemodel.moc
[ 10%] Built target plasma_applet_battery
[ 10%] Generating kickoffadaptor.moc
Scanning dependencies of target plasma_applet_pager
Generating moc_applet.cpp
Generating leavemodel.moc
Generating flipscrollview.moc
Scanning dependencies of target plasma_applet_webbrowser
Generating flipscrollview.moc
[ 10%] Generating kickoffadaptor.moc
[ 10%] Generating simpleapplet.moc
Building CXX object plasma/applets/lock_logout/CMakeFiles/plasma_applet_lockout.dir/lockout.o
Scanning dependencies of target plasma_applet-system-monitor
Generating applicationmodel.moc
Generating urlitemview.moc
[ 10%] Generating recentadaptor.moc
Generating applicationmodel.moc
Generating urlitemview.moc
Generating tabbar.moc
[ 11%] Building CXX object plasma/applets/pager/CMakeFiles/plasma_applet_pager.dir/pager.o
[ 12%] Building CXX object plasma/applets/lock_logout/CMakeFiles/plasma_applet_lockout.dir/screensaver_interface.o
Generating favoritesmodel.moc
Generating tabbar.moc
Generating recentapplications.moc
Generating urlitemlauncher.moc
/var/tmp/paludis/kde-base-plasma-workspace-scm/work/plasma-workspace/plasma/applets/pager/pager.cpp:49:28: error: kephal/screens.h: No such file or directory
Generating favoritesmodel.moc
[ 12%] Building CXX object plasma/applets/webbrowser/CMakeFiles/plasma_applet_webbrowser.dir/historycombobox.o
[ 12%] Generating recentapplications.moc
Building CXX object plasma/applets/system-monitor/CMakeFiles/plasma_applet-system-monitor.dir/monitoricon.o
Generating searchmodel.moc
Generating moc_brandingbutton.cpp
Generating urlitemlauncher.moc
Generating moc_itemhandlers.cpp
Generating searchmodel.moc
Generating moc_brandingbutton.cpp
Generating moc_panelsvgwidget.cpp
Generating moc_itemhandlers.cpp
Generating moc_panelsvgwidget.cpp
[ 12%] Generating screensaver_interface.moc
[ 12%] Generating recentadaptor.moc
[ 12%] Generating krunner_interface.moc
[ 12%] Building CXX object plasma/applets/trash/CMakeFiles/plasma_applet_trash.dir/plasma_applet_trash_automoc.o
Linking CXX shared module ../../../lib/plasma_applet_trash.so
/var/tmp/paludis/kde-base-plasma-workspace-scm/work/plasma-workspace/plasma/applets/pager/pager.cpp: In member function 'virtual void Pager::init()':
/var/tmp/paludis/kde-base-plasma-workspace-scm/work/plasma-workspace/plasma/applets/pager/pager.cpp:116: error: 'Kephal' has not been declared
/var/tmp/paludis/kde-base-plasma-workspace-scm/work/plasma-workspace/plasma/applets/pager/pager.cpp:117: error: 'Kephal' has not been declared
/var/tmp/paludis/kde-base-plasma-workspace-scm/work/plasma-workspace/plasma/applets/pager/pager.cpp:118: error: 'Kephal' has not been declared
/var/tmp/paludis/kde-base-plasma-workspace-scm/work/plasma-workspace/plasma/applets/pager/pager.cpp:119: error: 'Kephal' has not been declared
[ 12%] /var/tmp/paludis/kde-base-plasma-workspace-scm/work/plasma-workspace/plasma/applets/pager/pager.cpp: In member function 'void Pager::recalculateGeometry()':
/var/tmp/paludis/kde-base-plasma-workspace-scm/work/plasma-workspace/plasma/applets/pager/pager.cpp:273: error: 'Kephal' was not declared in this scope
/var/tmp/paludis/kde-base-plasma-workspace-scm/work/plasma-workspace/plasma/applets/pager/pager.cpp:273: error: expected ',' or ';' before '::' token
/var/tmp/paludis/kde-base-plasma-workspace-scm/work/plasma-workspace/plasma/applets/pager/pager.cpp:292: error: 'Kephal' has not been declared
/var/tmp/paludis/kde-base-plasma-workspace-scm/work/plasma-workspace/plasma/applets/pager/pager.cpp:293: error: 'Kephal' has not been declared
/var/tmp/paludis/kde-base-plasma-workspace-scm/work/plasma-workspace/plasma/applets/pager/pager.cpp:297: error: 'Kephal' has not been declared
/var/tmp/paludis/kde-base-plasma-workspace-scm/work/plasma-workspace/plasma/applets/pager/pager.cpp:298: error: 'Kephal' has not been declared
/var/tmp/paludis/kde-base-plasma-workspace-scm/work/plasma-workspace/plasma/applets/pager/pager.cpp:310: error: 'Kephal' has not been declared
Generating screensaver_interface.moc
/var/tmp/paludis/kde-base-plasma-workspace-scm/work/plasma-workspace/plasma/applets/pager/pager.cpp: In member function 'QRect Pager::fixViewportPosition(const QRect&)':
/var/tmp/paludis/kde-base-plasma-workspace-scm/work/plasma-workspace/plasma/applets/pager/pager.cpp:1066: error: 'Kephal' has not been declared
[ 13%] Building CXX object plasma/applets/system-monitor/CMakeFiles/plasma_applet-system-monitor.dir/applet.o
Scanning dependencies of target plasma_applet_launcher
[ 14%] Building CXX object plasma/applets/webbrowser/CMakeFiles/plasma_applet_webbrowser.dir/bookmarksdelegate.o
[ 14%] Generating krunner_interface.moc
make[2]: *** [plasma/applets/pager/CMakeFiles/plasma_applet_pager.dir/pager.o] Error 1
make[1]: *** [plasma/applets/pager/CMakeFiles/plasma_applet_pager.dir/all] Error 2
[ 14%] make[1]: *** Waiting for unfinished jobs....
Building CXX object plasma/applets/lock_logout/CMakeFiles/plasma_applet_lockout.dir/ksmserver_interface.o
[ 14%] Building CXX object plasma/applets/lock_logout/CMakeFiles/plasma_applet_lockout.dir/plasma_applet_lockout_automoc.o
[ 14%] Building CXX object plasma/applets/webbrowser/CMakeFiles/plasma_applet_webbrowser.dir/bookmarkitem.o
[ 14%] Built target plasma_applet_trash
[ 14%] Building CXX object plasma/applets/webbrowser/CMakeFiles/plasma_applet_webbrowser.dir/webbrowser.o
Scanning dependencies of target plasma_applet_simplelauncher
[ 14%] Building CXX object plasma/applets/webbrowser/CMakeFiles/plasma_applet_webbrowser.dir/plasma_applet_webbrowser_automoc.o
Linking CXX shared module ../../../lib/plasma_applet_lockout.so
[ 14%] Building CXX object plasma/applets/system-monitor/CMakeFiles/plasma_applet-system-monitor.dir/plasma_applet-system-monitor_automoc.o
[ 14%] [ 14%] [ 15%] Building CXX object plasma/applets/kickoff/CMakeFiles/plasma_applet_launcher.dir/core/kickoffmodel.o
Building CXX object plasma/applets/kickoff/CMakeFiles/plasma_applet_launcher.dir/core/kickoffabstractmodel.o
Building CXX object plasma/applets/kickoff/CMakeFiles/plasma_applet_launcher.dir/core/kickoffproxymodel.o
[ 15%] Building CXX object plasma/applets/kickoff/CMakeFiles/plasma_applet_launcher.dir/core/applicationmodel.o
[ 15%] Building CXX object plasma/applets/kickoff/CMakeFiles/plasma_applet_simplelauncher.dir/core/kickoffmodel.o
[ 15%] Built target plasma_applet_lockout
[ 15%] Building CXX object plasma/applets/kickoff/CMakeFiles/plasma_applet_launcher.dir/core/favoritesmodel.o
Linking CXX shared module ../../../lib/plasma_applet_webbrowser.so
[ 15%] Building CXX object plasma/applets/kickoff/CMakeFiles/plasma_applet_simplelauncher.dir/core/kickoffabstractmodel.o
[ 16%] Building CXX object plasma/applets/kickoff/CMakeFiles/plasma_applet_launcher.dir/core/leavemodel.o
[ 16%] Building CXX object plasma/applets/kickoff/CMakeFiles/plasma_applet_launcher.dir/core/models.o
Linking CXX shared library ../../../lib/libplasma_applet-system-monitor.so
[ 16%] Building CXX object plasma/applets/kickoff/CMakeFiles/plasma_applet_simplelauncher.dir/core/kickoffproxymodel.o
[ 16%] Built target plasma_applet_webbrowser
[ 16%] Building CXX object plasma/applets/kickoff/CMakeFiles/plasma_applet_launcher.dir/core/recentapplications.o
[ 17%] Building CXX object plasma/applets/kickoff/CMakeFiles/plasma_applet_simplelauncher.dir/core/applicationmodel.o
[ 17%] Building CXX object plasma/applets/kickoff/CMakeFiles/plasma_applet_launcher.dir/core/recentlyusedmodel.o
[ 17%] Built target plasma_applet-system-monitor
[ 17%] Building CXX object plasma/applets/kickoff/CMakeFiles/plasma_applet_simplelauncher.dir/core/favoritesmodel.o
[ 18%] Building CXX object plasma/applets/kickoff/CMakeFiles/plasma_applet_launcher.dir/core/searchmodel.o
[ 18%] Building CXX object plasma/applets/kickoff/CMakeFiles/plasma_applet_launcher.dir/core/systemmodel.o
[ 18%] Building CXX object plasma/applets/kickoff/CMakeFiles/plasma_applet_simplelauncher.dir/core/leavemodel.o
[ 18%] Building CXX object plasma/applets/kickoff/CMakeFiles/plasma_applet_simplelauncher.dir/core/models.o
[ 18%] Building CXX object plasma/applets/kickoff/CMakeFiles/plasma_applet_launcher.dir/core/urlitemlauncher.o
[ 18%] Building CXX object plasma/applets/kickoff/CMakeFiles/plasma_applet_simplelauncher.dir/core/recentapplications.o
[ 18%] Building CXX object plasma/applets/kickoff/CMakeFiles/plasma_applet_launcher.dir/core/itemhandlers.o
[ 19%] Building CXX object plasma/applets/kickoff/CMakeFiles/plasma_applet_simplelauncher.dir/core/recentlyusedmodel.o
[ 20%] [ 20%] Building CXX object plasma/applets/kickoff/CMakeFiles/plasma_applet_simplelauncher.dir/core/searchmodel.o
Building CXX object plasma/applets/kickoff/CMakeFiles/plasma_applet_launcher.dir/ui/brandingbutton.o
[ 20%] Building CXX object plasma/applets/kickoff/CMakeFiles/plasma_applet_launcher.dir/ui/contextmenufactory.o
[ 20%] Building CXX object plasma/applets/kickoff/CMakeFiles/plasma_applet_simplelauncher.dir/core/systemmodel.o
[ 20%] Building CXX object plasma/applets/kickoff/CMakeFiles/plasma_applet_simplelauncher.dir/core/urlitemlauncher.o
[ 21%] Building CXX object plasma/applets/kickoff/CMakeFiles/plasma_applet_simplelauncher.dir/core/itemhandlers.o
[ 21%] Building CXX object plasma/applets/kickoff/CMakeFiles/plasma_applet_launcher.dir/ui/flipscrollview.o
[ 21%] Building CXX object plasma/applets/kickoff/CMakeFiles/plasma_applet_launcher.dir/ui/itemdelegate.o
[ 21%] Building CXX object plasma/applets/kickoff/CMakeFiles/plasma_applet_simplelauncher.dir/ui/brandingbutton.o
[ 22%] Building CXX object plasma/applets/kickoff/CMakeFiles/plasma_applet_launcher.dir/ui/panelsvgwidget.o
/var/tmp/paludis/kde-base-plasma-workspace-scm/work/plasma-workspace/plasma/applets/kickoff/ui/flipscrollview.cpp:548: warning: unused parameter 'event'
/var/tmp/paludis/kde-base-plasma-workspace-scm/work/plasma-workspace/plasma/applets/kickoff/ui/flipscrollview.cpp: In member function 'virtual void Kickoff::FlipScrollView::startDrag(Qt::DropActions)':
/var/tmp/paludis/kde-base-plasma-workspace-scm/work/plasma-workspace/plasma/applets/kickoff/ui/flipscrollview.cpp:713: warning: unused variable 'dropAction'
[ 22%] Building CXX object plasma/applets/kickoff/CMakeFiles/plasma_applet_simplelauncher.dir/ui/contextmenufactory.o
[ 22%] Building CXX object plasma/applets/kickoff/CMakeFiles/plasma_applet_launcher.dir/ui/launcher.o
/var/tmp/paludis/kde-base-plasma-workspace-scm/work/plasma-workspace/plasma/applets/kickoff/ui/panelsvgwidget.cpp:40: warning: unused parameter 'event'
[ 22%] Building CXX object plasma/applets/kickoff/CMakeFiles/plasma_applet_launcher.dir/ui/searchbar.o
[ 22%] Building CXX object plasma/applets/kickoff/CMakeFiles/plasma_applet_simplelauncher.dir/ui/flipscrollview.o
[ 22%] [ 23%] Building CXX object plasma/applets/kickoff/CMakeFiles/plasma_applet_launcher.dir/ui/urlitemview.o
Building CXX object plasma/applets/kickoff/CMakeFiles/plasma_applet_launcher.dir/ui/tabbar.o
[ 23%] Building CXX object plasma/applets/kickoff/CMakeFiles/plasma_applet_launcher.dir/kickoffadaptor.o
[ 23%] Building CXX object plasma/applets/kickoff/CMakeFiles/plasma_applet_launcher.dir/recentadaptor.o
[ 23%] Building CXX object plasma/applets/kickoff/CMakeFiles/plasma_applet_launcher.dir/screensaver_interface.o
/var/tmp/paludis/kde-base-plasma-workspace-scm/work/plasma-workspace/plasma/applets/kickoff/ui/flipscrollview.cpp:548: warning: unused parameter 'event'
/var/tmp/paludis/kde-base-plasma-workspace-scm/work/plasma-workspace/plasma/applets/kickoff/ui/flipscrollview.cpp: In member function 'virtual void Kickoff::FlipScrollView::startDrag(Qt::DropActions)':
/var/tmp/paludis/kde-base-plasma-workspace-scm/work/plasma-workspace/plasma/applets/kickoff/ui/flipscrollview.cpp:713: warning: unused variable 'dropAction'
[ 23%] Building CXX object plasma/applets/kickoff/CMakeFiles/plasma_applet_launcher.dir/krunner_interface.o
[ 24%] Building CXX object plasma/applets/kickoff/CMakeFiles/plasma_applet_launcher.dir/ksmserver_interface.o
[ 25%] Building CXX object plasma/applets/kickoff/CMakeFiles/plasma_applet_simplelauncher.dir/ui/itemdelegate.o
[ 25%] [ 25%] Building CXX object plasma/applets/kickoff/CMakeFiles/plasma_applet_launcher.dir/applet/applet.o
Building CXX object plasma/applets/kickoff/CMakeFiles/plasma_applet_simplelauncher.dir/ui/panelsvgwidget.o
[ 25%] Building CXX object plasma/applets/kickoff/CMakeFiles/plasma_applet_simplelauncher.dir/ui/launcher.o
[ 25%] Building CXX object plasma/applets/kickoff/CMakeFiles/plasma_applet_launcher.dir/plasma_applet_launcher_automoc.o
[ 25%] Building CXX object plasma/applets/kickoff/CMakeFiles/plasma_applet_simplelauncher.dir/ui/searchbar.o
/var/tmp/paludis/kde-base-plasma-workspace-scm/work/plasma-workspace/plasma/applets/kickoff/ui/panelsvgwidget.cpp:40: warning: unused parameter 'event'
[ 26%] Building CXX object plasma/applets/kickoff/CMakeFiles/plasma_applet_simplelauncher.dir/ui/tabbar.o
[ 26%] Building CXX object plasma/applets/kickoff/CMakeFiles/plasma_applet_simplelauncher.dir/ui/urlitemview.o
[ 26%] Building CXX object plasma/applets/kickoff/CMakeFiles/plasma_applet_simplelauncher.dir/kickoffadaptor.o
[ 26%] Building CXX object plasma/applets/kickoff/CMakeFiles/plasma_applet_simplelauncher.dir/recentadaptor.o
[ 27%] Building CXX object plasma/applets/kickoff/CMakeFiles/plasma_applet_simplelauncher.dir/screensaver_interface.o
[ 27%] Building CXX object plasma/applets/kickoff/CMakeFiles/plasma_applet_simplelauncher.dir/krunner_interface.o
Linking CXX shared module ../../../lib/plasma_applet_launcher.so
[ 27%] Building CXX object plasma/applets/kickoff/CMakeFiles/plasma_applet_simplelauncher.dir/ksmserver_interface.o
[ 27%] Building CXX object plasma/applets/kickoff/CMakeFiles/plasma_applet_simplelauncher.dir/simpleapplet/menuview.o
[ 28%] Building CXX object plasma/applets/kickoff/CMakeFiles/plasma_applet_simplelauncher.dir/simpleapplet/simpleapplet.o
[ 29%] Building CXX object plasma/applets/kickoff/CMakeFiles/plasma_applet_simplelauncher.dir/plasma_applet_simplelauncher_automoc.o
[ 29%] Built target plasma_applet_launcher
Linking CXX shared module ../../../lib/plasma_applet_simplelauncher.so
[ 29%] Built target plasma_applet_simplelauncher
make: *** [all] Error 2


the plasma error is quite strange, since there doesn't seem to be a real error in that file...[/quote]

is someone else experiencing the same issues?!
Back to top
View user's profile Send private message
Stefano Crocco
Apprentice
Apprentice


Joined: 28 Sep 2006
Posts: 157

PostPosted: Sat Nov 15, 2008 8:27 pm    Post subject: Reply with quote

beso_1717 wrote:
i'm experiencing some errors building kwin, plasma-workspace and some other packages.
the kwin error is the following:

the plasma error is quite strange, since there doesn't seem to be a real error in that file...


is someone else experiencing the same issues?![/quote]

The problem is that since yesterday, kwin and plasma (in particular the pager) depend on a new libreary, kephal, which is in the kdebase-workspace module and for which there isn't as yet an ebuild. I tried to make it, basing on the one for kde-base/libplasmaclok, and here's the result:

Code:
KMNAME=kdebase-workspace
KMMODULE=libs/${PN}
inherit gks-svn-meta

DESCRIPTION=""
KEYWORDS=""
IUSE="debug"

It needs to be saved in a kephal/kephal-scm.kdebuild-1 file in a repository (the kde4-experimental one or another one), and needs to be added to /etc/paludis/keywords.conf.

Note that, if you put it in the kde4-experimental repository, you'll need to manually remove it when the official ebuild will be made, otherwise git will complain when you try to sync.
_________________
Stefano
Back to top
View user's profile Send private message
beso_1717
Apprentice
Apprentice


Joined: 19 Jul 2007
Posts: 263

PostPosted: Sun Nov 16, 2008 2:44 pm    Post subject: Reply with quote

Stefano Crocco wrote:
beso_1717 wrote:
i'm experiencing some errors building kwin, plasma-workspace and some other packages.
the kwin error is the following:

the plasma error is quite strange, since there doesn't seem to be a real error in that file...


is someone else experiencing the same issues?!


The problem is that since yesterday, kwin and plasma (in particular the pager) depend on a new libreary, kephal, which is in the kdebase-workspace module and for which there isn't as yet an ebuild. I tried to make it, basing on the one for kde-base/libplasmaclok, and here's the result:

Code:
KMNAME=kdebase-workspace
KMMODULE=libs/${PN}
inherit gks-svn-meta

DESCRIPTION=""
KEYWORDS=""
IUSE="debug"

It needs to be saved in a kephal/kephal-scm.kdebuild-1 file in a repository (the kde4-experimental one or another one), and needs to be added to /etc/paludis/keywords.conf.

Note that, if you put it in the kde4-experimental repository, you'll need to manually remove it when the official ebuild will be made, otherwise git will complain when you try to sync.[/quote]

the problem is that the other ebuilds failing on it should be made dependant on this one. have you already posted a bug on the bugzilla with the new ebuild and the fixed deps on the others?!
Back to top
View user's profile Send private message
Display posts from previous:   
Reply to topic    Gentoo Forums Forum Index Unsupported Software All times are GMT
Goto page Previous  1, 2, 3, 4, 5, 6, 7  Next
Page 3 of 7

 
Jump to:  
You cannot post new topics in this forum
You cannot reply to topics in this forum
You cannot edit your posts in this forum
You cannot delete your posts in this forum
You cannot vote in polls in this forum