Gentoo Forums
Gentoo Forums
Gentoo Forums
Quick Search: in
vmware-modules won't compile
View unanswered posts
View posts from last 24 hours

 
Reply to topic    Gentoo Forums Forum Index Unsupported Software
View previous topic :: View next topic  
Author Message
fabien29200
n00b
n00b


Joined: 12 Jun 2006
Posts: 32

PostPosted: Thu Dec 18, 2008 9:35 am    Post subject: vmware-modules won't compile Reply with quote

Hello !
I'm trying to install vmware-server which requires vmware-modules.
But there's a strange error in the build :

Code:
>>> Emerging (1 of 3) app-emulation/vmware-modules-1.0.0.15-r1
 * vmware-any-any-update115.tar.gz RMD160 SHA1 SHA256 size ;-) ...                                                                                                           [ ok ]
 * checking ebuild checksums ;-) ...                                                                                                                                         [ ok ]
 * checking auxfile checksums ;-) ...                                                                                                                                        [ ok ]
 * checking miscfile checksums ;-) ...                                                                                                                                       [ ok ]
 * Determining the location of the kernel source code                                                                                                                             
 * Found kernel source directory:                                                                                                                                                 
 *     /usr/src/linux                                                                                                                                                             
 * Found kernel object directory:                                                                                                                                                 
 *     /lib/modules/2.6.27-gentoo-r5/build                                                                                                                                         
 * Found sources for kernel version:                                                                                                                                               
 *     2.6.27-gentoo-r5                                                                                                                                                           
>>> Unpacking source...                                                                                                                                                           
>>> Unpacking vmware-any-any-update115.tar.gz to /var/tmp/portage/app-emulation/vmware-modules-1.0.0.15-r1/work                                                                   
>>> Unpacking ./vmware-any-any-update115/vmmon.tar to /var/tmp/portage/app-emulation/vmware-modules-1.0.0.15-r1/work                                                               
 * Applying various patches (bugfixes/updates) ...                                                                                                                                 
 *   000_all_makefile-include-directory.patch ...                                                                                                                             [ ok ]
 *   020_all_epoll-def-warnings.patch ...                                                                                                                                     [ ok ]
 * Done with patching                                                                                                                                                               
 * Applying various patches (bugfixes/updates) ...                                                                                                                                 
 *   030_all_fix-linux-headers.patch ...                                                                                                                                      [ ok ]
 *   035_all_kernel-2.6.25.patch ...                                                                                                                                          [ ok ]
 * Done with patching                                                                                                                                                               
 * Converting vmmon-only/Makefile to use M= instead of SUBDIRS= ...                                                                                                           [ ok ]
>>> Unpacking ./vmware-any-any-update115/vmnet.tar to /var/tmp/portage/app-emulation/vmware-modules-1.0.0.15-r1/work                                                               
 * Applying various patches (bugfixes/updates) ...                                                                                                                                 
 *   000_all_makefile-include-directory.patch ...                                                                                                                             [ ok ]
 *   020_all_epoll-def-warnings.patch ...                                                                                                                                     [ ok ]
 * Done with patching                                                                                                                                                               
 * Applying various patches (bugfixes/updates) ...                                                                                                                                 
 *   021_all_wireless_fix.patch ...                                                                                                                                           [ ok ]
 *   025_all_kernel-2.6.25.patch ...                                                                                                                                          [ ok ]
 * Done with patching                                                                                                                                                               
 * Converting vmnet-only/Makefile to use M= instead of SUBDIRS= ...                                                                                                           [ ok ]
>>> Source unpacked.                                                                                                                                                               
>>> Compiling source in /var/tmp/portage/app-emulation/vmware-modules-1.0.0.15-r1/work ...                                                                                         
 * Preparing vmmon module                                                                                                                                                           
make -j3 HOSTCC=x86_64-pc-linux-gnu-gcc CROSS_COMPILE=x86_64-pc-linux-gnu- LDFLAGS= auto-build VMWARE_VER=VME_S1B1 KERNEL_DIR=/usr/src/linux KBUILD_OUTPUT=/lib/modules/2.6.27-gentoo-r5/build                                                                                                                                                                         
Using 2.6.x kernel build system.                                                                                                                                                   
make -C /usr/src/linux/include/.. M=$PWD SRCROOT=$PWD/. modules                                                                                                                     
make[1]: Entering directory `/usr/src/linux-2.6.27-gentoo-r5'                                                                                                                       
make[1]: warning: jobserver unavailable: using -j1.  Add `+' to parent make rule.                                                                                                   
  CC [M]  /var/tmp/portage/app-emulation/vmware-modules-1.0.0.15-r1/work/vmmon-only/linux/driver.o                                                                                 
In file included from /var/tmp/portage/app-emulation/vmware-modules-1.0.0.15-r1/work/vmmon-only/./include/x86.h:24,                                                                 
                 from /var/tmp/portage/app-emulation/vmware-modules-1.0.0.15-r1/work/vmmon-only/linux/driver.h:15,                                                                 
                 from /var/tmp/portage/app-emulation/vmware-modules-1.0.0.15-r1/work/vmmon-only/linux/driver.c:53:                                                                 
/var/tmp/portage/app-emulation/vmware-modules-1.0.0.15-r1/work/vmmon-only/./include/x86paging.h:61:1: warning: "PTE_PFN_MASK" redefined                                             
In file included from include/asm/pda.h:8,                                                                                                                                         
                 from include/asm/current.h:19,                                                                                                                                     
                 from include/asm/processor.h:15,                                                                                                                                   
                 from include/linux/prefetch.h:14,                                                                                                                                 
                 from include/linux/list.h:6,                                                                                                                                       
                 from include/linux/module.h:9,                                                                                                                                     
                 from /var/tmp/portage/app-emulation/vmware-modules-1.0.0.15-r1/work/vmmon-only/linux/driver.c:16:                                                                 
include/asm/page.h:22:1: warning: this is the location of the previous definition                                                                                                   
In file included from /var/tmp/portage/app-emulation/vmware-modules-1.0.0.15-r1/work/vmmon-only/linux/vmhost.h:13,                                                                 
                 from /var/tmp/portage/app-emulation/vmware-modules-1.0.0.15-r1/work/vmmon-only/linux/driver.c:84:                                                                 
/var/tmp/portage/app-emulation/vmware-modules-1.0.0.15-r1/work/vmmon-only/./include/compat_semaphore.h:5:27: error: asm/semaphore.h: No such file or directory                     
/var/tmp/portage/app-emulation/vmware-modules-1.0.0.15-r1/work/vmmon-only/linux/driver.c:171: error: unknown field 'nopage' specified in initializer                               
/var/tmp/portage/app-emulation/vmware-modules-1.0.0.15-r1/work/vmmon-only/linux/driver.c:172: warning: initialization from incompatible pointer type                               
/var/tmp/portage/app-emulation/vmware-modules-1.0.0.15-r1/work/vmmon-only/linux/driver.c:175: error: unknown field 'nopage' specified in initializer
/var/tmp/portage/app-emulation/vmware-modules-1.0.0.15-r1/work/vmmon-only/linux/driver.c:176: warning: initialization from incompatible pointer type
/var/tmp/portage/app-emulation/vmware-modules-1.0.0.15-r1/work/vmmon-only/linux/driver.c: In function '__LinuxDriver_Ioctl':
/var/tmp/portage/app-emulation/vmware-modules-1.0.0.15-r1/work/vmmon-only/linux/driver.c:1781: error: too many arguments to function 'smp_call_function'
make[3]: *** [/var/tmp/portage/app-emulation/vmware-modules-1.0.0.15-r1/work/vmmon-only/linux/driver.o] Error 1
make[2]: *** [_module_/var/tmp/portage/app-emulation/vmware-modules-1.0.0.15-r1/work/vmmon-only] Error 2
make[1]: *** [sub-make] Error 2
make[1]: Leaving directory `/usr/src/linux-2.6.27-gentoo-r5'
make: *** [vmmon.ko] Error 2
 *
 * ERROR: app-emulation/vmware-modules-1.0.0.15-r1 failed.
 * Call stack:
 *               ebuild.sh, line   49:  Called src_compile
 *             environment, line 3296:  Called linux-mod_src_compile
 *             environment, line 2512:  Called die
 * The specific snippet of code:
 *               eval "emake HOSTCC="$(tc-getBUILD_CC)"                                                 CROSS_COMPILE=${CHOST}-                                                 LDFLAGS="$(get_abi_LDFLAGS)"                                                ${BUILD_FIXES}                                          ${BUILD_PARAMS}                                    ${BUILD_TARGETS} " || die "Unable to emake HOSTCC="$(tc-getBUILD_CC)" CROSS_COMPILE=${CHOST}- LDFLAGS="$(get_abi_LDFLAGS)" ${BUILD_FIXES} ${BUILD_PARAMS} ${BUILD_TARGETS}";
 *  The die message:
 *   Unable to emake HOSTCC=x86_64-pc-linux-gnu-gcc CROSS_COMPILE=x86_64-pc-linux-gnu- LDFLAGS=   auto-build VMWARE_VER=VME_S1B1 KERNEL_DIR=/usr/src/linux KBUILD_OUTPUT=/lib/modules/2.6.27-gentoo-r5/build
 *
 * If you need support, post the topmost build error, and the call stack if relevant.
 * A complete build log is located at '/var/tmp/portage/app-emulation/vmware-modules-1.0.0.15-r1/temp/build.log'.
 * The ebuild environment file is located at '/var/tmp/portage/app-emulation/vmware-modules-1.0.0.15-r1/temp/environment'.
 *

>>> Failed to emerge app-emulation/vmware-modules-1.0.0.15-r1, Log file:

>>>  '/var/tmp/portage/app-emulation/vmware-modules-1.0.0.15-r1/temp/build.log'

 * Messages for package app-emulation/vmware-modules-1.0.0.15-r1:

 *
 * ERROR: app-emulation/vmware-modules-1.0.0.15-r1 failed.
 * Call stack:
 *               ebuild.sh, line   49:  Called src_compile
 *             environment, line 3296:  Called linux-mod_src_compile
 *             environment, line 2512:  Called die
 * The specific snippet of code:
 *               eval "emake HOSTCC="$(tc-getBUILD_CC)"                                                 CROSS_COMPILE=${CHOST}-                                                 LDFLAGS="$(get_abi_LDFLAGS)"                                                ${BUILD_FIXES}                                          ${BUILD_PARAMS}                                    ${BUILD_TARGETS} " || die "Unable to emake HOSTCC="$(tc-getBUILD_CC)" CROSS_COMPILE=${CHOST}- LDFLAGS="$(get_abi_LDFLAGS)" ${BUILD_FIXES} ${BUILD_PARAMS} ${BUILD_TARGETS}";
 *  The die message:
 *   Unable to emake HOSTCC=x86_64-pc-linux-gnu-gcc CROSS_COMPILE=x86_64-pc-linux-gnu- LDFLAGS=   auto-build VMWARE_VER=VME_S1B1 KERNEL_DIR=/usr/src/linux KBUILD_OUTPUT=/lib/modules/2.6.27-gentoo-r5/build
 *
 * If you need support, post the topmost build error, and the call stack if relevant.
 * A complete build log is located at '/var/tmp/portage/app-emulation/vmware-modules-1.0.0.15-r1/temp/build.log'.
 * The ebuild environment file is located at '/var/tmp/portage/app-emulation/vmware-modules-1.0.0.15-r1/temp/environment'.


I have installed a x86_64 version and have the ~amd64 accept keywords.
Here is a emerge --info :

Code:
emerge --info
Portage 2.1.6.1 (default/linux/amd64/2008.0/desktop, gcc-4.1.2, glibc-2.9_p20081201-r0, 2.6.27-gentoo-r5 x86_64)
=================================================================
System uname: Linux-2.6.27-gentoo-r5-x86_64-Intel-R-_Core-TM-2_CPU_6300_@_1.86GHz-with-glibc2.2.5
Timestamp of tree: Thu, 18 Dec 2008 06:45:01 +0000
app-shells/bash:     3.2_p48
dev-java/java-config: 1.3.7-r1, 2.1.6-r1
dev-lang/python:     2.4.4-r13, 2.5.2-r8
dev-python/pycrypto: 2.0.1-r6
dev-util/cmake:      2.6.2
sys-apps/baselayout: 2.0.0
sys-apps/openrc:     0.3.0-r1
sys-apps/sandbox:    1.2.18.1-r3
sys-devel/autoconf:  2.13, 2.63
sys-devel/automake:  1.5, 1.7.9-r1, 1.8.5-r3, 1.9.6-r2, 1.10.2
sys-devel/binutils:  2.19
sys-devel/gcc-config: 1.4.0-r4
sys-devel/libtool:   2.2.6a
virtual/os-headers:  2.6.27-r2
ACCEPT_KEYWORDS="amd64 ~amd64"
CBUILD="x86_64-pc-linux-gnu"
CFLAGS="-march=nocona -O2 -pipe"
CHOST="x86_64-pc-linux-gnu"
CONFIG_PROTECT="/etc /usr/kde/3.5/env /usr/kde/3.5/share/config /usr/kde/3.5/shutdown /usr/kde/4.1/env /usr/kde/4.1/share/config /usr/kde/4.1/shutdown /usr/share/config"
CONFIG_PROTECT_MASK="/etc/ca-certificates.conf /etc/env.d /etc/env.d/java/ /etc/fonts/fonts.conf /etc/gconf /etc/gentoo-release /etc/revdep-rebuild /etc/terminfo /etc/udev/rules.d"
CXXFLAGS="-march=nocona -O2 -pipe"
DISTDIR="/usr/portage/distfiles"
FEATURES="distlocks fixpackages parallel-fetch protect-owned sandbox sfperms strict unmerge-orphans userfetch"
GENTOO_MIRRORS="ftp://ftp.free.fr/mirrors/ftp.gentoo.org/ "
LDFLAGS="-Wl,-O1"
MAKEOPTS="-j3"
PKGDIR="/usr/portage/packages"
PORTAGE_RSYNC_OPTS="--recursive --links --safe-links --perms --times --compress --force --whole-file --delete --stats --timeout=180 --exclude=/distfiles --exclude=/local --exclude=/packages"
PORTAGE_TMPDIR="/var/tmp"
PORTDIR="/usr/portage"
SYNC="rsync://rsync.europe.gentoo.org/gentoo-portage"
USE="X acl acpi alsa amd64 branding bzip2 cairo cdr cli cracklib crypt cups dbus dri dvd dvdr dvdread eds emboss encode esd evo fam firefox fortran gdbm gif gnome gpm gstreamer gtk hal iconv ipv6 isdnlog jpeg kde kdeprefix ldap libnotify mad midi mikmod mmx mp3 mpeg mudflap multilib ncurses nls nptl nptlonly nvidia ogg opengl openmp pam pcre pdf perl png ppds pppd python qt3 qt3support qt4 quicktime readline reflection sdl session spell spl sse sse2 ssl startup-notification svg sysfs tcpd tiff truetype unicode usb vorbis x264 xml xorg xv xvmc zlib" ALSA_CARDS="ali5451 als4000 atiixp atiixp-modem bt87x ca0106 cmipci emu10k1x ens1370 ens1371 es1938 es1968 fm801 hda-intel intel8x0 intel8x0m maestro3 trident usb-audio via82xx via82xx-modem ymfpci" ALSA_PCM_PLUGINS="adpcm alaw asym copy dmix dshare dsnoop empty extplug file hooks iec958 ioplug ladspa lfloat linear meter mmap_emul mulaw multinull plug rate route share shm softvol" APACHE2_MODULES="actions alias auth_basic authn_alias authn_anon authn_dbm authn_default authn_file authz_dbm authz_default authz_groupfileauthz_host authz_owner authz_user autoindex cache dav dav_fs dav_lock deflate dir disk_cache env expires ext_filter file_cache filter headers include info log_config logio mem_cache mime mime_magic negotiation rewrite setenvif speling status unique_id userdir usertrack vhost_alias" ELIBC="glibc" INPUT_DEVICES="keyboard mouse evdev" KERNEL="linux" LCD_DEVICES="bayrad cfontz cfontz633 glk hd44780 lb216 lcdm001 mtxorb ncurses text" USERLAND="GNU" VIDEO_CARDS="nvidia"
Unset:  CPPFLAGS, CTARGET, EMERGE_DEFAULT_OPTS, FFLAGS, INSTALL_MASK, LANG, LC_ALL, LINGUAS, PORTAGE_COMPRESS, PORTAGE_COMPRESS_FLAGS, PORTAGE_RSYNC_EXTRA_OPTS, PORTDIR_OVERLAY


Does someone else got this issue ?

Apparently, this could have something to deal with the kernel verion.
I am trying to install the version 2.
Back to top
View user's profile Send private message
NeddySeagoon
Administrator
Administrator


Joined: 05 Jul 2003
Posts: 43007
Location: 56N 3W

PostPosted: Thu Dec 18, 2008 7:23 pm    Post subject: Reply with quote

fabien29200,

You need a 2.6.25 for vmware-server-1.xxx and those modules.
vmware-server-2.xxxxx is in the vmware overlay and at least builds on a 2.6.27 kernel.
I haven't got it running yet but others have.

vmware-server is not slotted, so you must choose one or the other.
_________________
Regards,

NeddySeagoon

Computer users fall into two groups:-
those that do backups
those that have never had a hard drive fail.
Back to top
View user's profile Send private message
hoacker
Guru
Guru


Joined: 04 Aug 2007
Posts: 491
Location: Bürstadt, Germany

PostPosted: Sun Dec 21, 2008 2:32 pm    Post subject: Reply with quote

Have a look here: https://forums.gentoo.org/viewtopic-p-5300361.html#5300361

This helped me to successfully install vmware-server 1.0.8 a few minutes ago with kernel 2.6.27...

EDIT: Sorry, didn't read you want to install version 2...
Back to top
View user's profile Send private message
Display posts from previous:   
Reply to topic    Gentoo Forums Forum Index Unsupported Software All times are GMT
Page 1 of 1

 
Jump to:  
You cannot post new topics in this forum
You cannot reply to topics in this forum
You cannot edit your posts in this forum
You cannot delete your posts in this forum
You cannot vote in polls in this forum