Gentoo Forums
Gentoo Forums
Gentoo Forums
Quick Search: in
[kde-testing] and [kde-crazy] KDE4 overlays thread (part 3)
View unanswered posts
View posts from last 24 hours

Goto page Previous  1, 2, 3 ... 18, 19, 20 ... 38, 39, 40  Next  
This topic is locked: you cannot edit posts or make replies.    Gentoo Forums Forum Index Unsupported Software
View previous topic :: View next topic  
Author Message
mikedee
Apprentice
Apprentice


Joined: 05 Jul 2006
Posts: 158

PostPosted: Mon Feb 16, 2009 1:35 pm    Post subject: Reply with quote

wrc1944: I am not sure if this is your problem but today there was a post on the kde mailing list saying that libical 0.42 is now required for kdepimlibs. We only have 0.33 so we have to wait for the main tree to update or compile libical yourself.
Back to top
View user's profile Send private message
titoucha
Advocate
Advocate


Joined: 21 Jul 2005
Posts: 2374
Location: Genève

PostPosted: Mon Feb 16, 2009 3:25 pm    Post subject: Reply with quote

Kipi-plugins-0.2.0_rc2 does not compile with the error
Code:
[ 97%] Building CXX object dngconverter/plugin/CMakeFiles/kipiplugin_dngconverter.dir/__/dngwriter/extra/dng_sdk/dng_pthread.o                                                 
Linking CXX shared module ../../lib/kipiplugin_dngconverter.so                                                                                                                 
[ 97%] Built target kipiplugin_dngconverter                                                                                                                                     
make: *** [all] Erreur 2                                                                                                                                                       
 *                                                                                                                                                                             
 * ERROR: media-plugins/kipi-plugins-0.2.0_rc2 failed.                                                                                                                         
 * Call stack:                                                                                                                                                                 
 *               ebuild.sh, line   49:  Called src_compile                                                                                                                     
 *             environment, line 3123:  Called kde4-base_src_compile                                                                                                           
 *             environment, line 2322:  Called kde4-base_src_make                                                                                                               
 *             environment, line 2374:  Called cmake-utils_src_make                                                                                                             
 *             environment, line  825:  Called die                                                                                                                             
 * The specific snippet of code:                                                                                                                                               
 *           emake "$@" || die "Make failed!";                                                                                                                                 
 *  The die message:                                                                                                                                                           
 *   Make failed!                                                 

_________________
Assurez-vous que le titre de votre message soit conforme aux conventions de ce forum (paragraphe 3/3 : Comment poster sur le forum ??)
Back to top
View user's profile Send private message
Krog
Guru
Guru


Joined: 26 Jun 2007
Posts: 330
Location: Roma, Italy

PostPosted: Mon Feb 16, 2009 6:20 pm    Post subject: Reply with quote

Code:
[blocks B     ] <kde-base/kdelibs-3.5.10 ("<kde-base/kdelibs-3.5.10" is blocking kde-base/kdelibs-4.2.0-r2)                         


Code:
* Error: The above package list contains packages which cannot be
 * installed at the same time on the same system.

  ('ebuild', '/', 'kde-base/kdelibs-4.2.0-r2', 'merge') pulled in by
    >=kde-base/kdelibs-4.2.0[-kdeprefix] required by ('installed', '/', 'kde-base/krosspython-4.2.0', 'nomerge')
    >=kde-base/kdelibs-4.2.0[-kdeprefix] required by ('installed', '/', 'kde-base/kmix-4.2.0', 'nomerge')
    >=kde-base/kdelibs-4.2.0[-kdeprefix] required by ('installed', '/', 'kde-base/libkonq-4.2.0', 'nomerge')
    (and 119 more)

  ('installed', '/', 'kde-base/kdelibs-3.5.9-r4', 'nomerge') pulled in by
    =kde-base/kdelibs-3.5* required by ('installed', '/', 'app-cdr/k3b-1.0.5-r3', 'nomerge')



how to use the old k3b in kde4 now?
the new k3b (in qt4) is able now to burn cd?
thanks
Back to top
View user's profile Send private message
Boccaccio
Apprentice
Apprentice


Joined: 19 Jul 2005
Posts: 282

PostPosted: Mon Feb 16, 2009 6:22 pm    Post subject: Reply with quote

You have to install kdelibs-3.5.10 not kdelibs-3.5.9
Back to top
View user's profile Send private message
drescherjm
Advocate
Advocate


Joined: 05 Jun 2004
Posts: 2779
Location: Pittsburgh, PA, USA

PostPosted: Mon Feb 16, 2009 7:14 pm    Post subject: Reply with quote

Quote:
You have to install kdelibs-3.5.10 not kdelibs-3.5.9


Mask all versions less than 3.5.10 and unmask 3.5.10*
_________________
John

My gentoo overlay
Instructons for overlay
Back to top
View user's profile Send private message
hunky
l33t
l33t


Joined: 19 Nov 2003
Posts: 826
Location: Alaska

PostPosted: Mon Feb 16, 2009 11:28 pm    Post subject: Reply with quote

kipi-plugins-0.2.0_rc2 fails with this for me:
Code:
/wizard.cpp:1333: warning: comparison between signed and unsigned integer expressions
/var/tmp/portage/media-plugins/kipi-plugins-0.2.0_rc2/work/kipi-plugins-0.2.0-rc2/printwizard                                                                                                                     /wizard.cpp: In member function 'void KIPIPrintWizardPlugin::Wizard::manageBtnPrintOrder()':
/var/tmp/portage/media-plugins/kipi-plugins-0.2.0_rc2/work/kipi-plugins-0.2.0-rc2/printwizard                                                                                                                     /wizard.cpp:1438: warning: comparison between signed and unsigned integer expressions
[ 61%] Building CXX object printwizard/CMakeFiles/kipiplugin_printwizard.dir/tphoto.o
make[2]: *** [advancedslideshow/CMakeFiles/kipiplugin_advancedslideshow.dir/common.o] Error 1
make[1]: *** [advancedslideshow/CMakeFiles/kipiplugin_advancedslideshow.dir/all] Error 2
make[1]: *** Waiting for unfinished jobs....
[ 61%] Building CXX object htmlexport/CMakeFiles/kipiplugin_htmlexport.dir/imagegenerationfun                                                                                                                     ctor.o
[ 61%] Building CXX object printwizard/CMakeFiles/kipiplugin_printwizard.dir/utils.o
[ 61%] Building CXX object htmlexport/CMakeFiles/kipiplugin_htmlexport.dir/intthemeparameter.                                                                                                                     o
Linking CXX shared module ../lib/kipiplugin_printwizard.so
[ 61%] Built target kipiplugin_printwizard
[ 61%] Building CXX object htmlexport/CMakeFiles/kipiplugin_htmlexport.dir/invisiblebuttongro                                                                                                                     up.o
[ 62%] Building CXX object htmlexport/CMakeFiles/kipiplugin_htmlexport.dir/listthemeparameter                                                                                                                     .o
[ 62%] Building CXX object htmlexport/CMakeFiles/kipiplugin_htmlexport.dir/plugin.o
[ 62%] Building CXX object htmlexport/CMakeFiles/kipiplugin_htmlexport.dir/stringthemeparamet                                                                                                                     er.o
[ 62%] Building CXX object htmlexport/CMakeFiles/kipiplugin_htmlexport.dir/theme.o
[ 62%] Building CXX object htmlexport/CMakeFiles/kipiplugin_htmlexport.dir/wizard.o
[ 63%] Building CXX object htmlexport/CMakeFiles/kipiplugin_htmlexport.dir/htmlexportconfig.o
Linking CXX shared module ../lib/kipiplugin_htmlexport.so
[ 63%] Built target kipiplugin_htmlexport
make: *** [all] Error 2
Back to top
View user's profile Send private message
titoucha
Advocate
Advocate


Joined: 21 Jul 2005
Posts: 2374
Location: Genève

PostPosted: Tue Feb 17, 2009 8:19 am    Post subject: Reply with quote

For kipi-plugins if you remove the USE ="calandar", you don't have this error.
_________________
Assurez-vous que le titre de votre message soit conforme aux conventions de ce forum (paragraphe 3/3 : Comment poster sur le forum ??)
Back to top
View user's profile Send private message
Krog
Guru
Guru


Joined: 26 Jun 2007
Posts: 330
Location: Roma, Italy

PostPosted: Tue Feb 17, 2009 2:08 pm    Post subject: Reply with quote

xorg 1.5.X crashes after some minute of use...
it's really needed to use it?
Back to top
View user's profile Send private message
neuron
Advocate
Advocate


Joined: 28 May 2002
Posts: 2371

PostPosted: Tue Feb 17, 2009 4:03 pm    Post subject: Reply with quote

Krog wrote:
xorg 1.5.X crashes after some minute of use...
it's really needed to use it?


.. fix xorg rather than to revert? It's not intended to crash after minutes of use.
Back to top
View user's profile Send private message
asturm
Developer
Developer


Joined: 05 Apr 2007
Posts: 7113
Location: Austria

PostPosted: Tue Feb 17, 2009 4:41 pm    Post subject: Reply with quote

Krog wrote:
xorg 1.5.X crashes after some minute of use...
it's really needed to use it?

Try to fix it, if you need help capture a persisting X thread or start a new one. xorg-x11-7.4 crashing is not normal behaviour.
_________________
backend.cpp:92:2: warning: #warning TODO - this error message is about as useful as a cooling unit in the arctic
Back to top
View user's profile Send private message
hunky
l33t
l33t


Joined: 19 Nov 2003
Posts: 826
Location: Alaska

PostPosted: Tue Feb 17, 2009 5:18 pm    Post subject: Reply with quote

titoucha wrote:
For kipi-plugins if you remove the USE ="calandar", you don't have this error.


Not true in my case, but thanks for the reply. I have this:
Code:
Calculating dependencies... done!
[ebuild     U ] media-plugins/kipi-plugins-0.2.0_rc2 [0.2.0_rc1] USE="cdr imgemagick kdeprefix opengl scanner -calendar% -debug% -ipod -mjpeg -redeyes" LINGUAS="-ar -be -ca -cs -da -de -el -es -et -fr -ga -gl -hi -is -it -ja -km -lv -ms -nb -nds -nl -nn -oc -pa -pl -pt -pt_BR -ro -ru -se -sk -sv -th -tr -uk -zn_CN" 0 kB [1]
Back to top
View user's profile Send private message
Krog
Guru
Guru


Joined: 26 Jun 2007
Posts: 330
Location: Roma, Italy

PostPosted: Tue Feb 17, 2009 5:45 pm    Post subject: Reply with quote

sorry but for day to day use of my pc i had to revert to x11-base/xorg-server-1.3.0.0-r6

i only have this error in my browser cache (i've done some search about it):

Code:
(EE) config/hal: Adding input device AT Translated Set 2 keyboard
(EE) config/hal: NewInputDeviceRequest failed


there were a couple of this errors in xorg output after crashes...

now i have:

Code:
*  x11-base/xorg-server                 
      Latest version available: 1.3.0.0-r6
      Latest version installed: 1.3.0.0-r6
      Size of files: 9,046 kB             
      Homepage:      http://xorg.freedesktop.org/
      Description:   X.Org X servers             
      License:       xorg-server MIT     



everything works just fine...
the problem is upgrading xorg-server to 1.5.x
Back to top
View user's profile Send private message
mikedee
Apprentice
Apprentice


Joined: 05 Jul 2006
Posts: 158

PostPosted: Tue Feb 17, 2009 6:02 pm    Post subject: Reply with quote

Krog: I had the same problem, I tracked it down to one of my xorg.conf entries.

I removed everything in the Device section and I don't get any more crashes. The entries had accumulated over a few years so I am not sure which ones help.

Here is my new device section, as you can see virtually everything is commented now.

Code:
    Identifier     "Videocard0"
    Driver         "nvidia"   
    VendorName     "NVIDIA Corporation"
    BoardName      "GeForce 7900 GS"   
#    Option         "RenderAccel" "true"
#    Option         "DisableGLXRootClipping" "true"
#    Option         "AddARGBGLXVisuals" "true"     
#    Option         "AllowGLXWithComposite" "true"
#    Option         "UseCompositeWrapper" "true"
#    Option         "IncludeImplicitMetaModes" "false"
    Option         "NvAGP" "0"
#    Option         "RandRRotation" "true"
#    Option         "UseEdidFreqs" "true"
#    Option "BackingStore" "true"
#    Option "InitialPixmapPlacement" "2"
#    Option "PixmapCacheSize" "2000000"
#    Option "GlyphCache" "0"
#    Option        "NoLogo"       "True"
#    Option "DynamicTwinView" "false"
Back to top
View user's profile Send private message
Krog
Guru
Guru


Joined: 26 Jun 2007
Posts: 330
Location: Roma, Italy

PostPosted: Tue Feb 17, 2009 7:04 pm    Post subject: Reply with quote

i think is better to wait for this xorg upgrade...
Back to top
View user's profile Send private message
asturm
Developer
Developer


Joined: 05 Apr 2007
Posts: 7113
Location: Austria

PostPosted: Tue Feb 17, 2009 7:20 pm    Post subject: Reply with quote

As I told often enough now, you can almost entirely scrap your xorg.conf with xorg-x11-7.4, mine contains a humble 4-liner, others don't need even that anymore.
Code:
Section "Device"
        Identifier  "7900gto"
        Driver      "nvidia"
EndSection


Would have probably been enough to get your X running and faster than reverting back to antiquity.
_________________
backend.cpp:92:2: warning: #warning TODO - this error message is about as useful as a cooling unit in the arctic
Back to top
View user's profile Send private message
szachy
n00b
n00b


Joined: 14 Feb 2005
Posts: 31
Location: Tarnów, Poland

PostPosted: Tue Feb 17, 2009 10:48 pm    Post subject: Reply with quote

Quote:
Krog: I had the same problem, I tracked it down to one of my xorg.conf entries.

I removed everything in the Device section and I don't get any more crashes. The entries had accumulated over a few years so I am not sure which ones help.

Here is my new device section, as you can see virtually everything is commented now.
Kod:
Identifier "Videocard0"
Driver "nvidia"
VendorName "NVIDIA Corporation"
BoardName "GeForce 7900 GS"
# Option "RenderAccel" "true"
# Option "DisableGLXRootClipping" "true"
# Option "AddARGBGLXVisuals" "true"
# Option "AllowGLXWithComposite" "true"
# Option "UseCompositeWrapper" "true"
# Option "IncludeImplicitMetaModes" "false"
Option "NvAGP" "0"
# Option "RandRRotation" "true"
# Option "UseEdidFreqs" "true"
# Option "BackingStore" "true"
# Option "InitialPixmapPlacement" "2"
# Option "PixmapCacheSize" "2000000"
# Option "GlyphCache" "0"
# Option "NoLogo" "True"
# Option "DynamicTwinView" "false"

try without
Code:
Option "BackingStore" "true"
only, with this option my xorg with kde crash very quickly
Back to top
View user's profile Send private message
titoucha
Advocate
Advocate


Joined: 21 Jul 2005
Posts: 2374
Location: Genève

PostPosted: Wed Feb 18, 2009 7:33 am    Post subject: Reply with quote

hunky wrote:
titoucha wrote:
For kipi-plugins if you remove the USE ="calandar", you don't have this error.


Not true in my case, but thanks for the reply. I have this:
Code:
Calculating dependencies... done!
[ebuild     U ] media-plugins/kipi-plugins-0.2.0_rc2 [0.2.0_rc1] USE="cdr imgemagick kdeprefix opengl scanner -calendar% -debug% -ipod -mjpeg -redeyes" LINGUAS="-ar -be -ca -cs -da -de -el -es -et -fr -ga -gl -hi -is -it -ja -km -lv -ms -nb -nds -nl -nn -oc -pa -pl -pt -pt_BR -ro -ru -se -sk -sv -th -tr -uk -zn_CN" 0 kB [1]


For me i have this:
Code:
Calculating dependencies... done!
[ebuild  NS   ] media-plugins/kipi-plugins-0.2.0_rc2 [0.2.0_rc1] USE="cdr imgemagick kdeprefix mjpeg opengl redeyes -calendar -debug -ipod -scanner" LINGUAS="fr -ar -be -ca -cs -da -de -el -es -et -ga -gl -hi -is -it -ja -km -lv -ms -nb -nds -nl -nn -oc -pa -pl -pt -pt_BR -ro -ru -se -sk -sv -th -tr -uk -zn_CN" 2,983 kB [1]

_________________
Assurez-vous que le titre de votre message soit conforme aux conventions de ce forum (paragraphe 3/3 : Comment poster sur le forum ??)
Back to top
View user's profile Send private message
hunky
l33t
l33t


Joined: 19 Nov 2003
Posts: 826
Location: Alaska

PostPosted: Wed Feb 18, 2009 6:08 pm    Post subject: Reply with quote

Thanks Titoucha,

I just gave it a try by adding mjpeg and redeyes as well as -scanner and something wanted to pull in opencv. But that failed with:

Code:
pyhelpers.cpp' || echo './'`pyhelpers.cpp
libtool: compile:  i686-pc-linux-gnu-g++ -DHAVE_CONFIG_H -I. -I../../.. -I../../../cv/include -I../../../cxcore/include -I../../../otherlibs/highgui -DCV_NO_BACKWARD_COMPATIBILITY -DNDEBUG -fPIC -I/usr/include/python2.5 -Wall -fno-rtti -pipe -O3 -g -march=i686 -ffast-math -fomit-frame-pointer -march=prescott -O2 -pipe -fomit-frame-pointer -MT _highgui_la-pyhelpers.lo -MD -MP -MF .deps/_highgui_la-pyhelpers.Tpo -c pyhelpers.cpp  -fPIC -DPIC -o .libs/_highgui_la-pyhelpers.o
./pyhelpers.i:2: Error: Unable to find 'pyname_compat.i'
make[4]: *** [_highgui.cpp] Error 1
make[4]: *** Waiting for unfinished jobs....
mv -f .deps/_cv_la-pyhelpers.Tpo .deps/_cv_la-pyhelpers.Plo
mv -f .deps/_highgui_la-pyhelpers.Tpo .deps/_highgui_la-pyhelpers.Plo
make[4]: Leaving directory `/var/tmp/portage/media-libs/opencv-1.0.0-r1/work/opencv-1.0.0/interfaces/swig/python'
make[3]: *** [all-recursive] Error 1
make[3]: Leaving directory `/var/tmp/portage/media-libs/opencv-1.0.0-r1/work/opencv-1.0.0/interfaces/swig'
make[2]: *** [all-recursive] Error 1
make[2]: Leaving directory `/var/tmp/portage/media-libs/opencv-1.0.0-r1/work/opencv-1.0.0/interfaces'
make[1]: *** [all-recursive] Error 1
make[1]: Leaving directory `/var/tmp/portage/media-libs/opencv-1.0.0-r1/work/opencv-1.0.0'
make: *** [all] Error 2
 *
 * ERROR: media-libs/opencv-1.0.0-r1 failed.


So I don't know - maybe the python? (pyname) path is not clear to the ebuild. No biggey - I think digikam is still working - maybe using the older kipi-plugins. /jd

[edit] I guess Digikam is crashing a lot on me to the point of not being usable, so perhaps it is the kipi-plugins issue or something. Dang.


Last edited by hunky on Thu Feb 19, 2009 3:55 am; edited 1 time in total
Back to top
View user's profile Send private message
tranquilcool
Veteran
Veteran


Joined: 25 Mar 2005
Posts: 1160

PostPosted: Wed Feb 18, 2009 6:53 pm    Post subject: Reply with quote

iwant to get paludis to instal kde-live sets from the kde-testing overlay.
i just don't want to create the sets myself as i think kde-testing has sets for kde-live ebuilds already.
(Documentation folder)

can anyboby help with the paludis command line syntax?
thanks!
_________________
this is a strange strange world.
Back to top
View user's profile Send private message
titoucha
Advocate
Advocate


Joined: 21 Jul 2005
Posts: 2374
Location: Genève

PostPosted: Thu Feb 19, 2009 5:17 am    Post subject: Reply with quote

Hi hunky.

I compiled opencv with these options and its functions.
Code:
Calculating dependencies... done!
[ebuild   R   ] media-libs/opencv-1.0.0-r1  USE="gtk jpeg png tiff zlib -debug -demos -examples -ffmpeg -ieee1394 -jpeg2k -openexr -python -v4l -xine" 0 kB

_________________
Assurez-vous que le titre de votre message soit conforme aux conventions de ce forum (paragraphe 3/3 : Comment poster sur le forum ??)
Back to top
View user's profile Send private message
hunky
l33t
l33t


Joined: 19 Nov 2003
Posts: 826
Location: Alaska

PostPosted: Thu Feb 19, 2009 7:29 am    Post subject: Reply with quote

yes, thankyou. I was able to compile that opencv without the python dependency, but doesn't appear I can yet compile kipi-plugins. I tried it with your flags and it failed with a slightly different error with the +redeyes, but same otherwise. /jd
Back to top
View user's profile Send private message
Krog
Guru
Guru


Joined: 26 Jun 2007
Posts: 330
Location: Roma, Italy

PostPosted: Thu Feb 19, 2009 2:50 pm    Post subject: Reply with quote

for my past xorg problems, seems to be ok to compile
Code:
xorg-server
and
Code:
xf86-input-evdev
WITHOUT hal use flag and keep the old xorg.config untouched
Back to top
View user's profile Send private message
titoucha
Advocate
Advocate


Joined: 21 Jul 2005
Posts: 2374
Location: Genève

PostPosted: Thu Feb 19, 2009 2:57 pm    Post subject: Reply with quote

hunky wrote:
yes, thankyou. I was able to compile that opencv without the python dependency, but doesn't appear I can yet compile kipi-plugins. I tried it with your flags and it failed with a slightly different error with the +redeyes, but same otherwise. /jd



For me it's the same thing :cry:
_________________
Assurez-vous que le titre de votre message soit conforme aux conventions de ce forum (paragraphe 3/3 : Comment poster sur le forum ??)
Back to top
View user's profile Send private message
mikedee
Apprentice
Apprentice


Joined: 05 Jul 2006
Posts: 158

PostPosted: Thu Feb 19, 2009 3:34 pm    Post subject: Reply with quote

I get this error when compiling kipi-plugins

Code:
[ 63%] Building CXX object htmlexport/CMakeFiles/kipiplugin_htmlexport.dir/intthemeparameter.o                                                             
In file included from /var/tmp/portage/media-plugins/kipi-plugins-0.2.0_rc2/work/kipi-plugins-0.2.0-rc2/advancedslideshow/playbackwidget.h:39,             
                 from /var/tmp/portage/media-plugins/kipi-plugins-0.2.0_rc2/work/kipi-plugins-0.2.0-rc2/advancedslideshow/soundtrackdialog.h:37,           
                 from /var/tmp/portage/media-plugins/kipi-plugins-0.2.0_rc2/work/kipi-plugins-0.2.0-rc2/advancedslideshow/common.h:49,                     
                 from /var/tmp/portage/media-plugins/kipi-plugins-0.2.0_rc2/work/kipi-plugins-0.2.0-rc2/advancedslideshow/common.cpp:23:                   
/var/tmp/portage/media-plugins/kipi-plugins-0.2.0_rc2/work/kipi-plugins_build/advancedslideshow/ui_playbackwidget.h:27:39: error: phonon/Phonon::VolumeSlider: No such file or directory
Back to top
View user's profile Send private message
ssmaxss
Apprentice
Apprentice


Joined: 28 Jun 2005
Posts: 160
Location: Moscow, Russia.

PostPosted: Thu Feb 19, 2009 3:54 pm    Post subject: Reply with quote

I updated to qt 4.5_rc and updated kdelibs from portage and now I have no notifications from kopete.
Back to top
View user's profile Send private message
Display posts from previous:   
This topic is locked: you cannot edit posts or make replies.    Gentoo Forums Forum Index Unsupported Software All times are GMT
Goto page Previous  1, 2, 3 ... 18, 19, 20 ... 38, 39, 40  Next
Page 19 of 40

 
Jump to:  
You cannot post new topics in this forum
You cannot reply to topics in this forum
You cannot edit your posts in this forum
You cannot delete your posts in this forum
You cannot vote in polls in this forum