Gentoo Forums
Gentoo Forums
Gentoo Forums
Quick Search: in
[kde-testing] and [kde-crazy] KDE4 overlays thread (part 3)
View unanswered posts
View posts from last 24 hours

Goto page Previous  1, 2, 3 ... 28, 29, 30 ... 38, 39, 40  Next  
This topic is locked: you cannot edit posts or make replies.    Gentoo Forums Forum Index Unsupported Software
View previous topic :: View next topic  
Author Message
kernelOfTruth
Watchman
Watchman


Joined: 20 Dec 2005
Posts: 6108
Location: Vienna, Austria; Germany; hello world :)

PostPosted: Tue Apr 14, 2009 1:19 pm    Post subject: Reply with quote

neuron wrote:
kernelOfTruth wrote:
neuron wrote:
you dont need kdeprefix to mix 3.5 and 4.x, it's only for 4.x minor revisions.


well that's nice - thanks,

BUT pykde4 doesn't seem to compile without kdeprefix right now and thus preventing me to compile and work with kde4 (or there's again some minor problem upstream which will be fixed later allowing to compile it again)


I've run both 4.6.29 and 4.2.2 (both with -kdeprefix, at seperate times) and had no problems with pykde. Try to build packages without support for pykde first and then rebuild pykde after, I seem to remember that working.


roger that

now if they just would let me do it:

Quote:
* repository: svn://anonsvn.kde.org/home/kde/trunk/KDE/kdemultimedia
svn: Network connection closed unexpectedly
:?

update:

there seems to be much traffic / development going on today - interesting :)
_________________
https://github.com/kernelOfTruth/ZFS-for-SystemRescueCD/tree/ZFS-for-SysRescCD-4.9.0
https://github.com/kernelOfTruth/pulseaudio-equalizer-ladspa

Hardcore Gentoo Linux user since 2004 :D
Back to top
View user's profile Send private message
kernelOfTruth
Watchman
Watchman


Joined: 20 Dec 2005
Posts: 6108
Location: Vienna, Austria; Germany; hello world :)

PostPosted: Tue Apr 14, 2009 3:21 pm    Post subject: Reply with quote

pykde4:

Quote:
sipkdeuipart2.cpp: In member function ‘void sipKDatePicker::sipProtect_uncheckYearSelector()’:
sipkdeuipart2.cpp:30064: error: ‘uncheckYearSelector’ is not a member of ‘KDatePicker’
sipkdeuipart2.cpp: In constructor ‘sipKCharSelect::sipKCharSelect(QWidget*, QFlags<KCharSelect::Control>)’:
sipkdeuipart2.cpp:44255: warning: ‘KCharSelect::KCharSelect(QWidget*, QFlags<KCharSelect::Control>)’ is deprecated (declared at /usr/include/kcharselect.h:110)
In file included from /var/tmp/portage/kde-base/pykde4-9999/work/pykde4-9999/python/pykde4/sip/kio/kabstractfilemodule.sip:28,
from /var/tmp/portage/kde-base/pykde4-9999/work/pykde4_build/python/pykde4/sip/kio/sipkiopart1.cpp:7:
/usr/include/kio/connection.h:176: warning: ‘Connection’ is deprecated (declared at /usr/include/kio/connection.h:49)
/usr/include/kio/connection.h:177: warning: ‘Connection’ is deprecated (declared at /usr/include/kio/connection.h:49)
Linking CXX shared library ../../lib/pykde/akonadi.so
make[2]: *** [python/pykde4/CMakeFiles/python_module_PyKDE4_kdeui.dir/sip/kdeui/sipkdeuipart2.o] Error 1
make[2]: *** Waiting for unfinished jobs....
[ 36%] Generating sip/knewstuff/sipknewstuffpart0.cpp, sip/knewstuff/sipknewstuffpart1.cpp, sip/knewstuff/sipknewstuffpart2.cpp, sip/knewstuff/sipknewstuffpart3.cpp, sip/knewstuff/sipknewstuffpart4.cpp, sip/knewstuff/sipknewstuffpart5.cpp, sip/knewstuff/sipknewstuffpart6.cpp, sip/knewstuff/sipknewstuffpart7.cpp

[ 37%] Building CXX object python/pykde4/CMakeFiles/python_module_PyKDE4_kio.dir/sip/kio/sipkiopart2.o
In file included from /usr/include/python2.6/Python.h:8,
from /usr/include/python2.6/sip.h:28,
from /var/tmp/portage/kde-base/pykde4-9999/work/pykde4_build/python/pykde4/sip/kio/sipAPIkio.h:11,
from /var/tmp/portage/kde-base/pykde4-9999/work/pykde4_build/python/pykde4/sip/kio/sipkiopart2.cpp:7:
/usr/include/python2.6/pyconfig.h:1064:1: warning: "_XOPEN_SOURCE" redefined
<command-line>: warning: this is the location of the previous definition
In file included from /var/tmp/portage/kde-base/pykde4-9999/work/pykde4-9999/python/pykde4/sip/kio/kabstractfilemodule.sip:28,
from /var/tmp/portage/kde-base/pykde4-9999/work/pykde4_build/python/pykde4/sip/kio/sipkiopart2.cpp:7:
/usr/include/kio/connection.h:176: warning: ‘Connection’ is deprecated (declared at /usr/include/kio/connection.h:49)
/usr/include/kio/connection.h:177: warning: ‘Connection’ is deprecated (declared at /usr/include/kio/connection.h:49)



Quote:
[ 50%] Generating sip/ktexteditor/sipktexteditorpart0.cpp, sip/ktexteditor/sipktexteditorpart1.cpp, sip/ktexteditor/sipktexteditorpart2.cpp, sip/ktexteditor/sipktexteditorpart3.cpp, sip/ktexteditor/sipktexteditorpart4.cpp, sip/ktexteditor/sipktexteditorpart5.cpp, sip/ktexteditor/sipktexteditorpart6.cpp, sip/ktexteditor/sipktexteditorpart7.cpp

make[1]: *** [python/pykde4/CMakeFiles/python_module_PyKDE4_kdeui.dir/all] Error 2
make[1]: *** Waiting for unfinished jobs....
Scanning dependencies of target python_module_PyKDE4_ktexteditor
Scanning dependencies of target python_module_PyKDE4_kparts
[ 51%] Building CXX object python/pykde4/CMakeFiles/python_module_PyKDE4_kparts.dir/sip/kparts/sipkpartspart0.o
[ 52%] In file included from /usr/include/python2.6/Python.h:8,
from /usr/include/python2.6/sip.h:28,
from /var/tmp/portage/kde-base/pykde4-9999/work/pykde4_build/python/pykde4/sip/kparts/sipAPIkparts.h:11,
from /var/tmp/portage/kde-base/pykde4-9999/work/pykde4_build/python/pykde4/sip/kparts/sipkpartspart0.cpp:7:
/usr/include/python2.6/pyconfig.h:1064:1: warning: "_XOPEN_SOURCE" redefined


Quote:
from /usr/include/python2.6/sip.h:28,
from /var/tmp/portage/kde-base/pykde4-9999/work/pykde4_build/python/pykde4/sip/ktexteditor/sipAPIktexteditor.h:28,
from /var/tmp/portage/kde-base/pykde4-9999/work/pykde4_build/python/pykde4/sip/ktexteditor/sipktexteditorpart7.cpp:24:
/usr/include/python2.6/pyconfig.h:1064:1: warning: "_XOPEN_SOURCE" redefined
<command-line>: warning: this is the location of the previous definition
[ 64%] Built target python_module_PyKDE4_kio
Linking CXX shared library ../../lib/pykde/ktexteditor.so
[ 64%] Built target python_module_PyKDE4_ktexteditor
make: *** [all] Error 2
*
* ERROR: kde-base/pykde4-9999 failed.


also see:

http://developer.kde.org/~dirk/dashboard/ (kdebindings)
_________________
https://github.com/kernelOfTruth/ZFS-for-SystemRescueCD/tree/ZFS-for-SysRescCD-4.9.0
https://github.com/kernelOfTruth/pulseaudio-equalizer-ladspa

Hardcore Gentoo Linux user since 2004 :D
Back to top
View user's profile Send private message
kernelOfTruth
Watchman
Watchman


Joined: 20 Dec 2005
Posts: 6108
Location: Vienna, Austria; Germany; hello world :)

PostPosted: Tue Apr 14, 2009 4:32 pm    Post subject: Reply with quote

ok - how did you guys get amarok to work (the live-build / 9999 one) ?

(note: I'm running latest gcc-4.4 from upstream -> ~ RC1)

some voodoo ?

I've built mysql once with fPIC and lrt in ldflags, amarok with the same but it still just crashs

help please ! :P

thanks
_________________
https://github.com/kernelOfTruth/ZFS-for-SystemRescueCD/tree/ZFS-for-SysRescCD-4.9.0
https://github.com/kernelOfTruth/pulseaudio-equalizer-ladspa

Hardcore Gentoo Linux user since 2004 :D
Back to top
View user's profile Send private message
Krog
Guru
Guru


Joined: 26 Jun 2007
Posts: 330
Location: Roma, Italy

PostPosted: Tue Apr 14, 2009 6:37 pm    Post subject: Reply with quote

problems with k3b-9999
i'm using 4.2.69 with kdeprefix


Code:
Generating moc_k3bmixedprojectmodel.cpp                                                                               
[  0%] Built target k3b_bin_automoc                                                                                   
[  0%] Building CXX object libk3bdevice/CMakeFiles/k3bdevice.dir/k3bdevice_mmc.o                                     
[  1%] Building CXX object libk3bdevice/CMakeFiles/k3bdevice.dir/k3bscsicommand.o                                     
[  1%] Building CXX object libk3bdevice/CMakeFiles/k3bdevice.dir/k3btrack.o                                           
[  1%] Building CXX object libk3bdevice/CMakeFiles/k3bdevice.dir/k3btoc.o                                             
[  2%] Building CXX object libk3bdevice/CMakeFiles/k3bdevice.dir/k3bdevicemanager.o                                   
[  2%] Building CXX object libk3bdevice/CMakeFiles/k3bdevice.dir/k3bmsf.o                                             
[  2%] Building CXX object libk3bdevice/CMakeFiles/k3bdevice.dir/k3bdiskinfo.o                                       
[  2%] Building CXX object libk3bdevice/CMakeFiles/k3bdevice.dir/k3bdeviceglobals.o                                   
[  3%] Building CXX object libk3bdevice/CMakeFiles/k3bdevice.dir/k3bcrc.o                                             
[  3%] Building CXX object libk3bdevice/CMakeFiles/k3bdevice.dir/k3bcdtext.o                                         
[  3%] Building CXX object libk3bdevice/CMakeFiles/k3bdevice.dir/k3bhalconnection.o                                   
Linking CXX shared library ../lib/libk3bdevice.so                                                                     
[  3%] Built target k3bdevice                                                                                         
Scanning dependencies of target k3b                                                                                   
[  4%] Building CXX object libk3b/CMakeFiles/k3b.dir/k3b_automoc.o                                                   
[  4%] Building CXX object libk3b/CMakeFiles/k3b.dir/core/k3bcore.o                                                   
In file included from /usr/include/k3bdiskinfo.h:22,                                                                 
                 from /var/tmp/portage/app-cdr/k3b-9999/work/k3b-9999/libk3b/core/k3bjobhandler.h:19,                 
                 from /var/tmp/portage/app-cdr/k3b-9999/work/k3b-9999/libk3b/core/k3bjob.h:20,                       
                 from /var/tmp/portage/app-cdr/k3b-9999/work/k3b-9999/libk3b/core/k3bthreadjob.h:19,                 
                 from /var/tmp/portage/app-cdr/k3b-9999/work/k3b_build/libk3b/../../k3b-9999/libk3b/jobs/k3bdatatrackreader.h:19,                                                                                                           
                 from /var/tmp/portage/app-cdr/k3b-9999/work/k3b_build/libk3b/moc_k3bdatatrackreader.cpp:10,         
                 from /var/tmp/portage/app-cdr/k3b-9999/work/k3b_build/libk3b/k3b_automoc.cpp:4:                     
/usr/include/k3btoc.h:20:24: error: qvaluelist.h: No such file or directory                                           
/usr/include/k3btoc.h:21:22: error: qcstring.h: No such file or directory                                             
In file included from /usr/include/k3bdiskinfo.h:22,                                                                 
                 from /var/tmp/portage/app-cdr/k3b-9999/work/k3b-9999/libk3b/core/k3bjobhandler.h:19,                 
                 from /var/tmp/portage/app-cdr/k3b-9999/work/k3b-9999/libk3b/core/k3bjob.h:20,                       
                 from /var/tmp/portage/app-cdr/k3b-9999/work/k3b-9999/libk3b/core/k3bcore.cpp:18:                     
/usr/include/k3btoc.h:20:24: error: qvaluelist.h: No such file or directory                                           
/usr/include/k3btoc.h:21:22: error: qcstring.h: No such file or directory                                             
In file included from /usr/include/k3btoc.h:25,                                                                       
                 from /usr/include/k3bdiskinfo.h:22,                                                                 
                 from /var/tmp/portage/app-cdr/k3b-9999/work/k3b-9999/libk3b/core/k3bjobhandler.h:19,                 
                 from /var/tmp/portage/app-cdr/k3b-9999/work/k3b-9999/libk3b/core/k3bjob.h:20,                       
                 from /var/tmp/portage/app-cdr/k3b-9999/work/k3b-9999/libk3b/core/k3bthreadjob.h:19,                 
                 from /var/tmp/portage/app-cdr/k3b-9999/work/k3b_build/libk3b/../../k3b-9999/libk3b/jobs/k3bdatatrackreader.h:19,                                                                                                           
                 from /var/tmp/portage/app-cdr/k3b-9999/work/k3b_build/libk3b/moc_k3bdatatrackreader.cpp:10,         
                 from /var/tmp/portage/app-cdr/k3b-9999/work/k3b_build/libk3b/k3b_automoc.cpp:4:                     
/usr/include/k3btrack.h:22:26: error: qvaluevector.h: No such file or directory                                       
In file included from /usr/include/k3btoc.h:25,                                                                       
                 from /usr/include/k3bdiskinfo.h:22,                                                                 
                 from /var/tmp/portage/app-cdr/k3b-9999/work/k3b-9999/libk3b/core/k3bjobhandler.h:19,                 
                 from /var/tmp/portage/app-cdr/k3b-9999/work/k3b-9999/libk3b/core/k3bjob.h:20,                       
                 from /var/tmp/portage/app-cdr/k3b-9999/work/k3b-9999/libk3b/core/k3bcore.cpp:18:                     
/usr/include/k3btrack.h:22:26: error: qvaluevector.h: No such file or directory                                       
In file included from /var/tmp/portage/app-cdr/k3b-9999/work/k3b-9999/libk3b/core/k3bcore.cpp:21:                     
/usr/include/k3bdevicemanager.h:23:23: error: qmemarray.h: No such file or directory                                 
/usr/include/k3bdevicemanager.h:24:22: error: qptrlist.h: No such file or directory                                   
In file included from /usr/include/k3btoc.h:25,                                                                       
                 from /usr/include/k3bdiskinfo.h:22,                                                                 
                 from /var/tmp/portage/app-cdr/k3b-9999/work/k3b-9999/libk3b/core/k3bjobhandler.h:19,                 
                 from /var/tmp/portage/app-cdr/k3b-9999/work/k3b-9999/libk3b/core/k3bjob.h:20,                       
                 from /var/tmp/portage/app-cdr/k3b-9999/work/k3b-9999/libk3b/core/k3bthreadjob.h:19,                 
                 from /var/tmp/portage/app-cdr/k3b-9999/work/k3b_build/libk3b/../../k3b-9999/libk3b/jobs/k3bdatatrackreader.h:19,                                                                                                           
                 from /var/tmp/portage/app-cdr/k3b-9999/work/k3b_build/libk3b/moc_k3bdatatrackreader.cpp:10,         
                 from /var/tmp/portage/app-cdr/k3b-9999/work/k3b_build/libk3b/k3b_automoc.cpp:4:                     
/usr/include/k3btrack.h:78: error: expected ‘;’ before ‘&’ token                                                     
/usr/include/k3btrack.h:79: error: expected `;' before ‘void’                                                         
/usr/include/k3btrack.h:79: error: expected ‘,’ or ‘...’ before ‘&’ token                                             
/usr/include/k3btrack.h:123: error: expected ‘;’ before ‘<’ token                                                     
/usr/include/k3btrack.h:125: error: expected `;' before ‘bool’                                                       
/usr/include/k3btrack.h:143: error: expected ‘;’ before ‘<’ token                                                     
/usr/include/k3btrack.h:145: error: ‘QCString’ does not name a type                                                   
/usr/include/k3btrack.h: In member function ‘void K3bDevice::Track::setIsrc(int)’:                                   
/usr/include/k3btrack.h:79: error: ‘m_isrc’ was not declared in this scope                                           
/usr/include/k3btrack.h:79: error: ‘s’ was not declared in this scope                                                 
In file included from /usr/include/k3bdiskinfo.h:22,                                                                 
                 from /var/tmp/portage/app-cdr/k3b-9999/work/k3b-9999/libk3b/core/k3bjobhandler.h:19,                 
                 from /var/tmp/portage/app-cdr/k3b-9999/work/k3b-9999/libk3b/core/k3bjob.h:20,                       
                 from /var/tmp/portage/app-cdr/k3b-9999/work/k3b-9999/libk3b/core/k3bthreadjob.h:19,                 
                 from /var/tmp/portage/app-cdr/k3b-9999/work/k3b_build/libk3b/../../k3b-9999/libk3b/jobs/k3bdatatrackreader.h:19,                                                                                                           
                 from /var/tmp/portage/app-cdr/k3b-9999/work/k3b_build/libk3b/moc_k3bdatatrackreader.cpp:10,         
                 from /var/tmp/portage/app-cdr/k3b-9999/work/k3b_build/libk3b/k3b_automoc.cpp:4:                     
/usr/include/k3btoc.h: At global scope:                                                                               
/usr/include/k3btoc.h:45: error: expected template-name before ‘<’ token                                             
/usr/include/k3btoc.h:45: error: expected `{' before ‘<’ token                                                       
/usr/include/k3btoc.h:45: error: expected unqualified-id before ‘<’ token                                             
In file included from /var/tmp/portage/app-cdr/k3b-9999/work/k3b_build/libk3b/k3b_automoc.cpp:5:                     
/var/tmp/portage/app-cdr/k3b-9999/work/k3b_build/libk3b/moc_k3bprojectplugin.cpp:62: error: expected `}' at end of input                                                                                                                   
make[2]: *** [libk3b/CMakeFiles/k3b.dir/k3b_automoc.o] Error 1                                                       
make[2]: *** Waiting for unfinished jobs....                                                                         
In file included from /usr/include/k3btoc.h:25,                                                                       
                 from /usr/include/k3bdiskinfo.h:22,                                                                 
                 from /var/tmp/portage/app-cdr/k3b-9999/work/k3b-9999/libk3b/core/k3bjobhandler.h:19,                 
                 from /var/tmp/portage/app-cdr/k3b-9999/work/k3b-9999/libk3b/core/k3bjob.h:20,                       
                 from /var/tmp/portage/app-cdr/k3b-9999/work/k3b-9999/libk3b/core/k3bcore.cpp:18:                     
/usr/include/k3btrack.h:78: error: expected ‘;’ before ‘&’ token                                                     
/usr/include/k3btrack.h:79: error: expected `;' before ‘void’                                                         
/usr/include/k3btrack.h:79: error: expected ‘,’ or ‘...’ before ‘&’ token                                             
/usr/include/k3btrack.h:123: error: expected ‘;’ before ‘<’ token                                                     
/usr/include/k3btrack.h:125: error: expected `;' before ‘bool’                                                       
/usr/include/k3btrack.h:143: error: expected ‘;’ before ‘<’ token                                                     
/usr/include/k3btrack.h:145: error: ‘QCString’ does not name a type                                                   
/usr/include/k3btrack.h: In member function ‘void K3bDevice::Track::setIsrc(int)’:                                   
/usr/include/k3btrack.h:79: error: ‘m_isrc’ was not declared in this scope                                           
/usr/include/k3btrack.h:79: error: ‘s’ was not declared in this scope                                                 
In file included from /usr/include/k3bdiskinfo.h:22,                                                                 
                 from /var/tmp/portage/app-cdr/k3b-9999/work/k3b-9999/libk3b/core/k3bjobhandler.h:19,                 
                 from /var/tmp/portage/app-cdr/k3b-9999/work/k3b-9999/libk3b/core/k3bjob.h:20,                       
                 from /var/tmp/portage/app-cdr/k3b-9999/work/k3b-9999/libk3b/core/k3bcore.cpp:18:                     
/usr/include/k3btoc.h: At global scope:                                                                               
/usr/include/k3btoc.h:45: error: expected template-name before ‘<’ token                                             
/usr/include/k3btoc.h:45: error: expected `{' before ‘<’ token                                                       
/usr/include/k3btoc.h:45: error: expected unqualified-id before ‘<’ token                                             
In file included from /var/tmp/portage/app-cdr/k3b-9999/work/k3b-9999/libk3b/core/k3bcore.cpp:359:                   
/var/tmp/portage/app-cdr/k3b-9999/work/k3b_build/libk3b/k3bcore.moc:116: error: expected `}' at end of input         
make[2]: *** [libk3b/CMakeFiles/k3b.dir/core/k3bcore.o] Error 1                                                       
make[1]: *** [libk3b/CMakeFiles/k3b.dir/all] Error 2                                                                 
make: *** [all] Error 2                                                                                               
 *                                                                                                                   
 * ERROR: app-cdr/k3b-9999 failed.                                                                                   
 * Call stack:                                                                                                       
 *               ebuild.sh, line   49:  Called src_compile                                                           
 *             environment, line 3202:  Called kde4-base_src_compile                                                 
 *             environment, line 2387:  Called cmake-utils_src_compile                                               
 *             environment, line  832:  Called cmake-utils_src_make                                                   
 *             environment, line  911:  Called die                                                                   
 * The specific snippet of code:                                                                                     
 *           emake "$@" || die "Make failed!";                                                                       
 *  The die message:                                                                                                 
 *   Make failed!                                                                                                     
 *                                                                                                                   
 * If you need support, post the topmost build error, and the call stack if relevant.                                 
 * A complete build log is located at '/var/tmp/portage/app-cdr/k3b-9999/temp/build.log'.                             
 * The ebuild environment file is located at '/var/tmp/portage/app-cdr/k3b-9999/temp/environment'.                   
 * This ebuild used the following eclasses from overlays:                                                             
 *   /usr/portage/local/layman/kde-testing/eclass/kde4-base.eclass                                                   
 *   /usr/portage/local/layman/kde-testing/eclass/kde4-functions.eclass                                               
 * This ebuild is from a repository named 'kde'                                                                       
 *                                                                                                                   

>>> Failed to emerge app-cdr/k3b-9999
Back to top
View user's profile Send private message
rahulthewall
Veteran
Veteran


Joined: 01 Nov 2007
Posts: 1264
Location: Zürich

PostPosted: Tue Apr 14, 2009 6:53 pm    Post subject: Reply with quote

amarok-utils-2.0.90 fails to build!

Last Sync with kde overlay : 20:55 CET

Code:

CMake Error at cmake/modules/FindGettext.cmake:229 (ADD_CUSTOM_TARGET):                                       
  add_custom_target cannot create target "pofiles" because another target                                     
  with the same name already exists.  The existing target is a custom target                                 
  created in source directory                                                                                 
  "/var/tmp/portage/media-sound/amarok-utils-2.0.90/work/amarok-2.0.90/po/ko".                               
  See documentation for policy CMP0002 for more details.                                                     
Call Stack (most recent call first):                                                                         
  po/nn/CMakeLists.txt:2 (GETTEXT_PROCESS_PO_FILES)                                                           


CMake Error at cmake/modules/FindGettext.cmake:229 (ADD_CUSTOM_TARGET):
  add_custom_target cannot create target "pofiles" because another target
  with the same name already exists.  The existing target is a custom target
  created in source directory                                               
  "/var/tmp/portage/media-sound/amarok-utils-2.0.90/work/amarok-2.0.90/po/ko".
  See documentation for policy CMP0002 for more details.                     
Call Stack (most recent call first):                                         
  po/zh_CN/CMakeLists.txt:2 (GETTEXT_PROCESS_PO_FILES)                       


CMake Error at cmake/modules/FindGettext.cmake:229 (ADD_CUSTOM_TARGET):
  add_custom_target cannot create target "pofiles" because another target
  with the same name already exists.  The existing target is a custom target
  created in source directory                                               
  "/var/tmp/portage/media-sound/amarok-utils-2.0.90/work/amarok-2.0.90/po/ko".
  See documentation for policy CMP0002 for more details.                     
Call Stack (most recent call first):                                         
  po/lt/CMakeLists.txt:2 (GETTEXT_PROCESS_PO_FILES)                           


CMake Error at cmake/modules/FindGettext.cmake:229 (ADD_CUSTOM_TARGET):
  add_custom_target cannot create target "pofiles" because another target
  with the same name already exists.  The existing target is a custom target
  created in source directory                                               
  "/var/tmp/portage/media-sound/amarok-utils-2.0.90/work/amarok-2.0.90/po/ko".
  See documentation for policy CMP0002 for more details.                     
Call Stack (most recent call first):                                         
  po/fr/CMakeLists.txt:2 (GETTEXT_PROCESS_PO_FILES)                           


CMake Error at cmake/modules/FindGettext.cmake:229 (ADD_CUSTOM_TARGET):
  add_custom_target cannot create target "pofiles" because another target
  with the same name already exists.  The existing target is a custom target
  created in source directory                                               
  "/var/tmp/portage/media-sound/amarok-utils-2.0.90/work/amarok-2.0.90/po/ko".
  See documentation for policy CMP0002 for more details.                     
Call Stack (most recent call first):                                         
  po/he/CMakeLists.txt:2 (GETTEXT_PROCESS_PO_FILES)                           


CMake Error at cmake/modules/FindGettext.cmake:229 (ADD_CUSTOM_TARGET):
  add_custom_target cannot create target "pofiles" because another target
  with the same name already exists.  The existing target is a custom target
  created in source directory                                               
  "/var/tmp/portage/media-sound/amarok-utils-2.0.90/work/amarok-2.0.90/po/ko".
  See documentation for policy CMP0002 for more details.                     
Call Stack (most recent call first):                                         
  po/ga/CMakeLists.txt:2 (GETTEXT_PROCESS_PO_FILES)                           


CMake Error at cmake/modules/FindGettext.cmake:229 (ADD_CUSTOM_TARGET):
  add_custom_target cannot create target "pofiles" because another target
  with the same name already exists.  The existing target is a custom target
  created in source directory                                               
  "/var/tmp/portage/media-sound/amarok-utils-2.0.90/work/amarok-2.0.90/po/ko".
  See documentation for policy CMP0002 for more details.                     
Call Stack (most recent call first):                                         
  po/zh_TW/CMakeLists.txt:2 (GETTEXT_PROCESS_PO_FILES)                       


CMake Error at cmake/modules/FindGettext.cmake:229 (ADD_CUSTOM_TARGET):
  add_custom_target cannot create target "pofiles" because another target
  with the same name already exists.  The existing target is a custom target
  created in source directory                                               
  "/var/tmp/portage/media-sound/amarok-utils-2.0.90/work/amarok-2.0.90/po/ko".
  See documentation for policy CMP0002 for more details.                     
Call Stack (most recent call first):                                         
  po/is/CMakeLists.txt:2 (GETTEXT_PROCESS_PO_FILES)                           


CMake Error at cmake/modules/FindGettext.cmake:229 (ADD_CUSTOM_TARGET):
  add_custom_target cannot create target "pofiles" because another target
  with the same name already exists.  The existing target is a custom target
  created in source directory                                               
  "/var/tmp/portage/media-sound/amarok-utils-2.0.90/work/amarok-2.0.90/po/ko".
  See documentation for policy CMP0002 for more details.                     
Call Stack (most recent call first):                                         
  po/eo/CMakeLists.txt:2 (GETTEXT_PROCESS_PO_FILES)                           


CMake Error at cmake/modules/FindGettext.cmake:229 (ADD_CUSTOM_TARGET):
  add_custom_target cannot create target "pofiles" because another target
  with the same name already exists.  The existing target is a custom target
  created in source directory                                               
  "/var/tmp/portage/media-sound/amarok-utils-2.0.90/work/amarok-2.0.90/po/ko".
  See documentation for policy CMP0002 for more details.                     
Call Stack (most recent call first):                                         
  po/uk/CMakeLists.txt:2 (GETTEXT_PROCESS_PO_FILES)                           


CMake Error at cmake/modules/FindGettext.cmake:229 (ADD_CUSTOM_TARGET):
  add_custom_target cannot create target "pofiles" because another target
  with the same name already exists.  The existing target is a custom target
  created in source directory                                               
  "/var/tmp/portage/media-sound/amarok-utils-2.0.90/work/amarok-2.0.90/po/ko".
  See documentation for policy CMP0002 for more details.                     
Call Stack (most recent call first):                                         
  po/et/CMakeLists.txt:2 (GETTEXT_PROCESS_PO_FILES)                           


CMake Error at cmake/modules/FindGettext.cmake:229 (ADD_CUSTOM_TARGET):
  add_custom_target cannot create target "pofiles" because another target
  with the same name already exists.  The existing target is a custom target
  created in source directory                                               
  "/var/tmp/portage/media-sound/amarok-utils-2.0.90/work/amarok-2.0.90/po/ko".
  See documentation for policy CMP0002 for more details.                     
Call Stack (most recent call first):                                         
  po/de/CMakeLists.txt:2 (GETTEXT_PROCESS_PO_FILES)                           


CMake Error at cmake/modules/FindGettext.cmake:229 (ADD_CUSTOM_TARGET):
  add_custom_target cannot create target "pofiles" because another target
  with the same name already exists.  The existing target is a custom target
  created in source directory                                               
  "/var/tmp/portage/media-sound/amarok-utils-2.0.90/work/amarok-2.0.90/po/ko".
  See documentation for policy CMP0002 for more details.                     
Call Stack (most recent call first):                                         
  po/ro/CMakeLists.txt:2 (GETTEXT_PROCESS_PO_FILES)                           


CMake Error at cmake/modules/FindGettext.cmake:229 (ADD_CUSTOM_TARGET):
  add_custom_target cannot create target "pofiles" because another target
  with the same name already exists.  The existing target is a custom target
  created in source directory                                               
  "/var/tmp/portage/media-sound/amarok-utils-2.0.90/work/amarok-2.0.90/po/ko".
  See documentation for policy CMP0002 for more details.                     
Call Stack (most recent call first):                                         
  po/tr/CMakeLists.txt:2 (GETTEXT_PROCESS_PO_FILES)                           


CMake Error at cmake/modules/FindGettext.cmake:229 (ADD_CUSTOM_TARGET):
  add_custom_target cannot create target "pofiles" because another target
  with the same name already exists.  The existing target is a custom target
  created in source directory                                               
  "/var/tmp/portage/media-sound/amarok-utils-2.0.90/work/amarok-2.0.90/po/ko".
  See documentation for policy CMP0002 for more details.                     
Call Stack (most recent call first):                                         
  po/km/CMakeLists.txt:2 (GETTEXT_PROCESS_PO_FILES)                           


CMake Error at cmake/modules/FindGettext.cmake:229 (ADD_CUSTOM_TARGET):
  add_custom_target cannot create target "pofiles" because another target
  with the same name already exists.  The existing target is a custom target
  created in source directory                                               
  "/var/tmp/portage/media-sound/amarok-utils-2.0.90/work/amarok-2.0.90/po/ko".
  See documentation for policy CMP0002 for more details.                     
Call Stack (most recent call first):                                         
  po/ru/CMakeLists.txt:2 (GETTEXT_PROCESS_PO_FILES)                           


CMake Error at cmake/modules/FindGettext.cmake:229 (ADD_CUSTOM_TARGET):
  add_custom_target cannot create target "pofiles" because another target
  with the same name already exists.  The existing target is a custom target
  created in source directory                                               
  "/var/tmp/portage/media-sound/amarok-utils-2.0.90/work/amarok-2.0.90/po/ko".
  See documentation for policy CMP0002 for more details.                     
Call Stack (most recent call first):                                         
  po/ja/CMakeLists.txt:2 (GETTEXT_PROCESS_PO_FILES)                           


CMake Error at cmake/modules/FindGettext.cmake:229 (ADD_CUSTOM_TARGET):
  add_custom_target cannot create target "pofiles" because another target
  with the same name already exists.  The existing target is a custom target
  created in source directory                                               
  "/var/tmp/portage/media-sound/amarok-utils-2.0.90/work/amarok-2.0.90/po/ko".
  See documentation for policy CMP0002 for more details.                     
Call Stack (most recent call first):                                         
  po/ar/CMakeLists.txt:2 (GETTEXT_PROCESS_PO_FILES)                           


CMake Error at cmake/modules/FindGettext.cmake:229 (ADD_CUSTOM_TARGET):
  add_custom_target cannot create target "pofiles" because another target
  with the same name already exists.  The existing target is a custom target
  created in source directory                                               
  "/var/tmp/portage/media-sound/amarok-utils-2.0.90/work/amarok-2.0.90/po/ko".
  See documentation for policy CMP0002 for more details.                     
Call Stack (most recent call first):                                         
  po/bg/CMakeLists.txt:2 (GETTEXT_PROCESS_PO_FILES)                           


CMake Error at cmake/modules/FindGettext.cmake:229 (ADD_CUSTOM_TARGET):
  add_custom_target cannot create target "pofiles" because another target
  with the same name already exists.  The existing target is a custom target
  created in source directory                                               
  "/var/tmp/portage/media-sound/amarok-utils-2.0.90/work/amarok-2.0.90/po/ko".
  See documentation for policy CMP0002 for more details.                     
Call Stack (most recent call first):                                         
  po/cs/CMakeLists.txt:2 (GETTEXT_PROCESS_PO_FILES)                           


CMake Error at cmake/modules/FindGettext.cmake:229 (ADD_CUSTOM_TARGET):
  add_custom_target cannot create target "pofiles" because another target
  with the same name already exists.  The existing target is a custom target
  created in source directory                                               
  "/var/tmp/portage/media-sound/amarok-utils-2.0.90/work/amarok-2.0.90/po/ko".
  See documentation for policy CMP0002 for more details.                     
Call Stack (most recent call first):                                         
  po/sl/CMakeLists.txt:2 (GETTEXT_PROCESS_PO_FILES)                           


CMake Error at cmake/modules/FindGettext.cmake:229 (ADD_CUSTOM_TARGET):
  add_custom_target cannot create target "pofiles" because another target
  with the same name already exists.  The existing target is a custom target
  created in source directory                                               
  "/var/tmp/portage/media-sound/amarok-utils-2.0.90/work/amarok-2.0.90/po/ko".
  See documentation for policy CMP0002 for more details.                     
Call Stack (most recent call first):                                         
  po/eu/CMakeLists.txt:2 (GETTEXT_PROCESS_PO_FILES)                           


CMake Error at cmake/modules/FindGettext.cmake:229 (ADD_CUSTOM_TARGET):
  add_custom_target cannot create target "pofiles" because another target
  with the same name already exists.  The existing target is a custom target
  created in source directory                                               
  "/var/tmp/portage/media-sound/amarok-utils-2.0.90/work/amarok-2.0.90/po/ko".
  See documentation for policy CMP0002 for more details.                     
Call Stack (most recent call first):                                         
  po/pa/CMakeLists.txt:2 (GETTEXT_PROCESS_PO_FILES)                           


CMake Error at cmake/modules/FindGettext.cmake:229 (ADD_CUSTOM_TARGET):
  add_custom_target cannot create target "pofiles" because another target
  with the same name already exists.  The existing target is a custom target
  created in source directory                                               
  "/var/tmp/portage/media-sound/amarok-utils-2.0.90/work/amarok-2.0.90/po/ko".
  See documentation for policy CMP0002 for more details.                     
Call Stack (most recent call first):                                         
  po/th/CMakeLists.txt:2 (GETTEXT_PROCESS_PO_FILES)                           


CMake Error at cmake/modules/FindGettext.cmake:229 (ADD_CUSTOM_TARGET):
  add_custom_target cannot create target "pofiles" because another target
  with the same name already exists.  The existing target is a custom target
  created in source directory                                               
  "/var/tmp/portage/media-sound/amarok-utils-2.0.90/work/amarok-2.0.90/po/ko".
  See documentation for policy CMP0002 for more details.                     
Call Stack (most recent call first):                                         
  po/pt/CMakeLists.txt:2 (GETTEXT_PROCESS_PO_FILES)                           


CMake Error at cmake/modules/FindGettext.cmake:229 (ADD_CUSTOM_TARGET):
  add_custom_target cannot create target "pofiles" because another target
  with the same name already exists.  The existing target is a custom target
  created in source directory                                               
  "/var/tmp/portage/media-sound/amarok-utils-2.0.90/work/amarok-2.0.90/po/ko".
  See documentation for policy CMP0002 for more details.                     
Call Stack (most recent call first):                                         
  po/en_GB/CMakeLists.txt:2 (GETTEXT_PROCESS_PO_FILES)                       


CMake Error at cmake/modules/FindGettext.cmake:229 (ADD_CUSTOM_TARGET):
  add_custom_target cannot create target "pofiles" because another target
  with the same name already exists.  The existing target is a custom target
  created in source directory                                               
  "/var/tmp/portage/media-sound/amarok-utils-2.0.90/work/amarok-2.0.90/po/ko".
  See documentation for policy CMP0002 for more details.                     
Call Stack (most recent call first):                                         
  po/ca/CMakeLists.txt:2 (GETTEXT_PROCESS_PO_FILES)                           


CMake Error at cmake/modules/FindGettext.cmake:229 (ADD_CUSTOM_TARGET):
  add_custom_target cannot create target "pofiles" because another target
  with the same name already exists.  The existing target is a custom target
  created in source directory                                               
  "/var/tmp/portage/media-sound/amarok-utils-2.0.90/work/amarok-2.0.90/po/ko".
  See documentation for policy CMP0002 for more details.                     
Call Stack (most recent call first):                                         
  po/tg/CMakeLists.txt:2 (GETTEXT_PROCESS_PO_FILES)                           


CMake Error at cmake/modules/FindGettext.cmake:229 (ADD_CUSTOM_TARGET):
  add_custom_target cannot create target "pofiles" because another target
  with the same name already exists.  The existing target is a custom target
  created in source directory                                               
  "/var/tmp/portage/media-sound/amarok-utils-2.0.90/work/amarok-2.0.90/po/ko".
  See documentation for policy CMP0002 for more details.                     
Call Stack (most recent call first):                                         
  po/nl/CMakeLists.txt:2 (GETTEXT_PROCESS_PO_FILES)                           


CMake Error at cmake/modules/FindGettext.cmake:229 (ADD_CUSTOM_TARGET):
  add_custom_target cannot create target "pofiles" because another target
  with the same name already exists.  The existing target is a custom target
  created in source directory                                               
  "/var/tmp/portage/media-sound/amarok-utils-2.0.90/work/amarok-2.0.90/po/ko".
  See documentation for policy CMP0002 for more details.                     
Call Stack (most recent call first):                                         
  po/ml/CMakeLists.txt:2 (GETTEXT_PROCESS_PO_FILES)                           


CMake Error at cmake/modules/FindGettext.cmake:229 (ADD_CUSTOM_TARGET):
  add_custom_target cannot create target "pofiles" because another target
  with the same name already exists.  The existing target is a custom target
  created in source directory                                               
  "/var/tmp/portage/media-sound/amarok-utils-2.0.90/work/amarok-2.0.90/po/ko".
  See documentation for policy CMP0002 for more details.                     
Call Stack (most recent call first):                                         
  po/be/CMakeLists.txt:2 (GETTEXT_PROCESS_PO_FILES)                           


CMake Error at cmake/modules/FindGettext.cmake:229 (ADD_CUSTOM_TARGET):
  add_custom_target cannot create target "pofiles" because another target
  with the same name already exists.  The existing target is a custom target
  created in source directory                                               
  "/var/tmp/portage/media-sound/amarok-utils-2.0.90/work/amarok-2.0.90/po/ko".
  See documentation for policy CMP0002 for more details.                     
Call Stack (most recent call first):                                         
  po/sk/CMakeLists.txt:2 (GETTEXT_PROCESS_PO_FILES)                           


CMake Error at cmake/modules/FindGettext.cmake:229 (ADD_CUSTOM_TARGET):
  add_custom_target cannot create target "pofiles" because another target
  with the same name already exists.  The existing target is a custom target
  created in source directory                                               
  "/var/tmp/portage/media-sound/amarok-utils-2.0.90/work/amarok-2.0.90/po/ko".
  See documentation for policy CMP0002 for more details.                     
Call Stack (most recent call first):                                         
  po/csb/CMakeLists.txt:2 (GETTEXT_PROCESS_PO_FILES)                         


CMake Error at cmake/modules/FindGettext.cmake:229 (ADD_CUSTOM_TARGET):
  add_custom_target cannot create target "pofiles" because another target
  with the same name already exists.  The existing target is a custom target
  created in source directory                                               
  "/var/tmp/portage/media-sound/amarok-utils-2.0.90/work/amarok-2.0.90/po/ko".
  See documentation for policy CMP0002 for more details.                     
Call Stack (most recent call first):                                         
  po/ku/CMakeLists.txt:2 (GETTEXT_PROCESS_PO_FILES)                           


CMake Error at cmake/modules/FindGettext.cmake:229 (ADD_CUSTOM_TARGET):
  add_custom_target cannot create target "pofiles" because another target
  with the same name already exists.  The existing target is a custom target
  created in source directory                                               
  "/var/tmp/portage/media-sound/amarok-utils-2.0.90/work/amarok-2.0.90/po/ko".
  See documentation for policy CMP0002 for more details.                     
Call Stack (most recent call first):                                         
  po/es/CMakeLists.txt:2 (GETTEXT_PROCESS_PO_FILES)                           


CMake Error at cmake/modules/FindGettext.cmake:229 (ADD_CUSTOM_TARGET):
  add_custom_target cannot create target "pofiles" because another target
  with the same name already exists.  The existing target is a custom target
  created in source directory                                               
  "/var/tmp/portage/media-sound/amarok-utils-2.0.90/work/amarok-2.0.90/po/ko".
  See documentation for policy CMP0002 for more details.                     
Call Stack (most recent call first):                                         
  po/sv/CMakeLists.txt:2 (GETTEXT_PROCESS_PO_FILES)                           


CMake Error at cmake/modules/FindGettext.cmake:229 (ADD_CUSTOM_TARGET):
  add_custom_target cannot create target "pofiles" because another target
  with the same name already exists.  The existing target is a custom target
  created in source directory                                               
  "/var/tmp/portage/media-sound/amarok-utils-2.0.90/work/amarok-2.0.90/po/ko".
  See documentation for policy CMP0002 for more details.                     
Call Stack (most recent call first):                                         
  po/fi/CMakeLists.txt:2 (GETTEXT_PROCESS_PO_FILES)                           


CMake Error at cmake/modules/FindGettext.cmake:229 (ADD_CUSTOM_TARGET):
  add_custom_target cannot create target "pofiles" because another target
  with the same name already exists.  The existing target is a custom target
  created in source directory                                               
  "/var/tmp/portage/media-sound/amarok-utils-2.0.90/work/amarok-2.0.90/po/ko".
  See documentation for policy CMP0002 for more details.                     
Call Stack (most recent call first):                                         
  po/el/CMakeLists.txt:2 (GETTEXT_PROCESS_PO_FILES)                           


CMake Error at cmake/modules/FindGettext.cmake:229 (ADD_CUSTOM_TARGET):
  add_custom_target cannot create target "pofiles" because another target
  with the same name already exists.  The existing target is a custom target
  created in source directory                                               
  "/var/tmp/portage/media-sound/amarok-utils-2.0.90/work/amarok-2.0.90/po/ko".
  See documentation for policy CMP0002 for more details.                     
Call Stack (most recent call first):                                         
  po/da/CMakeLists.txt:2 (GETTEXT_PROCESS_PO_FILES)                           


CMake Error at cmake/modules/FindGettext.cmake:229 (ADD_CUSTOM_TARGET):
  add_custom_target cannot create target "pofiles" because another target
  with the same name already exists.  The existing target is a custom target
  created in source directory                                               
  "/var/tmp/portage/media-sound/amarok-utils-2.0.90/work/amarok-2.0.90/po/ko".
  See documentation for policy CMP0002 for more details.                     
Call Stack (most recent call first):                                         
  po/lv/CMakeLists.txt:2 (GETTEXT_PROCESS_PO_FILES)                           


CMake Error at cmake/modules/FindGettext.cmake:229 (ADD_CUSTOM_TARGET):
  add_custom_target cannot create target "pofiles" because another target
  with the same name already exists.  The existing target is a custom target
  created in source directory                                               
  "/var/tmp/portage/media-sound/amarok-utils-2.0.90/work/amarok-2.0.90/po/ko".
  See documentation for policy CMP0002 for more details.                     
Call Stack (most recent call first):                                         
  po/it/CMakeLists.txt:2 (GETTEXT_PROCESS_PO_FILES)                           


CMake Error at cmake/modules/FindGettext.cmake:229 (ADD_CUSTOM_TARGET):
  add_custom_target cannot create target "pofiles" because another target
  with the same name already exists.  The existing target is a custom target
  created in source directory                                               
  "/var/tmp/portage/media-sound/amarok-utils-2.0.90/work/amarok-2.0.90/po/ko".
  See documentation for policy CMP0002 for more details.                     
Call Stack (most recent call first):                                         
  po/se/CMakeLists.txt:2 (GETTEXT_PROCESS_PO_FILES)                           


CMake Error at cmake/modules/FindGettext.cmake:229 (ADD_CUSTOM_TARGET):
  add_custom_target cannot create target "pofiles" because another target
  with the same name already exists.  The existing target is a custom target
  created in source directory                                               
  "/var/tmp/portage/media-sound/amarok-utils-2.0.90/work/amarok-2.0.90/po/ko".
  See documentation for policy CMP0002 for more details.                     
Call Stack (most recent call first):                                         
  po/gl/CMakeLists.txt:2 (GETTEXT_PROCESS_PO_FILES)                           


CMake Error at cmake/modules/FindGettext.cmake:229 (ADD_CUSTOM_TARGET):
  add_custom_target cannot create target "pofiles" because another target
  with the same name already exists.  The existing target is a custom target
  created in source directory                                               
  "/var/tmp/portage/media-sound/amarok-utils-2.0.90/work/amarok-2.0.90/po/ko".
  See documentation for policy CMP0002 for more details.                     
Call Stack (most recent call first):                                         
  po/si/CMakeLists.txt:2 (GETTEXT_PROCESS_PO_FILES)                           


CMake Error at cmake/modules/FindGettext.cmake:229 (ADD_CUSTOM_TARGET):
  add_custom_target cannot create target "pofiles" because another target
  with the same name already exists.  The existing target is a custom target
  created in source directory                                               
  "/var/tmp/portage/media-sound/amarok-utils-2.0.90/work/amarok-2.0.90/po/ko".
  See documentation for policy CMP0002 for more details.                     
Call Stack (most recent call first):                                         
  po/nb/CMakeLists.txt:2 (GETTEXT_PROCESS_PO_FILES)                           


CMake Error at cmake/modules/FindGettext.cmake:229 (ADD_CUSTOM_TARGET):
  add_custom_target cannot create target "pofiles" because another target
  with the same name already exists.  The existing target is a custom target
  created in source directory                                               
  "/var/tmp/portage/media-sound/amarok-utils-2.0.90/work/amarok-2.0.90/po/ko".
  See documentation for policy CMP0002 for more details.                     
Call Stack (most recent call first):                                         
  po/ne/CMakeLists.txt:2 (GETTEXT_PROCESS_PO_FILES)                           


CMake Error at cmake/modules/FindGettext.cmake:229 (ADD_CUSTOM_TARGET):
  add_custom_target cannot create target "pofiles" because another target
  with the same name already exists.  The existing target is a custom target
  created in source directory                                               
  "/var/tmp/portage/media-sound/amarok-utils-2.0.90/work/amarok-2.0.90/po/ko".
  See documentation for policy CMP0002 for more details.                     
Call Stack (most recent call first):                                         
  po/pl/CMakeLists.txt:2 (GETTEXT_PROCESS_PO_FILES)                           


CMake Error at cmake/modules/FindGettext.cmake:229 (ADD_CUSTOM_TARGET):
  add_custom_target cannot create target "pofiles" because another target
  with the same name already exists.  The existing target is a custom target
  created in source directory                                               
  "/var/tmp/portage/media-sound/amarok-utils-2.0.90/work/amarok-2.0.90/po/ko".
  See documentation for policy CMP0002 for more details.                     
Call Stack (most recent call first):                                         
  po/pt_BR/CMakeLists.txt:2 (GETTEXT_PROCESS_PO_FILES)                       


CMake Error at cmake/modules/FindGettext.cmake:229 (ADD_CUSTOM_TARGET):
  add_custom_target cannot create target "pofiles" because another target
  with the same name already exists.  The existing target is a custom target
  created in source directory                                               
  "/var/tmp/portage/media-sound/amarok-utils-2.0.90/work/amarok-2.0.90/po/ko".
  See documentation for policy CMP0002 for more details.                     
Call Stack (most recent call first):                                         
  po/nds/CMakeLists.txt:2 (GETTEXT_PROCESS_PO_FILES)                         


CMake Error at cmake/modules/FindGettext.cmake:229 (ADD_CUSTOM_TARGET):
  add_custom_target cannot create target "pofiles" because another target
  with the same name already exists.  The existing target is a custom target
  created in source directory                                               
  "/var/tmp/portage/media-sound/amarok-utils-2.0.90/work/amarok-2.0.90/po/ko".
  See documentation for policy CMP0002 for more details.                     
Call Stack (most recent call first):                                         
  po/oc/CMakeLists.txt:2 (GETTEXT_PROCESS_PO_FILES)                           


-- <<< Gentoo configuration >>>
Build type: Gentoo             
Install path: /usr             

-- Configuring incomplete, errors occurred!
 *                                         
 * ERROR: media-sound/amarok-utils-2.0.90 failed.
 * Call stack:                                   
 *               ebuild.sh, line   49:  Called src_configure
 *             environment, line 3094:  Called kde4-base_src_configure
 *             environment, line 2320:  Called cmake-utils_src_configure
 *             environment, line  820:  Called die                     
 * The specific snippet of code:                                       
 *       cmake ${cmakeargs} "${S}" || die "cmake failed";               
 *  The die message:                                                   
 *   cmake failed                                                       
 *                                                                     
 * If you need support, post the topmost build error, and the call stack if relevant.
 * A complete build log is located at '/var/tmp/portage/media-sound/amarok-utils-2.0.90/temp/build.log'.
 * The ebuild environment file is located at '/var/tmp/portage/media-sound/amarok-utils-2.0.90/temp/environment'.                                                                                                             
 * This ebuild used the following eclasses from overlays:                                                     
 *   /usr/local/portage/layman/kde-testing/eclass/kde4-base.eclass                                             
 *   /usr/local/portage/layman/kde-testing/eclass/kde4-functions.eclass                                       
 * This ebuild is from an overlay named 'kde': '/usr/local/portage/layman/kde-testing/'                       

_________________
Who shall guard the guards?
Back to top
View user's profile Send private message
gaelic
Tux's lil' helper
Tux's lil' helper


Joined: 30 Dec 2003
Posts: 119
Location: Vienna, Austria, Europe, World, Solar System, Milky Way, Universe

PostPosted: Tue Apr 14, 2009 7:20 pm    Post subject: Reply with quote

same problem here with amarok-2.0.90
Back to top
View user's profile Send private message
hunky
l33t
l33t


Joined: 19 Nov 2003
Posts: 821
Location: Alaska

PostPosted: Wed Apr 15, 2009 5:10 am    Post subject: Reply with quote

amarok-utils : a different problem:
Code:
>>> Emerging (14 of 15) media-sound/amarok-utils-2.0.90 from kde
 * amarok-2.0.90.tar.bz2 RMD160 SHA1 SHA256 size ;-) ...                                                               [ ok ]
>>> Unpacking source...                                                                                                     
>>> Unpacking amarok-2.0.90.tar.bz2 to /var/tmp/portage/media-sound/amarok-utils-2.0.90/work                                 
cp: cannot stat `/usr/local/portage/layman/kde-testing/media-sound/amarok-utils/files/MacroOptionalAddSubdirectory.cmake': No such file or directory                                                                                                       
 *                                                                                                                           
 * ERROR: media-sound/amarok-utils-2.0.90 failed.                                                                             
 * Call stack:                                                                                                               
 *               ebuild.sh, line   49:  Called src_unpack                                                                     
 *             environment, line 3082:  Called die                                                                           
 * The specific snippet of code:                                                                                             
 *       cp "${FILESDIR}/MacroOptionalAddSubdirectory.cmake" "${S}/cmake/modules" || die "Failed to add OptionalAddSubdirectory Macro".;                                                                                                                   
 *  The die message:                                                                                                         
 *   Failed to add OptionalAddSubdirectory Macro.                                                                             
 *                                                         
Back to top
View user's profile Send private message
rahulthewall
Veteran
Veteran


Joined: 01 Nov 2007
Posts: 1264
Location: Zürich

PostPosted: Wed Apr 15, 2009 7:36 am    Post subject: Reply with quote

amarok-utils-2.0.90 and amarok-2.0.90 build and install fine but amarok-2.0.90 crashes on startup.

Code:

rahul@googly ~ $ amarok
amarok(17676) Phonon::KdePlatformPlugin::createBackend: using backend:  "Xine"
InnoDB: The log sequence number in ibdata files does not match
InnoDB: the log sequence number in the ib_logfiles!
090415  9:33:31  InnoDB: Database was not shut down normally!
InnoDB: Starting crash recovery.
InnoDB: Reading tablespace information from the .ibd files...
InnoDB: Restoring possible half-written data pages from the doublewrite
InnoDB: buffer...
<unknown program name>(17675)/: Communication problem with  "amarok" , it probably crashed.
Error message was:  "org.freedesktop.DBus.Error.NoReply" : " "Message did not receive a reply (timeout by message bus)" "
KCrash: Application 'amarok' crashing...
sock_file=/home/rahul/.kde4/socket-googly/kdeinit4__0

_________________
Who shall guard the guards?
Back to top
View user's profile Send private message
mikkoc
Apprentice
Apprentice


Joined: 24 May 2007
Posts: 231

PostPosted: Wed Apr 15, 2009 8:42 am    Post subject: Reply with quote

rahulthewall wrote:
amarok-utils-2.0.90 and amarok-2.0.90 build and install fine but amarok-2.0.90 crashes on startup.


Delete the database and try again.
Then if amarok doesn't find any music/can't scan the collection: https://bugs.gentoo.org/show_bug.cgi?id=266071
Back to top
View user's profile Send private message
rahulthewall
Veteran
Veteran


Joined: 01 Nov 2007
Posts: 1264
Location: Zürich

PostPosted: Wed Apr 15, 2009 12:07 pm    Post subject: Reply with quote

mikkoc wrote:
Then if amarok doesn't find any music/can't scan the collection: https://bugs.gentoo.org/show_bug.cgi?id=266071


Hit that bug now!
_________________
Who shall guard the guards?
Back to top
View user's profile Send private message
CooSee
Guru
Guru


Joined: 20 Nov 2004
Posts: 458
Location: Earth

PostPosted: Wed Apr 15, 2009 7:40 pm    Post subject: Reply with quote

something is wrong after " eix-sync && layman -S " :!:

many kde-4.2 blocks :roll: 8O :evil: :!:

but using " kde-testing ", hmm :?

http://de.pastebin.ca/1393117

CooSee ' Ya
_________________
beQuiet! Silent Base 800 Black - MSI C236A - Xeon E3-1245v5 - 32GB RAM Kingston - Sapphire Nitro+ Radeon RX590 8G - Samsung PM961 M.2 128GB - Samsung 840 EVO 120GB - Creative Sound Blaster RX PCIe - Logitech Z623 2.1 - G110 Keyboard - Mouse G400
Back to top
View user's profile Send private message
tampakrap
Retired Dev
Retired Dev


Joined: 27 Nov 2007
Posts: 71
Location: Prague, Czech Republic

PostPosted: Wed Apr 15, 2009 7:51 pm    Post subject: Reply with quote

eclasses were moved from overlay to tree, sync portage :)
Back to top
View user's profile Send private message
CooSee
Guru
Guru


Joined: 20 Nov 2004
Posts: 458
Location: Earth

PostPosted: Wed Apr 15, 2009 8:14 pm    Post subject: Reply with quote

tampakrap wrote:
eclasses were moved from overlay to tree, sync portage :)


THX for fast reply :D

its weird,... sorry forget to say, i'am using " funtoo " :!:

already synced portage :roll:

also i'am getting probs with " solid "

Code:
!!! Multiple package instances within a single package slot have been pulled
!!! into the dependency graph, resulting in a slot conflict:

kde-base/solid:live

  ('ebuild', '/', 'kde-base/solid-9999', 'merge') pulled in by
    >=kde-base/solid-9999:live[-kdeprefix] required by ('installed', '/', 'kde-base/plasma-workspace-9999', 'nomerge')
    >=kde-base/solid-9999:live[-kdeprefix] required by ('installed', '/', 'kde-base/powerdevil-9999', 'nomerge')
    kde-base/solid:live required by @world
    (and 2 more)

  ('installed', '/', 'kde-base/solid-9999', 'nomerge') pulled in by
    >=kde-base/solid-4.2[bluetooth] required by ('installed', '/', 'net-wireless/kdebluetooth4-9999', 'nomerge')
    (and 5 more)

  Explanation:

    New USE for 'kde-base/solid:live' are incorrectly set. In order to
    solve this, adjust USE to satisfy '>=kde-base/solid-4.2[bluetooth]'.


CooSee ' Ya
_________________
beQuiet! Silent Base 800 Black - MSI C236A - Xeon E3-1245v5 - 32GB RAM Kingston - Sapphire Nitro+ Radeon RX590 8G - Samsung PM961 M.2 128GB - Samsung 840 EVO 120GB - Creative Sound Blaster RX PCIe - Logitech Z623 2.1 - G110 Keyboard - Mouse G400
Back to top
View user's profile Send private message
mikedee
Apprentice
Apprentice


Joined: 05 Jul 2006
Posts: 158

PostPosted: Thu Apr 16, 2009 10:24 am    Post subject: Reply with quote

Quote:
In order to solve this, adjust USE to satisfy '>=kde-base/solid-4.2[bluetooth]'.


Did you try adding bluetooth to your use flags and then reemerging everything with the new-use flag (particularly solid)? I would add bluetooth to my global USE flags if you are running a laptop. If you do not have bluetooth then uninstall kdebluetooth.
Back to top
View user's profile Send private message
CooSee
Guru
Guru


Joined: 20 Nov 2004
Posts: 458
Location: Earth

PostPosted: Thu Apr 16, 2009 8:58 pm    Post subject: Reply with quote

mikedee wrote:
Quote:
In order to solve this, adjust USE to satisfy '>=kde-base/solid-4.2[bluetooth]'.


Did you try adding bluetooth to your use flags and then reemerging everything with the new-use flag (particularly solid)? I would add bluetooth to my global USE flags if you are running a laptop. If you do not have bluetooth then uninstall kdebluetooth.


" bluetooth " is set in USE flags and

Code:
USE="bluetooth" emerge -va kde-base/solid

These are the packages that would be merged, in order:

Calculating dependencies... done!
[ebuild   R   ] kde-base/solid-9999  USE="(-bluetooth) -debug -kdeprefix (-networkmanager)" 0 kB [1]

Total: 1 package (1 reinstall), Size of downloads: 0 kB
Portage tree and overlays:                             
 [0] /usr/portage                                     
 [1] /usr/local/portage/layman/kde-testing             

Would you like to merge these packages? [Yes/No] n


thanks anyway, removed " kdebluetooth4 !

CooSee ' Ya
_________________
beQuiet! Silent Base 800 Black - MSI C236A - Xeon E3-1245v5 - 32GB RAM Kingston - Sapphire Nitro+ Radeon RX590 8G - Samsung PM961 M.2 128GB - Samsung 840 EVO 120GB - Creative Sound Blaster RX PCIe - Logitech Z623 2.1 - G110 Keyboard - Mouse G400
Back to top
View user's profile Send private message
kernelOfTruth
Watchman
Watchman


Joined: 20 Dec 2005
Posts: 6108
Location: Vienna, Austria; Germany; hello world :)

PostPosted: Fri Apr 17, 2009 11:52 am    Post subject: Reply with quote

could you guys please add an ebuild for the amarok 2.1 beta 1 if it's possible ?

thanks
_________________
https://github.com/kernelOfTruth/ZFS-for-SystemRescueCD/tree/ZFS-for-SysRescCD-4.9.0
https://github.com/kernelOfTruth/pulseaudio-equalizer-ladspa

Hardcore Gentoo Linux user since 2004 :D
Back to top
View user's profile Send private message
rahulthewall
Veteran
Veteran


Joined: 01 Nov 2007
Posts: 1264
Location: Zürich

PostPosted: Fri Apr 17, 2009 3:29 pm    Post subject: Reply with quote

kernelOfTruth wrote:
could you guys please add an ebuild for the amarok 2.1 beta 1 if it's possible ?

thanks


amarok-2.0.90 - already there in the overlay.
_________________
Who shall guard the guards?
Back to top
View user's profile Send private message
kernelOfTruth
Watchman
Watchman


Joined: 20 Dec 2005
Posts: 6108
Location: Vienna, Austria; Germany; hello world :)

PostPosted: Fri Apr 17, 2009 4:12 pm    Post subject: Reply with quote

thanks !

now I'm getting the following error:

Quote:
amarok
amarok(16403) Phonon::KdePlatformPlugin::createBackend: using backend: "Xine"
KCrash: Application 'amarok' crashing...
sock_file=/home/mat/.kde4/socket-lexa/kdeinit4__0
<unknown program name>(16402)/: Communication problem with "amarok" , it probably crashed.
Error message was: "org.freedesktop.DBus.Error.NoReply" : " "Message did not receive a reply (timeout by message bus)" "


use-flags are:

Quote:
USE="cdaudio daap gtk ipod mp3tunes mtp opengl semantic-desktop utils -debug"


cflags/cxxflags:

Quote:
CFLAGS="-O2 -march=native -pipe -fPIC -fno-strict-aliasing -fno-strict-overflow -fno-delete-null-pointer-checks -fno-ident -freorder-blocks-and-partition"


will look through the thread later if that's an known problem ...
_________________
https://github.com/kernelOfTruth/ZFS-for-SystemRescueCD/tree/ZFS-for-SysRescCD-4.9.0
https://github.com/kernelOfTruth/pulseaudio-equalizer-ladspa

Hardcore Gentoo Linux user since 2004 :D
Back to top
View user's profile Send private message
mikkoc
Apprentice
Apprentice


Joined: 24 May 2007
Posts: 231

PostPosted: Fri Apr 17, 2009 4:17 pm    Post subject: Reply with quote

kernelOfTruth wrote:
thanks !

now I'm getting the following error:

Quote:
amarok
amarok(16403) Phonon::KdePlatformPlugin::createBackend: using backend: "Xine"
KCrash: Application 'amarok' crashing...
sock_file=/home/mat/.kde4/socket-lexa/kdeinit4__0
<unknown program name>(16402)/: Communication problem with "amarok" , it probably crashed.
Error message was: "org.freedesktop.DBus.Error.NoReply" : " "Message did not receive a reply (timeout by message bus)" "


mikkoc wrote:
rahulthewall wrote:
amarok-utils-2.0.90 and amarok-2.0.90 build and install fine but amarok-2.0.90 crashes on startup.


Delete the database and try again.
Then if amarok doesn't find any music/can't scan the collection: https://bugs.gentoo.org/show_bug.cgi?id=266071
Back to top
View user's profile Send private message
kernelOfTruth
Watchman
Watchman


Joined: 20 Dec 2005
Posts: 6108
Location: Vienna, Austria; Germany; hello world :)

PostPosted: Fri Apr 17, 2009 4:20 pm    Post subject: Reply with quote

thanks !

unfortunately I get the following when I tried to emerge amarok-utils:

Quote:
>>> Emerging (1 of 1) media-sound/amarok-utils-2.0.90 from kde
* amarok-2.0.90.tar.bz2 RMD160 SHA1 SHA256 size ;-) ... [ ok ]
* checking ebuild checksums ;-) ... [ ok ]
* checking auxfile checksums ;-) ... [ ok ]
* checking miscfile checksums ;-) ... [ ok ]
* Your CFLAGS contains "-fPIC" which can break packages.
* Your CXXFLAGS contains "-fPIC" which can break packages.
*
* Before you file a bug, please remove these flags and
* re-compile the package in question as well as all its dependencies
>>> Unpacking source...
>>> Unpacking amarok-2.0.90.tar.bz2 to /var/tmp/portage/media-sound/amarok-utils-2.0.90/work
>>> Source unpacked in /var/tmp/portage/media-sound/amarok-utils-2.0.90/work
>>> Preparing source in /var/tmp/portage/media-sound/amarok-utils-2.0.90/work/amarok-2.0.90 ...
>>> Source prepared.
>>> Configuring source in /var/tmp/portage/media-sound/amarok-utils-2.0.90/work/amarok-2.0.90 ...
>>> Working in BUILD_DIR: "/var/tmp/portage/media-sound/amarok-utils-2.0.90/work/amarok-utils_build"
loading initial cache file /var/tmp/portage/media-sound/amarok-utils-2.0.90/temp/gentoo_common_config.cmake
-- The C compiler identification is GNU
-- The CXX compiler identification is GNU
-- Check for working C compiler: /usr/bin/x86_64-pc-linux-gnu-gcc
-- Check for working C compiler: /usr/bin/x86_64-pc-linux-gnu-gcc -- works
-- Detecting C compiler ABI info
-- Detecting C compiler ABI info - done
-- Check for working CXX compiler: /usr/bin/x86_64-pc-linux-gnu-g++
-- Check for working CXX compiler: /usr/bin/x86_64-pc-linux-gnu-g++ -- works
-- Detecting CXX compiler ABI info
-- Detecting CXX compiler ABI info - done
-- Looking for dlopen in dl
-- Looking for dlopen in dl - found
-- Taglib found: -L/usr/lib64 -ltag
-- checking for module 'taglib-extras>=0.1'
-- found taglib-extras, version 0.1.0
-- Found Taglib-Extras: /usr/include/taglib-extras
-- Performing Test COMPLEX_TAGLIB_FILENAME
-- Performing Test COMPLEX_TAGLIB_FILENAME - Failed
-- Looking for Q_WS_X11
-- Looking for Q_WS_X11 - found
-- Looking for Q_WS_WIN
-- Looking for Q_WS_WIN - not found.
-- Looking for Q_WS_QWS
-- Looking for Q_WS_QWS - not found.
-- Looking for Q_WS_MAC
-- Looking for Q_WS_MAC - not found.
-- Found Qt-Version 4.5.0
-- Found OpenSSL: /usr/lib64/libssl.so
-- Looking for _POSIX_TIMERS
-- Looking for _POSIX_TIMERS - found
-- Looking for dgettext
-- Looking for dgettext - found
-- Found Gettext: built in libc
CMake Error at cmake/modules/FindGettext.cmake:229 (ADD_CUSTOM_TARGET):
add_custom_target cannot create target "pofiles" because another target
with the same name already exists. The existing target is a custom target
created in source directory
"/var/tmp/portage/media-sound/amarok-utils-2.0.90/work/amarok-2.0.90/po/ko".
See documentation for policy CMP0002 for more details.
Call Stack (most recent call first):
po/nn/CMakeLists.txt:2 (GETTEXT_PROCESS_PO_FILES)


CMake Error at cmake/modules/FindGettext.cmake:229 (ADD_CUSTOM_TARGET):
add_custom_target cannot create target "pofiles" because another target
with the same name already exists. The existing target is a custom target
created in source directory
"/var/tmp/portage/media-sound/amarok-utils-2.0.90/work/amarok-2.0.90/po/ko".
See documentation for policy CMP0002 for more details.
Call Stack (most recent call first):
po/zh_CN/CMakeLists.txt:2 (GETTEXT_PROCESS_PO_FILES)


CMake Error at cmake/modules/FindGettext.cmake:229 (ADD_CUSTOM_TARGET):
add_custom_target cannot create target "pofiles" because another target
with the same name already exists. The existing target is a custom target
created in source directory
"/var/tmp/portage/media-sound/amarok-utils-2.0.90/work/amarok-2.0.90/po/ko".
See documentation for policy CMP0002 for more details.
Call Stack (most recent call first):
po/lt/CMakeLists.txt:2 (GETTEXT_PROCESS_PO_FILES)

_________________
https://github.com/kernelOfTruth/ZFS-for-SystemRescueCD/tree/ZFS-for-SysRescCD-4.9.0
https://github.com/kernelOfTruth/pulseaudio-equalizer-ladspa

Hardcore Gentoo Linux user since 2004 :D
Back to top
View user's profile Send private message
wrc1944
Advocate
Advocate


Joined: 15 Aug 2002
Posts: 3234
Location: Gainesville, Florida

PostPosted: Sat Apr 18, 2009 10:51 pm    Post subject: Reply with quote

Dragonlayer fails:
Code:
[ 52%] Building CXX object dragonplayer/src/app/CMakeFiles/dragon.dir/stateChange.o
In file included from /var/tmp/portage/kde-base/dragonplayer-9999/work/dragonplayer-9999/dragonplayer/src/app/stateChange.cpp:38:
/var/tmp/portage/kde-base/dragonplayer-9999/work/dragonplayer-9999/dragonplayer/src/dbus/playerDbusHandler.h:27:29: error: phononnamespace.h: No such file or directory
[ 55%] Building CXX object dragonplayer/src/app/CMakeFiles/dragon.dir/playDialog.o
/var/tmp/portage/kde-base/dragonplayer-9999/work/dragonplayer-9999/dragonplayer/src/app/stateChange.cpp:234: warning: unused parameter 'hasVideo'
make[2]: *** [dragonplayer/src/app/CMakeFiles/dragon.dir/stateChange.o] Error 1
make[2]: *** Waiting for unfinished jobs....
make[1]: *** [dragonplayer/src/app/CMakeFiles/dragon.dir/all] Error 2
make: *** [all] Error 2
 *
 * ERROR: kde-base/dragonplayer-9999 failed.
 * Call stack:
 *               ebuild.sh, line   49:  Called src_compile
 *             environment, line 3804:  Called kde4-meta_src_compile
 *             environment, line 2916:  Called kde4-base_src_compile
 *             environment, line 2649:  Called cmake-utils_src_compile
 *             environment, line  984:  Called cmake-utils_src_make
 *             environment, line 1063:  Called die
 * The specific snippet of code:
 *           emake "$@" || die "Make failed!";

_________________
Main box- AsRock x370 Gaming K4
Ryzen 1700, 3.0GHz, 16GB GSkill Flare DDR4 3200mhz
Samsung SATA 1000GB, Radeon HD R7 350 2GB DDR5
Gentoo ~amd64 plasma, glibc-2.29-r2, gcc-9.1.0 kernel-5.1.12-gentoo USE=experimental
Back to top
View user's profile Send private message
titoucha
Advocate
Advocate


Joined: 21 Jul 2005
Posts: 2374
Location: Genève

PostPosted: Sun Apr 19, 2009 7:25 am    Post subject: Reply with quote

Dolphin 4.2.70 does not compile:
Code:
/dev/shm/portage/kde-base/dolphin-4.2.70/work/dolphin-4.2.70/dolphin/src/panels/information/metadatawidget.cpp:233: erreur: ‘class MetaDataWidget::Private’ has no member named ‘tagWidget’                                                                                                                                                                       
make[2]: *** [dolphin/src/CMakeFiles/dolphin.dir/panels/information/metadatawidget.o] Erreur 1                                                                                   
make[1]: *** [dolphin/src/CMakeFiles/dolphin.dir/all] Erreur 2                                                                                                                   
make: *** [all] Erreur 2                                                                                                                                                         
 *                                                                                                                                                                               
 * ERROR: kde-base/dolphin-4.2.70 failed.                                                                                                                                       
 * Call stack:                                                                                                                                                                   
 *               ebuild.sh, line   49:  Called src_compile                                                                                                                       
 *             environment, line 3799:  Called kde4-meta_src_compile                                                                                                             
 *             environment, line 2915:  Called kde4-base_src_compile                                                                                                             
 *             environment, line 2648:  Called cmake-utils_src_compile                                                                                                           
 *             environment, line  983:  Called cmake-utils_src_make                                                                                                             
 *             environment, line 1062:  Called die                                                                                                                               
 * The specific snippet of code:                                                                                                                                                 
 *           emake "$@" || die "Make failed!";                                                                                                                                   
 *  The die message:                                                                                                                                                             
 *   Make failed!                     

_________________
Assurez-vous que le titre de votre message soit conforme aux conventions de ce forum (paragraphe 3/3 : Comment poster sur le forum ??)
Back to top
View user's profile Send private message
Gambit89
n00b
n00b


Joined: 28 Jan 2009
Posts: 22

PostPosted: Sun Apr 19, 2009 10:06 am    Post subject: Plasmoids not detected Reply with quote

Does anyone have the plasmoids in kde-misc (like customizable-weather, toggle-compositing) working for them? They aren't for me with a kde 4.2.2 +kdeprefix system. They were detected and listed in the "add widgets" menu before, but I think they stopped showing up after the kdeprefix flag was removed for them (which was sometime when the 4.2.2 ebuilds began to show up). They were also working on kde 4.2.1 - does the problem have to do with the missing kdeprefix flag or incompatibility with 4.2.2? or both/neither?
Back to top
View user's profile Send private message
kernelOfTruth
Watchman
Watchman


Joined: 20 Dec 2005
Posts: 6108
Location: Vienna, Austria; Germany; hello world :)

PostPosted: Sun Apr 19, 2009 5:39 pm    Post subject: Reply with quote

strigi seems not being able to be compiled with gcc 4.4*:

Quote:
/var/tmp/portage/app-misc/strigi-9999/work/strigi-9999/src/estraierindexer/estraierindexmanager.cpp: In constructor ‘EstraierIndexManager::EstraierIndexManager(const char*)’:
/var/tmp/portage/app-misc/strigi-9999/work/strigi-9999/src/estraierindexer/estraierindexmanager.cpp:49: error: ‘printf’ was not declared in this scope
/var/tmp/portage/app-misc/strigi-9999/work/strigi-9999/src/estraierindexer/estraierindexmanager.cpp: In member function ‘void EstraierIndexManager::closedb()’:
/var/tmp/portage/app-misc/strigi-9999/work/strigi-9999/src/estraierindexer/estraierindexmanager.cpp:96: error: ‘printf’ was not declared in this scope
/var/tmp/portage/app-misc/strigi-9999/work/strigi-9999/src/estraierindexer/estraierindexmanager.cpp: In function ‘void removefiles(const std::string&, bool)’:
/var/tmp/portage/app-misc/strigi-9999/work/strigi-9999/src/estraierindexer/estraierindexmanager.cpp:104: error: ‘stderr’ was not declared in this scope
/var/tmp/portage/app-misc/strigi-9999/work/strigi-9999/src/estraierindexer/estraierindexmanager.cpp:104: error: ‘fprintf’ was not declared in this scope
/var/tmp/portage/app-misc/strigi-9999/work/strigi-9999/src/estraierindexer/estraierindexmanager.cpp:131: error: ‘stderr’ was not declared in this scope
/var/tmp/portage/app-misc/strigi-9999/work/strigi-9999/src/estraierindexer/estraierindexmanager.cpp:131: error: ‘fprintf’ was not declared in this scope
/var/tmp/portage/app-misc/strigi-9999/work/strigi-9999/src/estraierindexer/estraierindexmanager.cpp: In member function ‘void EstraierIndexManager::deleteIndex()’:
/var/tmp/portage/app-misc/strigi-9999/work/strigi-9999/src/estraierindexer/estraierindexmanager.cpp:150: error: ‘printf’ was not declared in this scope
cc1plus: note: -freorder-blocks-and-partition does not work with exceptions
/var/tmp/portage/app-misc/strigi-9999/work/strigi-9999/src/estraierindexer/estraierindexreader.cpp:1: warning: this target does not support ‘-fsection-anchors’
make[2]: *** [src/estraierindexer/CMakeFiles/estraier.dir/estraierindexmanager.cpp.o] Error 1
make[2]: *** Waiting for unfinished jobs....
cc1plus: note: -freorder-blocks-and-partition does not work with exceptions
/var/tmp/portage/app-misc/strigi-9999/work/strigi-9999/src/streams/arinputstream.cpp:1: warning: this target does not support ‘-fsection-anchors’
Scanning dependencies of target searchclient
[ 4%] /var/tmp/portage/app-misc/strigi-9999/work/strigi-9999/src/estraierindexer/estraierindexreader.cpp: In member function ‘virtual int32_t EstraierIndexReader::countHits(const Strigi::Query&)’:
/var/tmp/portage/app-misc/strigi-9999/work/strigi-9999/src/estraierindexer/estraierindexreader.cpp:132: error: ‘stderr’ was not declared in this scope
/var/tmp/portage/app-misc/strigi-9999/work/strigi-9999/src/estraierindexer/estraierindexreader.cpp:132: error: ‘fprintf’ was not declared in this scope
Building CXX object src/daemon/CMakeFiles/searchclient.dir/socketclient.cpp.o
make[2]: *** [src/estraierindexer/CMakeFiles/estraier.dir/estraierindexreader.cpp.o] Error 1
make[1]: *** [src/estraierindexer/CMakeFiles/estraier.dir/all] Error 2
make[1]: *** Waiting for unfinished jobs....
[ 4%] cc1plus: note: -freorder-blocks-and-partition does not work with exceptions
/var/tmp/portage/app-misc/strigi-9999/work/strigi-9999/src/daemon/socketclient.cpp:1: warning: this target does not support ‘-fsection-anchors’
Building CXX object src/daemon/CMakeFiles/searchclient.dir/asyncsocket.cpp.o
cc1plus: note: -freorder-blocks-and-partition does not work with exceptions
[ 5%] /var/tmp/portage/app-misc/strigi-9999/work/strigi-9999/src/daemon/asyncsocket.cpp:1: warning: this target does not support ‘-fsection-anchors’
Building CXX object src/streams/CMakeFiles/streams.dir/base64inputstream.cpp.o
cc1plus: note: -freorder-blocks-and-partition does not work with exceptions
/var/tmp/portage/app-misc/strigi-9999/work/strigi-9999/src/streams/base64inputstream.cpp:1: warning: this target does not support ‘-fsection-anchors’
[ 6%] Building CXX object src/daemon/CMakeFiles/searchclient.dir/asyncsocketclient.cpp.o
cc1plus: note: -freorder-blocks-and-partition does not work with exceptions
/var/tmp/portage/app-misc/strigi-9999/work/strigi-9999/src/daemon/asyncsocketclient.cpp:1: warning: this target does not support ‘-fsection-anchors’
[ 6%] Building CXX object src/streams/CMakeFiles/streams.dir/bz2inputstream.cpp.o
cc1plus: note: -freorder-blocks-and-partition does not work with exceptions
/var/tmp/portage/app-misc/strigi-9999/work/strigi-9999/src/streams/bz2inputstream.cpp:1: warning: this target does not support ‘-fsection-anchors’
[ 6%] Building CXX object src/streams/CMakeFiles/streams.dir/cpioinputstream.cpp.o
cc1plus: note: -freorder-blocks-and-partition does not work with exceptions
/var/tmp/portage/app-misc/strigi-9999/work/strigi-9999/src/streams/cpioinputstream.cpp:1: warning: this target does not support ‘-fsection-anchors’
[ 7%] Building CXX object src/streams/CMakeFiles/streams.dir/dataeventinputstream.cpp.o
cc1plus: note: -freorder-blocks-and-partition does not work with exceptions
/var/tmp/portage/app-misc/strigi-9999/work/strigi-9999/src/streams/dataeventinputstream.cpp:1: warning: this target does not support ‘-fsection-anchors’
[ 7%] [ 7%] Building CXX object src/streams/CMakeFiles/streams.dir/dostime.cpp.o
Building CXX object src/streams/CMakeFiles/streams.dir/encodinginputstream.cpp.o
cc1plus: note: -freorder-blocks-and-partition does not work with exceptions
/var/tmp/portage/app-misc/strigi-9999/work/strigi-9999/src/streams/dostime.cpp:1: warning: this target does not support ‘-fsection-anchors’
cc1plus: note: -freorder-blocks-and-partition does not work with exceptions
/var/tmp/portage/app-misc/strigi-9999/work/strigi-9999/src/streams/encodinginputstream.cpp:1: warning: this target does not support ‘-fsection-anchors’
[ 8%] Building CXX object src/streams/CMakeFiles/streams.dir/fileinputstream.cpp.o
cc1plus: note: -freorder-blocks-and-partition does not work with exceptions
/var/tmp/portage/app-misc/strigi-9999/work/strigi-9999/src/streams/fileinputstream.cpp:1: warning: this target does not support ‘-fsection-anchors’
[ 8%] Building CXX object src/streams/CMakeFiles/streams.dir/filestreamopener.cpp.o
cc1plus: note: -freorder-blocks-and-partition does not work with exceptions
/var/tmp/portage/app-misc/strigi-9999/work/strigi-9999/src/streams/filestreamopener.cpp:1: warning: this target does not support ‘-fsection-anchors’
[ 8%] Building CXX object src/streams/CMakeFiles/streams.dir/gzipcompressstream.cpp.o
cc1plus: note: -freorder-blocks-and-partition does not work with exceptions
/var/tmp/portage/app-misc/strigi-9999/work/strigi-9999/src/streams/gzipcompressstream.cpp:1: warning: this target does not support ‘-fsection-anchors’
[ 9%] Building CXX object src/streams/CMakeFiles/streams.dir/gzipinputstream.cpp.o
cc1plus: note: -freorder-blocks-and-partition does not work with exceptions
/var/tmp/portage/app-misc/strigi-9999/work/strigi-9999/src/streams/gzipinputstream.cpp:1: warning: this target does not support ‘-fsection-anchors’
[ 9%] Linking CXX shared library libsearchclient.so
Building CXX object src/streams/CMakeFiles/streams.dir/inputstreamreader.cpp.o
[ 9%] cc1plus: note: -freorder-blocks-and-partition does not work with exceptions
/var/tmp/portage/app-misc/strigi-9999/work/strigi-9999/src/streams/inputstreamreader.cpp:1: warning: this target does not support ‘-fsection-anchors’
Building CXX object src/streams/CMakeFiles/streams.dir/kmpsearcher.cpp.o
cc1plus: note: -freorder-blocks-and-partition does not work with exceptions
/var/tmp/portage/app-misc/strigi-9999/work/strigi-9999/src/streams/kmpsearcher.cpp:1: warning: this target does not support ‘-fsection-anchors’
[ 9%] Built target searchclient
[ 10%] Building C object src/streams/CMakeFiles/streams.dir/lzma/LzmaDec.c.o
/var/tmp/portage/app-misc/strigi-9999/work/strigi-9999/src/streams/lzma/LzmaDec.c:1: warning: this target does not support ‘-fsection-anchors’
[ 10%] Building CXX object src/streams/CMakeFiles/streams.dir/lzmainputstream.cpp.o
[ 10%] cc1plus: note: -freorder-blocks-and-partition does not work with exceptions
/var/tmp/portage/app-misc/strigi-9999/work/strigi-9999/src/streams/lzmainputstream.cpp:1: warning: this target does not support ‘-fsection-anchors’
Building CXX object src/streams/CMakeFiles/streams.dir/mailinputstream.cpp.o
cc1plus: note: -freorder-blocks-and-partition does not work with exceptions
/var/tmp/portage/app-misc/strigi-9999/work/strigi-9999/src/streams/mailinputstream.cpp:1: warning: this target does not support ‘-fsection-anchors’
[ 11%] Building CXX object src/streams/CMakeFiles/streams.dir/oleinputstream.cpp.o
cc1plus: note: -freorder-blocks-and-partition does not work with exceptions
/var/tmp/portage/app-misc/strigi-9999/work/strigi-9999/src/streams/oleinputstream.cpp:1: warning: this target does not support ‘-fsection-anchors’
[ 11%] Building CXX object src/streams/CMakeFiles/streams.dir/rpminputstream.cpp.o
/var/tmp/portage/app-misc/strigi-9999/work/strigi-9999/src/streams/lzmainputstream.cpp: In member function ‘int32_t Strigi::LZMAInputStream::Private::fillBuffer(char*, int32_t)’:
/var/tmp/portage/app-misc/strigi-9999/work/strigi-9999/src/streams/lzmainputstream.cpp:141: warning: comparison between signed and unsigned integer expressions
cc1plus: note: -freorder-blocks-and-partition does not work with exceptions
/var/tmp/portage/app-misc/strigi-9999/work/strigi-9999/src/streams/rpminputstream.cpp:1: warning: this target does not support ‘-fsection-anchors’
[ 12%] Building CXX object src/streams/CMakeFiles/streams.dir/sdfinputstream.cpp.o
cc1plus: note: -freorder-blocks-and-partition does not work with exceptions
/var/tmp/portage/app-misc/strigi-9999/work/strigi-9999/src/streams/sdfinputstream.cpp:1: warning: this target does not support ‘-fsection-anchors’
[ 12%] Building CXX object src/streams/CMakeFiles/streams.dir/stringterminatedsubstream.cpp.o
cc1plus: note: -freorder-blocks-and-partition does not work with exceptions
/var/tmp/portage/app-misc/strigi-9999/work/strigi-9999/src/streams/stringterminatedsubstream.cpp:1: warning: this target does not support ‘-fsection-anchors’
[ 12%] Building CXX object src/streams/CMakeFiles/streams.dir/subinputstream.cpp.o
cc1plus: note: -freorder-blocks-and-partition does not work with exceptions
/var/tmp/portage/app-misc/strigi-9999/work/strigi-9999/src/streams/subinputstream.cpp:1: warning: this target does not support ‘-fsection-anchors’
[ 13%] Building CXX object src/streams/CMakeFiles/streams.dir/substreamproviderprovider.cpp.o
cc1plus: note: -freorder-blocks-and-partition does not work with exceptions
/var/tmp/portage/app-misc/strigi-9999/work/strigi-9999/src/streams/substreamproviderprovider.cpp:1: warning: this target does not support ‘-fsection-anchors’
[ 13%] Building CXX object src/streams/CMakeFiles/streams.dir/tarinputstream.cpp.o
cc1plus: note: -freorder-blocks-and-partition does not work with exceptions
/var/tmp/portage/app-misc/strigi-9999/work/strigi-9999/src/streams/tarinputstream.cpp:1: warning: this target does not support ‘-fsection-anchors’
[ 13%] Building CXX object src/streams/CMakeFiles/streams.dir/textutils.cpp.o
cc1plus: note: -freorder-blocks-and-partition does not work with exceptions
/var/tmp/portage/app-misc/strigi-9999/work/strigi-9999/src/streams/textutils.cpp:1: warning: this target does not support ‘-fsection-anchors’
[ 14%] [ 14%] Building CXX object src/streams/CMakeFiles/streams.dir/zipinputstream.cpp.o
Building CXX object src/streams/CMakeFiles/streams.dir/processinputstream.cpp.o
cc1plus: note: -freorder-blocks-and-partition does not work with exceptions
/var/tmp/portage/app-misc/strigi-9999/work/strigi-9999/src/streams/zipinputstream.cpp:1: warning: this target does not support ‘-fsection-anchors’
cc1plus: note: -freorder-blocks-and-partition does not work with exceptions
/var/tmp/portage/app-misc/strigi-9999/work/strigi-9999/src/streams/processinputstream.cpp:1: warning: this target does not support ‘-fsection-anchors’
[ 14%] Building CXX object src/streams/CMakeFiles/streams.dir/strigi/compat.cpp.o
cc1plus: note: -freorder-blocks-and-partition does not work with exceptions
/var/tmp/portage/app-misc/strigi-9999/work/strigi-9999/src/streams/strigi/compat.cpp:1: warning: this target does not support ‘-fsection-anchors’
[ 15%] Building CXX object src/streams/CMakeFiles/streams.dir/strigi/fnmatch.cpp.o
cc1plus: note: -freorder-blocks-and-partition does not work with exceptions
/var/tmp/portage/app-misc/strigi-9999/work/strigi-9999/src/streams/strigi/fnmatch.cpp:1: warning: this target does not support ‘-fsection-anchors’
[ 15%] Building CXX object src/streams/CMakeFiles/streams.dir/strigi/stgdirent.cpp.o
cc1plus: note: -freorder-blocks-and-partition does not work with exceptions
/var/tmp/portage/app-misc/strigi-9999/work/strigi-9999/src/streams/strigi/stgdirent.cpp:1: warning: this target does not support ‘-fsection-anchors’
Linking CXX shared library libstreams.so
[ 15%] Built target streams
make: *** [all] Error 2
*
* ERROR: app-misc/strigi-9999 failed.
* Call stack:
* ebuild.sh, line 49: Called src_compile
* environment, line 2893: Called cmake-utils_src_compile
* environment, line 799: Called cmake-utils_src_make
* environment, line 878: Called die
* The specific snippet of code:
* emake "$@" || die "Make failed!";
* The die message:
* Make failed!

_________________
https://github.com/kernelOfTruth/ZFS-for-SystemRescueCD/tree/ZFS-for-SysRescCD-4.9.0
https://github.com/kernelOfTruth/pulseaudio-equalizer-ladspa

Hardcore Gentoo Linux user since 2004 :D
Back to top
View user's profile Send private message
Krog
Guru
Guru


Joined: 26 Jun 2007
Posts: 330
Location: Roma, Italy

PostPosted: Sun Apr 19, 2009 7:39 pm    Post subject: Reply with quote

kde-base/kdepimlibs-4.2.70 does'nt compile for me!

Code:
[ 16%] Built target kmime                                                                                             
[ 18%] Building CXX object akonadi/CMakeFiles/akonadi-kde.dir/cachepolicypage.o                                       
[ 18%] Building CXX object akonadi/CMakeFiles/akonadi-kde.dir/changerecorder.o                                       
[ 18%] Building CXX object akonadi/CMakeFiles/akonadi-kde.dir/collection.o                                           
[ 18%] Building CXX object akonadi/CMakeFiles/akonadi-kde.dir/collectioncopyjob.o                                     
[ 18%] Building CXX object akonadi/CMakeFiles/akonadi-kde.dir/collectioncreatejob.o                                   
[ 18%] Building CXX object akonadi/CMakeFiles/akonadi-kde.dir/collectiondeletejob.o                                   
[ 18%] Building CXX object akonadi/CMakeFiles/akonadi-kde.dir/collectiondialog.o                                     
[ 19%] Building CXX object akonadi/CMakeFiles/akonadi-kde.dir/collectionfilterproxymodel.o                           
[ 19%] Building CXX object akonadi/CMakeFiles/akonadi-kde.dir/collectiongeneralpropertiespage.o                       
[ 19%] Building CXX object akonadi/CMakeFiles/akonadi-kde.dir/collectionfetchjob.o                                   
/var/tmp/portage/kde-base/kdepimlibs-4.2.70/work/kdepimlibs-4.2.70/akonadi/collectionfetchjob.cpp: In member function ‘virtual void Akonadi::CollectionFetchJob::doStart()’:                                                               
/var/tmp/portage/kde-base/kdepimlibs-4.2.70/work/kdepimlibs-4.2.70/akonadi/collectionfetchjob.cpp:134: error: expected `;' before ‘AKONADI_CMD_RID’                                                                                         
make[2]: *** [akonadi/CMakeFiles/akonadi-kde.dir/collectionfetchjob.o] Error 1                                       
make[2]: *** Waiting for unfinished jobs....                                                                         
[ 19%] Generating kresourcesmanageradaptor.cpp, kresourcesmanageradaptor.h                                           
[ 19%] Generating kresourcesmanageradaptor.moc                                                                       
Scanning dependencies of target kresources                                                                           
make[1]: *** [akonadi/CMakeFiles/akonadi-kde.dir/all] Error 2                                                         
make[1]: *** Waiting for unfinished jobs....                                                                         
[ 19%] Building CXX object kresources/CMakeFiles/kresources.dir/kresources_automoc.o                                 
[ 19%] [ 19%] Building CXX object kresources/CMakeFiles/kresources.dir/resource.o                                     
Building CXX object kresources/CMakeFiles/kresources.dir/factory.o                                                   
[ 19%] Building CXX object kresources/CMakeFiles/kresources.dir/managerimpl.o                                         
[ 19%] Building CXX object kresources/CMakeFiles/kresources.dir/configwidget.o                                       
[ 19%] Building CXX object kresources/CMakeFiles/kresources.dir/configdialog.o                                       
[ 20%] Building CXX object kresources/CMakeFiles/kresources.dir/selectdialog.o                                       
[ 20%] Building CXX object kresources/CMakeFiles/kresources.dir/configpage.o                                         
[ 20%] Building CXX object kresources/CMakeFiles/kresources.dir/idmapper.o                                           
[ 20%] Building CXX object kresources/CMakeFiles/kresources.dir/kresourcesmanageradaptor.o                           
Linking CXX shared library ../lib/libkresources.so                                                                   
[ 20%] Built target kresources                                                                                       
make: *** [all] Error 2                                                                                               
 *                                                                                                                   
 * ERROR: kde-base/kdepimlibs-4.2.70 failed.                                                                         
 * Call stack:                                                                                                       
 *               ebuild.sh, line   49:  Called src_compile                                                           
 *             environment, line 3185:  Called kde4-base_src_compile                                                 
 *             environment, line 2384:  Called cmake-utils_src_compile                                               
 *             environment, line  829:  Called cmake-utils_src_make                                                   
 *             environment, line  908:  Called die                                                                   
 * The specific snippet of code:                                                                                     
 *           emake "$@" || die "Make failed!";                                                                       
 *  The die message:                                                                                                 
 *   Make failed!
Back to top
View user's profile Send private message
Display posts from previous:   
This topic is locked: you cannot edit posts or make replies.    Gentoo Forums Forum Index Unsupported Software All times are GMT
Goto page Previous  1, 2, 3 ... 28, 29, 30 ... 38, 39, 40  Next
Page 29 of 40

 
Jump to:  
You cannot post new topics in this forum
You cannot reply to topics in this forum
You cannot edit your posts in this forum
You cannot delete your posts in this forum
You cannot vote in polls in this forum