Gentoo Forums
Gentoo Forums
Gentoo Forums
Quick Search: in
[solved] Problem building mozilla-firefox-3.5_beta4
View unanswered posts
View posts from last 24 hours

 
Reply to topic    Gentoo Forums Forum Index Unsupported Software
View previous topic :: View next topic  
Author Message
laughinggnome
n00b
n00b


Joined: 07 Mar 2006
Posts: 45

PostPosted: Thu Apr 30, 2009 12:49 am    Post subject: [solved] Problem building mozilla-firefox-3.5_beta4 Reply with quote

I get the following error trying to build mozilla-firefox-3.5_beta4 from the Mozilla overlay:

Code:
x86_64-pc-linux-gnu-g++ -DARON_WAS_HERE  -fno-rtti -fno-handle-exceptions -Wall -Wpointer-arith -Woverloaded-virtual -Wsynth -Wno-ctor-dtor-privacy -Wno-non-virtual-dtor -Wcast-align -Wno-invalid-offsetof -Wno-long-long -march=core2 -pipe -fPIC -Wno-return-type -w -fno-strict-aliasing -fshort-wchar -pthread -pipe  -DNDEBUG -DTRIMMED -Os -freorder-blocks -fno-reorder-functions  -fPIC -shared -Wl,-z,defs -Wl,-h,libbrowsercomps.so -o libbrowsercomps.so  nsModule.o     -lpthread -Wl,-O1 -Wl,--sort-common -Wl,--as-needed -Wl,--hash-style=gnu  -Wl,-rpath-link,/usr/lib64/xulrunner-devel-1.9.1/bin -Wl,-rpath-link,/usr/lib  -Wl,--whole-archive ../feeds/src/libbrowser_feeds_s.a ../places/src/libbrowserplaces_s.a ../privatebrowsing/src/libprivatebrowsing_s.a  ../shell/src/libshellservice_s.a ../migration/src/libmigration_s.a -Wl,--no-whole-archive -L/usr/lib64/xulrunner-devel-1.9.1/lib -lunicharutil_external_s /usr/lib64/xulrunner-devel-1.9.1/lib/libxpcomglue_s.a -L/usr/lib64/xulrunner-devel-1.9.1/bin -lxpcom -lxul  -L/usr/lib64/xulrunner-devel-1.9.1/bin -Wl,-R/usr/lib64/nspr -L/usr/lib64/nspr -lplds4 -lplc4 -lnspr4 -lpthread -ldl  /usr/lib64/xulrunner-devel-1.9.1/lib/libmozreg_s.a -lgtk-x11-2.0 -latk-1.0 -lgio-2.0 -lpangoft2-1.0 -lfreetype -lfontconfig -lgdk-x11-2.0 -lgdk_pixbuf-2.0 -lpangocairo-1.0 -lpango-1.0 -lcairo -lgobject-2.0 -lgmodule-2.0 -lglib-2.0   -lstartup-notification-1    -Wl,--version-script -Wl,../../../build/unix/gnu-ld-scripts/components-version-script -Wl,-Bsymbolic -lasound -ldl -lm                                                                                                     
/usr/lib64/xulrunner-devel-1.9.1/lib/libmozreg_s.a(reg.o): In function `nr_ReplaceName':                                                                                           
(.text+0x882): undefined reference to `PL_strlen'                                                                                                                                   
/usr/lib64/xulrunner-devel-1.9.1/lib/libmozreg_s.a(reg.o): In function `nr_AppendName':                                                                                             
(.text+0xa7c): undefined reference to `PL_strlen'                                                                                                                                   
/usr/lib64/xulrunner-devel-1.9.1/lib/libmozreg_s.a(reg.o): In function `nr_CatName':                                                                                               
(.text+0xb06): undefined reference to `PL_strlen'                                                                                                                                   
/usr/lib64/xulrunner-devel-1.9.1/lib/libmozreg_s.a(reg.o): In function `nr_FindAtLevel':                                                                                           
(.text+0xc22): undefined reference to `PL_strcmp'                                                                                                                                   
/usr/lib64/xulrunner-devel-1.9.1/lib/libmozreg_s.a(reg.o): In function `nr_TranslateKey':                                                                                           
(.text+0x117b): undefined reference to `PL_strcmp'                                                                                                                                 
/usr/lib64/xulrunner-devel-1.9.1/lib/libmozreg_s.a(reg.o): In function `NR_RegEnumSubkeys':                                                                                         
(.text+0x13b7): undefined reference to `PL_strlen'                                                                                                                                 
/usr/lib64/xulrunner-devel-1.9.1/lib/libmozreg_s.a(reg.o): In function `NR_RegEnumSubkeys':                                                                                         
(.text+0x1455): undefined reference to `PL_strlen'                                                                                                                                 
/usr/lib64/xulrunner-devel-1.9.1/lib/libmozreg_s.a(reg.o): In function `NR_RegSetUsername':                                                                                         
(.text+0x1db5): undefined reference to `PL_strdup'                                                                                                                                 
/usr/lib64/xulrunner-devel-1.9.1/lib/libmozreg_s.a(reg.o): In function `NR_RegGetUsername':                                                                                         
(.text+0x1e1e): undefined reference to `PL_strdup'                                                                                                                                 
/usr/lib64/xulrunner-devel-1.9.1/lib/libmozreg_s.a(reg.o): In function `NR_RegOpen':                                                                                               

....

(.text+0xea): undefined reference to `PL_strdup'                                                                                                                                   
/usr/lib64/xulrunner-devel-1.9.1/lib/libmozreg_s.a(vr_stubs.o): In function `vr_findGlobalRegName':
(.text+0x108): undefined reference to `PL_strdup'
collect2: ld returned 1 exit status
gmake[5]: *** [libbrowsercomps.so] Error 1
gmake[5]: Leaving directory `/var/tmp/portage/www-client/mozilla-firefox-3.5_beta4/work/mozilla-1.9.1/browser/components/build'
gmake[4]: *** [libs] Error 2
gmake[4]: Leaving directory `/var/tmp/portage/www-client/mozilla-firefox-3.5_beta4/work/mozilla-1.9.1/browser/components'
gmake[3]: *** [libs] Error 2
gmake[3]: Leaving directory `/var/tmp/portage/www-client/mozilla-firefox-3.5_beta4/work/mozilla-1.9.1/browser'
gmake[2]: *** [libs_tier_app] Error 2
gmake[2]: Leaving directory `/var/tmp/portage/www-client/mozilla-firefox-3.5_beta4/work/mozilla-1.9.1'
gmake[1]: *** [tier_app] Error 2
gmake[1]: Leaving directory `/var/tmp/portage/www-client/mozilla-firefox-3.5_beta4/work/mozilla-1.9.1'
make: *** [default] Error 2


This is with the 'xulrunner' use-flag, but I get similar errors without. Beta 3 built fine.

Cheers.


Last edited by laughinggnome on Thu Apr 30, 2009 4:09 pm; edited 1 time in total
Back to top
View user's profile Send private message
loftwyr
l33t
l33t


Joined: 29 Dec 2004
Posts: 970
Location: 43°38'23.62"N 79°27'8.60"W

PostPosted: Thu Apr 30, 2009 1:36 am    Post subject: Reply with quote

Can you show us the output from emerge --info please?
_________________
My emerge --info
Have you run revdep-rebuild lately? It's in gentoolkit and it's worth a shot if things don't work well.
Celebrating 5 years of Gentoo-ing.
Back to top
View user's profile Send private message
Need4Speed
Guru
Guru


Joined: 06 Jun 2004
Posts: 497

PostPosted: Thu Apr 30, 2009 2:18 am    Post subject: Reply with quote

I just tried building it and ran into the same problem.

Code:
gentoo / # paludis --info

paludis 0.36.0                                                                                                                     
Paludis build information:                                                                                                         
    Compiler:                                                                                                                       
        CXX:                   x86_64-pc-linux-gnu-g++ 4.3.3                                                                       
        CXXFLAGS:               -march=core2 -O2 -O3 -pipe -fomit-frame-pointer -frename-registers -ftree-vectorize                 
        LDFLAGS:               -Wl,-O1 -Wl,--sort-common -s -Wl,--as-needed                                                         
        DATE:                  2009-03-15T14:00:42-0400


Code:
gentoo / # paludis -ip mozilla-firefox

Building dependency list...

These packages will be installed:

* net-libs/xulrunner::mozilla :1.9 [U 1.9.1_beta3-r1 -> 1.9.1_beta4]
    Reasons: *www-client/mozilla-firefox-3.5_beta4:0::mozilla, dev-java/icedtea6-1.4.1-r1:0::installed
    custom-optimization dbus -gnome java -python -startup-notification build_options: -optional_tests split strip
* www-client/mozilla-firefox::mozilla [U 3.1_beta3 -> 3.5_beta4] <target>                                       
    -bindist custom-optimization dbus -gnome -iceweasel java -mozdevelop -restrict-javascript -startup-notification xulrunner LINGUAS:-af -ar -be -bg -bn -bn_IN -ca -cs -da -de -el en -en_GB en_US -eo -es -es_AR -es_ES -et -eu -fa -fi -fr -fy -fy_NL -ga -ga_IE -gl -gu-gu_IN -he -hi -hi_IN -hu -id -is -it -ja -kn -ko -ku -lt -lv -mk -mn -mr -nb -nb_NO -nl -nn -nn_NO -oc -pa -pa_IN -pl -pt -pt_BR -pt_PT -ro -ru -si -sk -sl -sq -sr -sv -sv_SE -te -th -tr -uk -vi -zh -zh_CN -zh_TW build_options: -optional_tests split strip

_________________
2.6.34-rc3 on x86_64 w/ paludis
WM: ratpoison
Term: urxvt, zsh
Browser: uzbl
Email: mutt, offlineimap
IRC: weechat
News: newsbeuter
PDF: apvlv
Back to top
View user's profile Send private message
scary
n00b
n00b


Joined: 17 Apr 2004
Posts: 47

PostPosted: Thu Apr 30, 2009 6:48 am    Post subject: Reply with quote

Removing the --as-needed LDFLAG when building mozilla-firefox solved the problem for me :)

Last edited by scary on Thu Apr 30, 2009 7:20 am; edited 2 times in total
Back to top
View user's profile Send private message
jcornez
Apprentice
Apprentice


Joined: 12 Jan 2006
Posts: 201
Location: Spain

PostPosted: Thu Apr 30, 2009 6:57 am    Post subject: Reply with quote

https://bugs.gentoo.org/show_bug.cgi?id=267815#c3
Back to top
View user's profile Send private message
kernelOfTruth
Watchman
Watchman


Joined: 20 Dec 2005
Posts: 6108
Location: Vienna, Austria; Germany; hello world :)

PostPosted: Thu Apr 30, 2009 7:56 am    Post subject: Reply with quote

Quote:
gmake[6]: Leaving directory `/var/tmp/portage/www-client/mozilla-firefox-3.5_beta4/work/mozilla-1.9.1/browser/components/migration/src'
/usr/bin/python ../../../config/JarMaker.py \
-j ../../../dist/bin/chrome \
-t ../../.. -f jar -DNDEBUG -DTRIMMED -DOSTYPE=\"Linux2.6\" -DOSARCH=Linux -DHAVE_64BIT_OS=1 -DMOZILLA_VERSION=\"1.9.1b4\" -DMOZILLA_VERSION_U=1.9.1b4 -DD_INO=d_ino -DSTDC_HEADERS=1 -DHAVE_ST_BLKSIZE=1 -DHAVE_SIGINFO_T=1 -DHAVE_INT16_T=1 -DHAVE_INT32_T=1 -DHAVE_INT64_T=1 -DHAVE_UINT=1 -DHAVE_UNAME_DOMAINNAME_FIELD=1 -DHAVE_VISIBILITY_HIDDEN_ATTRIBUTE=1 -DHAVE_VISIBILITY_ATTRIBUTE=1 -DHAVE_DIRENT_H=1 -DHAVE_GETOPT_H=1 -DHAVE_SYS_BITYPES_H=1 -DHAVE_MEMORY_H=1 -DHAVE_UNISTD_H=1 -DHAVE_GNU_LIBC_VERSION_H=1 -DHAVE_NL_TYPES_H=1 -DHAVE_MALLOC_H=1 -DHAVE_X11_XKBLIB_H=1 -DHAVE_SYS_STATVFS_H=1 -DHAVE_SYS_STATFS_H=1 -DHAVE_MMINTRIN_H=1 -DHAVE_SYS_CDEFS_H=1 -DHAVE_LIBM=1 -DHAVE_LIBDL=1 -DHAVE_DLADDR=1 -DFUNCPROTO=15 -DHAVE_XSHM=1 -DHAVE_FT_BITMAP_SIZE_Y_PPEM=1 -DHAVE_FT_GLYPHSLOT_EMBOLDEN=1 -DHAVE_FT_LOAD_SFNT_TABLE=1 -DHAVE_FT_SELECT_SIZE=1 -D_REENTRANT=1 -DHAVE_RANDOM=1 -DHAVE_STRERROR=1 -DHAVE_LCHOWN=1 -DHAVE_FCHMOD=1 -DHAVE_SNPRINTF=1 -DHAVE_MEMMOVE=1 -DHAVE_RINT=1 -DHAVE_STAT64=1 -DHAVE_LSTAT64=1 -DHAVE_TRUNCATE64=1 -DHAVE_FLOCKFILE=1 -DHAVE_LOCALTIME_R=1 -DHAVE_STRTOK_R=1 -DHAVE_RES_NINIT=1 -DHAVE_GNU_GET_LIBC_VERSION=1 -DHAVE_LANGINFO_CODESET=1 -DVA_COPY=va_copy -DHAVE_VA_COPY=1 -DHAVE_VA_LIST_AS_ARRAY=1 -DHAVE_I18N_LC_MESSAGES=1 -DMOZ_EMBEDDING_LEVEL_DEFAULT=1 -DMOZ_EMBEDDING_LEVEL_BASIC=1 -DMOZ_EMBEDDING_LEVEL_MINIMAL=1 -DMOZ_PHOENIX=1 -DMOZ_BUILD_APP=browser -DMOZ_XUL_APP=1 -DMOZ_DEFAULT_TOOLKIT=\"cairo-gtk2\" -DMOZ_X11=1 -DMOZ_WIDGET_GTK2=1 -DMOZ_ENABLE_XREMOTE=1 -DMOZ_ENABLE_STARTUP_NOTIFICATION=1 -DMOZ_DISTRIBUTION_ID=\"org.gentoo\" -DMOZ_PANGO=1 -DMOZ_ENABLE_GCONF=1 -DMOZ_ENABLE_GNOMEUI=1 -DMOZ_ENABLE_DBUS=1 -DOJI=1 -DIBMBIDI=1 -DMOZ_VIEW_SOURCE=1 -DACCESSIBILITY=1 -DMOZ_XPINSTALL=1 -DMOZ_JSLOADER=1 -DNS_PRINTING=1 -DNS_PRINT_PREVIEW=1 -DMOZ_NO_XPCOM_OBSOLETE=1 -DMOZ_OGG=1 -DATTRIBUTE_ALIGNED_MAX=64 -DMOZ_WAVE=1 -DMOZ_SYDNEYAUDIO=1 -DMOZ_MEDIA=1 -DHAVE_LIBASOUND=1 -DMOZ_XTF=1 -DMOZ_CRASHREPORTER_ENABLE_PERCENT=100 -DMOZ_MATHML=1 -DMOZ_ENABLE_CANVAS=1 -DMOZ_SVG=1 -DMOZ_UPDATE_CHANNEL=default -DMOZ_PLACES=1 -DMOZ_FEEDS=1 -DMOZ_STORAGE=1 -DMOZ_SAFE_BROWSING=1 -DMOZ_URL_CLASSIFIER=1 -DMOZ_LOGGING=1 -DSIZEOF_INT_P=8 -DMOZ_MEMORY_SIZEOF_PTR_2POW=3 -DMOZ_MEMORY=1 -DMOZ_MEMORY_LINUX=1 -DHAVE___CXA_DEMANGLE=1 -DHAVE__UNWIND_BACKTRACE=1 -DMOZ_DEFAULT_MOZILLA_FIVE_HOME=\"/usr/lib64/mozilla-firefox\" -DMOZ_USER_DIR=\".mozilla\" -DMOZ_ENABLE_LIBXUL=1 -DHAVE_STDINT_H=1 -DHAVE_INTTYPES_H=1 -DMOZ_XUL=1 -DMOZ_RDF=1 -DMOZ_MORKREADER=1 -DMOZ_DLL_SUFFIX=\".so\" -DXP_UNIX=1 -DUNIX_ASYNC_DNS=1 -DMOZ_ACCESSIBILITY_ATK=1 -DATK_MAJOR_VERSION=1 -DATK_MINOR_VERSION=26 -DATK_REV_VERSION=0 \
./jar.mn
processing ./jar.mn
gmake[5]: Leaving directory `/var/tmp/portage/www-client/mozilla-firefox-3.5_beta4/work/mozilla-1.9.1/browser/components/migration'
gmake[5]: Entering directory `/var/tmp/portage/www-client/mozilla-firefox-3.5_beta4/work/mozilla-1.9.1/browser/components/safebrowsing'
gmake[6]: Entering directory `/var/tmp/portage/www-client/mozilla-firefox-3.5_beta4/work/mozilla-1.9.1/browser/components/safebrowsing/src'
gmake[6]: Nothing to be done for `libs'.
gmake[6]: Leaving directory `/var/tmp/portage/www-client/mozilla-firefox-3.5_beta4/work/mozilla-1.9.1/browser/components/safebrowsing/src'
set -e; \
/var/tmp/portage/www-client/mozilla-firefox-3.5_beta4/work/mozilla-1.9.1/config/nsinstall -D ../../../dist/bin/components; \
for i in src/nsSafebrowsingApplication.js; do \
dest=../../../dist/bin/components/`basename $i`; \
rm -f -f $dest; \
/usr/bin/python ../../../config/Preprocessor.py -DOFFICIAL_BUILD=1 -DOSTYPE=\"Linux2.6\" -DOSARCH=Linux -DHAVE_64BIT_OS=1 -DMOZILLA_VERSION=\"1.9.1b4\" -DMOZILLA_VERSION_U=1.9.1b4 -DD_INO=d_ino -DSTDC_HEADERS=1 -DHAVE_ST_BLKSIZE=1 -DHAVE_SIGINFO_T=1 -DHAVE_INT16_T=1 -DHAVE_INT32_T=1 -DHAVE_INT64_T=1 -DHAVE_UINT=1 -DHAVE_UNAME_DOMAINNAME_FIELD=1 -DHAVE_VISIBILITY_HIDDEN_ATTRIBUTE=1 -DHAVE_VISIBILITY_ATTRIBUTE=1 -DHAVE_DIRENT_H=1 -DHAVE_GETOPT_H=1 -DHAVE_SYS_BITYPES_H=1 -DHAVE_MEMORY_H=1 -DHAVE_UNISTD_H=1 -DHAVE_GNU_LIBC_VERSION_H=1 -DHAVE_NL_TYPES_H=1 -DHAVE_MALLOC_H=1 -DHAVE_X11_XKBLIB_H=1 -DHAVE_SYS_STATVFS_H=1 -DHAVE_SYS_STATFS_H=1 -DHAVE_MMINTRIN_H=1 -DHAVE_SYS_CDEFS_H=1 -DHAVE_LIBM=1 -DHAVE_LIBDL=1 -DHAVE_DLADDR=1 -DFUNCPROTO=15 -DHAVE_XSHM=1 -DHAVE_FT_BITMAP_SIZE_Y_PPEM=1 -DHAVE_FT_GLYPHSLOT_EMBOLDEN=1 -DHAVE_FT_LOAD_SFNT_TABLE=1 -DHAVE_FT_SELECT_SIZE=1 -D_REENTRANT=1 -DHAVE_RANDOM=1 -DHAVE_STRERROR=1 -DHAVE_LCHOWN=1 -DHAVE_FCHMOD=1 -DHAVE_SNPRINTF=1 -DHAVE_MEMMOVE=1 -DHAVE_RINT=1 -DHAVE_STAT64=1 -DHAVE_LSTAT64=1 -DHAVE_TRUNCATE64=1 -DHAVE_FLOCKFILE=1 -DHAVE_LOCALTIME_R=1 -DHAVE_STRTOK_R=1 -DHAVE_RES_NINIT=1 -DHAVE_GNU_GET_LIBC_VERSION=1 -DHAVE_LANGINFO_CODESET=1 -DVA_COPY=va_copy -DHAVE_VA_COPY=1 -DHAVE_VA_LIST_AS_ARRAY=1 -DHAVE_I18N_LC_MESSAGES=1 -DMOZ_EMBEDDING_LEVEL_DEFAULT=1 -DMOZ_EMBEDDING_LEVEL_BASIC=1 -DMOZ_EMBEDDING_LEVEL_MINIMAL=1 -DMOZ_PHOENIX=1 -DMOZ_BUILD_APP=browser -DMOZ_XUL_APP=1 -DMOZ_DEFAULT_TOOLKIT=\"cairo-gtk2\" -DMOZ_X11=1 -DMOZ_WIDGET_GTK2=1 -DMOZ_ENABLE_XREMOTE=1 -DMOZ_ENABLE_STARTUP_NOTIFICATION=1 -DMOZ_DISTRIBUTION_ID=\"org.gentoo\" -DMOZ_PANGO=1 -DMOZ_ENABLE_GCONF=1 -DMOZ_ENABLE_GNOMEUI=1 -DMOZ_ENABLE_DBUS=1 -DOJI=1 -DIBMBIDI=1 -DMOZ_VIEW_SOURCE=1 -DACCESSIBILITY=1 -DMOZ_XPINSTALL=1 -DMOZ_JSLOADER=1 -DNS_PRINTING=1 -DNS_PRINT_PREVIEW=1 -DMOZ_NO_XPCOM_OBSOLETE=1 -DMOZ_OGG=1 -DATTRIBUTE_ALIGNED_MAX=64 -DMOZ_WAVE=1 -DMOZ_SYDNEYAUDIO=1 -DMOZ_MEDIA=1 -DHAVE_LIBASOUND=1 -DMOZ_XTF=1 -DMOZ_CRASHREPORTER_ENABLE_PERCENT=100 -DMOZ_MATHML=1 -DMOZ_ENABLE_CANVAS=1 -DMOZ_SVG=1 -DMOZ_UPDATE_CHANNEL=default -DMOZ_PLACES=1 -DMOZ_FEEDS=1 -DMOZ_STORAGE=1 -DMOZ_SAFE_BROWSING=1 -DMOZ_URL_CLASSIFIER=1 -DMOZ_LOGGING=1 -DSIZEOF_INT_P=8 -DMOZ_MEMORY_SIZEOF_PTR_2POW=3 -DMOZ_MEMORY=1 -DMOZ_MEMORY_LINUX=1 -DHAVE___CXA_DEMANGLE=1 -DHAVE__UNWIND_BACKTRACE=1 -DMOZ_DEFAULT_MOZILLA_FIVE_HOME=\"/usr/lib64/mozilla-firefox\" -DMOZ_USER_DIR=\".mozilla\" -DMOZ_ENABLE_LIBXUL=1 -DHAVE_STDINT_H=1 -DHAVE_INTTYPES_H=1 -DMOZ_XUL=1 -DMOZ_RDF=1 -DMOZ_MORKREADER=1 -DMOZ_DLL_SUFFIX=\".so\" -DXP_UNIX=1 -DUNIX_ASYNC_DNS=1 -DMOZ_ACCESSIBILITY_ATK=1 -DATK_MAJOR_VERSION=1 -DATK_MINOR_VERSION=26 -DATK_REV_VERSION=0 -DNDEBUG -DTRIMMED $i > $dest; \
done
/usr/bin/python ../../../config/JarMaker.py \
-j ../../../dist/bin/chrome \
-t ../../.. -f jar -DNDEBUG -DTRIMMED -DOFFICIAL_BUILD=1 -DOSTYPE=\"Linux2.6\" -DOSARCH=Linux -DHAVE_64BIT_OS=1 -DMOZILLA_VERSION=\"1.9.1b4\" -DMOZILLA_VERSION_U=1.9.1b4 -DD_INO=d_ino -DSTDC_HEADERS=1 -DHAVE_ST_BLKSIZE=1 -DHAVE_SIGINFO_T=1 -DHAVE_INT16_T=1 -DHAVE_INT32_T=1 -DHAVE_INT64_T=1 -DHAVE_UINT=1 -DHAVE_UNAME_DOMAINNAME_FIELD=1 -DHAVE_VISIBILITY_HIDDEN_ATTRIBUTE=1 -DHAVE_VISIBILITY_ATTRIBUTE=1 -DHAVE_DIRENT_H=1 -DHAVE_GETOPT_H=1 -DHAVE_SYS_BITYPES_H=1 -DHAVE_MEMORY_H=1 -DHAVE_UNISTD_H=1 -DHAVE_GNU_LIBC_VERSION_H=1 -DHAVE_NL_TYPES_H=1 -DHAVE_MALLOC_H=1 -DHAVE_X11_XKBLIB_H=1 -DHAVE_SYS_STATVFS_H=1 -DHAVE_SYS_STATFS_H=1 -DHAVE_MMINTRIN_H=1 -DHAVE_SYS_CDEFS_H=1 -DHAVE_LIBM=1 -DHAVE_LIBDL=1 -DHAVE_DLADDR=1 -DFUNCPROTO=15 -DHAVE_XSHM=1 -DHAVE_FT_BITMAP_SIZE_Y_PPEM=1 -DHAVE_FT_GLYPHSLOT_EMBOLDEN=1 -DHAVE_FT_LOAD_SFNT_TABLE=1 -DHAVE_FT_SELECT_SIZE=1 -D_REENTRANT=1 -DHAVE_RANDOM=1 -DHAVE_STRERROR=1 -DHAVE_LCHOWN=1 -DHAVE_FCHMOD=1 -DHAVE_SNPRINTF=1 -DHAVE_MEMMOVE=1 -DHAVE_RINT=1 -DHAVE_STAT64=1 -DHAVE_LSTAT64=1 -DHAVE_TRUNCATE64=1 -DHAVE_FLOCKFILE=1 -DHAVE_LOCALTIME_R=1 -DHAVE_STRTOK_R=1 -DHAVE_RES_NINIT=1 -DHAVE_GNU_GET_LIBC_VERSION=1 -DHAVE_LANGINFO_CODESET=1 -DVA_COPY=va_copy -DHAVE_VA_COPY=1 -DHAVE_VA_LIST_AS_ARRAY=1 -DHAVE_I18N_LC_MESSAGES=1 -DMOZ_EMBEDDING_LEVEL_DEFAULT=1 -DMOZ_EMBEDDING_LEVEL_BASIC=1 -DMOZ_EMBEDDING_LEVEL_MINIMAL=1 -DMOZ_PHOENIX=1 -DMOZ_BUILD_APP=browser -DMOZ_XUL_APP=1 -DMOZ_DEFAULT_TOOLKIT=\"cairo-gtk2\" -DMOZ_X11=1 -DMOZ_WIDGET_GTK2=1 -DMOZ_ENABLE_XREMOTE=1 -DMOZ_ENABLE_STARTUP_NOTIFICATION=1 -DMOZ_DISTRIBUTION_ID=\"org.gentoo\" -DMOZ_PANGO=1 -DMOZ_ENABLE_GCONF=1 -DMOZ_ENABLE_GNOMEUI=1 -DMOZ_ENABLE_DBUS=1 -DOJI=1 -DIBMBIDI=1 -DMOZ_VIEW_SOURCE=1 -DACCESSIBILITY=1 -DMOZ_XPINSTALL=1 -DMOZ_JSLOADER=1 -DNS_PRINTING=1 -DNS_PRINT_PREVIEW=1 -DMOZ_NO_XPCOM_OBSOLETE=1 -DMOZ_OGG=1 -DATTRIBUTE_ALIGNED_MAX=64 -DMOZ_WAVE=1 -DMOZ_SYDNEYAUDIO=1 -DMOZ_MEDIA=1 -DHAVE_LIBASOUND=1 -DMOZ_XTF=1 -DMOZ_CRASHREPORTER_ENABLE_PERCENT=100 -DMOZ_MATHML=1 -DMOZ_ENABLE_CANVAS=1 -DMOZ_SVG=1 -DMOZ_UPDATE_CHANNEL=default -DMOZ_PLACES=1 -DMOZ_FEEDS=1 -DMOZ_STORAGE=1 -DMOZ_SAFE_BROWSING=1 -DMOZ_URL_CLASSIFIER=1 -DMOZ_LOGGING=1 -DSIZEOF_INT_P=8 -DMOZ_MEMORY_SIZEOF_PTR_2POW=3 -DMOZ_MEMORY=1 -DMOZ_MEMORY_LINUX=1 -DHAVE___CXA_DEMANGLE=1 -DHAVE__UNWIND_BACKTRACE=1 -DMOZ_DEFAULT_MOZILLA_FIVE_HOME=\"/usr/lib64/mozilla-firefox\" -DMOZ_USER_DIR=\".mozilla\" -DMOZ_ENABLE_LIBXUL=1 -DHAVE_STDINT_H=1 -DHAVE_INTTYPES_H=1 -DMOZ_XUL=1 -DMOZ_RDF=1 -DMOZ_MORKREADER=1 -DMOZ_DLL_SUFFIX=\".so\" -DXP_UNIX=1 -DUNIX_ASYNC_DNS=1 -DMOZ_ACCESSIBILITY_ATK=1 -DATK_MAJOR_VERSION=1 -DATK_MINOR_VERSION=26 -DATK_REV_VERSION=0 \
./jar.mn
processing ./jar.mn
gmake[5]: Leaving directory `/var/tmp/portage/www-client/mozilla-firefox-3.5_beta4/work/mozilla-1.9.1/browser/components/safebrowsing'
gmake[5]: Entering directory `/var/tmp/portage/www-client/mozilla-firefox-3.5_beta4/work/mozilla-1.9.1/browser/components/build'
nsModule.cpp
x86_64-pc-linux-gnu-g++ -o nsModule.o -c -I../../../dist/include/system_wrappers -include ../../../config/gcc_hidden.h -DOSTYPE=\"Linux2.6\" -DOSARCH=Linux -I./../shell/src -I./../feeds/src -I./../places/src -I./../privatebrowsing/src -I./../migration/src -I. -I. -I../../../dist/include/xpcom -I../../../dist/include/string -I../../../dist/include/rdf -I../../../dist/include/uriloader -I../../../dist/include/intl -I../../../dist/include/necko -I../../../dist/include/shellservice -I../../../dist/include/xulapp -I../../../dist/include/places -I../../../dist/include/browserplaces -I../../../dist/include/microsummaries -I../../../dist/include/privatebrowsing -I../../../dist/include/migration -I../../../dist/include -I/usr/lib64/xulrunner-devel-1.9.1/include/xpcom -I/usr/lib64/xulrunner-devel-1.9.1/include/string -I/usr/lib64/xulrunner-devel-1.9.1/include/rdf -I/usr/lib64/xulrunner-devel-1.9.1/include/uriloader -I/usr/lib64/xulrunner-devel-1.9.1/include/intl -I/usr/lib64/xulrunner-devel-1.9.1/include/necko -I/usr/lib64/xulrunner-devel-1.9.1/include/shellservice -I/usr/lib64/xulrunner-devel-1.9.1/include/xulapp -I/usr/lib64/xulrunner-devel-1.9.1/include/places -I/usr/lib64/xulrunner-devel-1.9.1/include/browserplaces -I/usr/lib64/xulrunner-devel-1.9.1/include/microsummaries -I/usr/lib64/xulrunner-devel-1.9.1/include/privatebrowsing -I/usr/lib64/xulrunner-devel-1.9.1/include/migration -I/usr/lib64/xulrunner-devel-1.9.1/include -I../../../dist/include/browsercomps -I/usr/include/nspr -I/usr/lib64/xulrunner-devel-1.9.1/sdk/include -fPIC -DARON_WAS_HERE -fno-rtti -fno-handle-exceptions -Wall -Wpointer-arith -Woverloaded-virtual -Wsynth -Wno-ctor-dtor-privacy -Wno-non-virtual-dtor -Wcast-align -Wno-invalid-offsetof -Wno-long-long -march=native -pipe -fno-strict-aliasing -fno-strict-overflow -fno-ident -fPIC -Wno-return-type -w -fno-strict-aliasing -fshort-wchar -pthread -pipe -DNDEBUG -DTRIMMED -O2 -DARON_WAS_HERE -DMOZILLA_CLIENT -include ../../../mozilla-config.h -Wp,-MD,.deps/nsModule.pp nsModule.cpp
rm -f libbrowsercomps.so
x86_64-pc-linux-gnu-g++ -DARON_WAS_HERE -fno-rtti -fno-handle-exceptions -Wall -Wpointer-arith -Woverloaded-virtual -Wsynth -Wno-ctor-dtor-privacy -Wno-non-virtual-dtor -Wcast-align -Wno-invalid-offsetof -Wno-long-long -march=native -pipe -fno-strict-aliasing -fno-strict-overflow -fno-ident -fPIC -Wno-return-type -w -fno-strict-aliasing -fshort-wchar -pthread -pipe -DNDEBUG -DTRIMMED -O2 -fPIC -shared -Wl,-z,defs -Wl,-h,libbrowsercomps.so -o libbrowsercomps.so nsModule.o -lpthread -Wl,-O1 -Wl,--hash-style=both -Wl,--sort-common -Wl,--as-needed -Wl,--enable-new-dtags -Wl,--relax -Wl,-z,now -Wl,-z,relro -Wl,-rpath-link,/usr/lib64/xulrunner-devel-1.9.1/bin -Wl,-rpath-link,/usr/lib -Wl,--whole-archive ../feeds/src/libbrowser_feeds_s.a ../places/src/libbrowserplaces_s.a ../privatebrowsing/src/libprivatebrowsing_s.a ../shell/src/libshellservice_s.a ../migration/src/libmigration_s.a -Wl,--no-whole-archive -L/usr/lib64/xulrunner-devel-1.9.1/lib -lunicharutil_external_s /usr/lib64/xulrunner-devel-1.9.1/lib/libxpcomglue_s.a -L/usr/lib64/xulrunner-devel-1.9.1/bin -lxpcom -lxul -L/usr/lib64/xulrunner-devel-1.9.1/bin -Wl,-R/usr/lib64/nspr -L/usr/lib64/nspr -lplds4 -lplc4 -lnspr4 -lpthread -ldl /usr/lib64/xulrunner-devel-1.9.1/lib/libmozreg_s.a -lgtk-x11-2.0 -latk-1.0 -lgio-2.0 -lpangoft2-1.0 -lfreetype -lfontconfig -lgdk-x11-2.0 -lgdk_pixbuf-2.0 -lpangocairo-1.0 -lpango-1.0 -lcairo -lgobject-2.0 -lgmodule-2.0 -lglib-2.0 -lstartup-notification-1 -Wl,--version-script -Wl,../../../build/unix/gnu-ld-scripts/components-version-script -Wl,-Bsymbolic -lasound -ldl -lm
/usr/lib64/xulrunner-devel-1.9.1/lib/libmozreg_s.a(reg.o): In function `nr_ReplaceName':
(.text+0xd17): undefined reference to `PL_strlen'
/usr/lib64/xulrunner-devel-1.9.1/lib/libmozreg_s.a(reg.o): In function `nr_AppendName':
(.text+0x1024): undefined reference to `PL_strlen'
/usr/lib64/xulrunner-devel-1.9.1/lib/libmozreg_s.a(reg.o): In function `nr_CatName':
(.text+0x1107): undefined reference to `PL_strlen'
/usr/lib64/xulrunner-devel-1.9.1/lib/libmozreg_s.a(reg.o): In function `nr_RemoveName':
(.text+0x11e9): undefined reference to `PL_strlen'
/usr/lib64/xulrunner-devel-1.9.1/lib/libmozreg_s.a(reg.o): In function `nr_FindAtLevel':
(.text+0x1318): undefined reference to `PL_strcmp'
/usr/lib64/xulrunner-devel-1.9.1/lib/libmozreg_s.a(reg.o): In function `NR_RegSetUsername':
(.text+0x1d39): undefined reference to `PL_strdup'
/usr/lib64/xulrunner-devel-1.9.1/lib/libmozreg_s.a(reg.o): In function `NR_RegGetUsername':
(.text+0x1dc5): undefined reference to `PL_strdup'
/usr/lib64/xulrunner-devel-1.9.1/lib/libmozreg_s.a(reg.o): In function `NR_RegSetEntryString':
(.text+0x2443): undefined reference to `PL_strlen'
/usr/lib64/xulrunner-devel-1.9.1/lib/libmozreg_s.a(reg.o): In function `NR_RegSetEntryString':
(.text+0x24d7): undefined reference to `PL_strlen'
/usr/lib64/xulrunner-devel-1.9.1/lib/libmozreg_s.a(reg.o): In function `nr_TranslateKey':
(.text+0x2ae0): undefined reference to `PL_strcmp'
/usr/lib64/xulrunner-devel-1.9.1/lib/libmozreg_s.a(reg.o): In function `NR_RegOpen':
(.text+0x36a1): undefined reference to `PL_strcmp'
/usr/lib64/xulrunner-devel-1.9.1/lib/libmozreg_s.a(reg.o): In function `NR_RegOpen':
(.text+0x373e): undefined reference to `PL_strdup'
/usr/lib64/xulrunner-devel-1.9.1/lib/libmozreg_s.a(VerReg.o): In function `vr_convertPackageName':
(.text+0x132): undefined reference to `PL_strlen'
/usr/lib64/xulrunner-devel-1.9.1/lib/libmozreg_s.a(VerReg.o): In function `vr_convertPackageName':
(.text+0x1b6): undefined reference to `PL_strlen'
/usr/lib64/xulrunner-devel-1.9.1/lib/libmozreg_s.a(VerReg.o): In function `vr_GetUninstallItemPath':
(.text+0x27f): undefined reference to `PL_strlen'
/usr/lib64/xulrunner-devel-1.9.1/lib/libmozreg_s.a(VerReg.o): In function `vr_GetUninstallItemPath':
(.text+0x2db): undefined reference to `PL_strcpy'
/usr/lib64/xulrunner-devel-1.9.1/lib/libmozreg_s.a(VerReg.o): In function `vr_GetUninstallItemPath':
(.text+0x2f0): undefined reference to `PL_strlen'
/usr/lib64/xulrunner-devel-1.9.1/lib/libmozreg_s.a(VerReg.o): In function `vr_GetUninstallItemPath':
(.text+0x313): undefined reference to `PL_strcat'
/usr/lib64/xulrunner-devel-1.9.1/lib/libmozreg_s.a(VerReg.o): In function `vr_GetUninstallItemPath':
(.text+0x32c): undefined reference to `PL_strcat'
/usr/lib64/xulrunner-devel-1.9.1/lib/libmozreg_s.a(VerReg.o): In function `vr_GetUninstallItemPath':
(.text+0x334): undefined reference to `PL_strlen'
/usr/lib64/xulrunner-devel-1.9.1/lib/libmozreg_s.a(VerReg.o): In function `vr_GetUninstallItemPath':
(.text+0x34b): undefined reference to `PL_strlen'
/usr/lib64/xulrunner-devel-1.9.1/lib/libmozreg_s.a(VerReg.o): In function `vr_GetUninstallItemPath':
(.text+0x363): undefined reference to `PL_strcat'
/usr/lib64/xulrunner-devel-1.9.1/lib/libmozreg_s.a(VerReg.o): In function `vr_GetUninstallItemPath':
(.text+0x378): undefined reference to `PL_strlen'
/usr/lib64/xulrunner-devel-1.9.1/lib/libmozreg_s.a(VerReg.o): In function `vr_GetUninstallItemPath':
(.text+0x395): undefined reference to `PL_strcat'
/usr/lib64/xulrunner-devel-1.9.1/lib/libmozreg_s.a(VerReg.o): In function `vr_GetUninstallItemPath':
(.text+0x3a7): undefined reference to `PL_strlen'
/usr/lib64/xulrunner-devel-1.9.1/lib/libmozreg_s.a(VerReg.o): In function `vr_GetUninstallItemPath':
(.text+0x3bd): undefined reference to `PL_strcat'
/usr/lib64/xulrunner-devel-1.9.1/lib/libmozreg_s.a(VerReg.o): In function `vr_CompareDirs':
(.text+0x494): undefined reference to `PL_strlen'
/usr/lib64/xulrunner-devel-1.9.1/lib/libmozreg_s.a(VerReg.o): In function `vr_CompareDirs':
(.text+0x49f): undefined reference to `PL_strlen'
/usr/lib64/xulrunner-devel-1.9.1/lib/libmozreg_s.a(VerReg.o): In function `vr_CompareDirs':
(.text+0x4fa): undefined reference to `PL_strncmp'
/usr/lib64/xulrunner-devel-1.9.1/lib/libmozreg_s.a(VerReg.o): In function `vr_SetPathname':
(.text+0x547): undefined reference to `PL_strlen'
/usr/lib64/xulrunner-devel-1.9.1/lib/libmozreg_s.a(VerReg.o): In function `vr_SetCurrentNav':
(.text+0x72d): undefined reference to `PL_strcpy'
/usr/lib64/xulrunner-devel-1.9.1/lib/libmozreg_s.a(VerReg.o): In function `vr_Init':
(.text+0xabc): undefined reference to `PL_strlen'
/usr/lib64/xulrunner-devel-1.9.1/lib/libmozreg_s.a(VerReg.o): In function `vr_Init':
(.text+0xadf): undefined reference to `PL_strcpy'
/usr/lib64/xulrunner-devel-1.9.1/lib/libmozreg_s.a(VerReg.o): In function `vr_Init':
(.text+0xaee): undefined reference to `PL_strcat'
/usr/lib64/xulrunner-devel-1.9.1/lib/libmozreg_s.a(VerReg.o): In function `VR_EnumUninstall':
(.text+0xd63): undefined reference to `PL_strcpy'
/usr/lib64/xulrunner-devel-1.9.1/lib/libmozreg_s.a(VerReg.o): In function `VR_EnumUninstall':
(.text+0xd7b): undefined reference to `PL_strcat'
/usr/lib64/xulrunner-devel-1.9.1/lib/libmozreg_s.a(VerReg.o): In function `VR_EnumUninstall':
(.text+0xde8): undefined reference to `PL_strcmp'
/usr/lib64/xulrunner-devel-1.9.1/lib/libmozreg_s.a(VerReg.o): In function `VR_EnumUninstall':
(.text+0xe83): undefined reference to `PL_strcat'
/usr/lib64/xulrunner-devel-1.9.1/lib/libmozreg_s.a(VerReg.o): In function `VR_EnumUninstall':
(.text+0xe93): undefined reference to `PL_strlen'
/usr/lib64/xulrunner-devel-1.9.1/lib/libmozreg_s.a(VerReg.o): In function `VR_EnumUninstall':
(.text+0xec3): undefined reference to `PL_strlen'
/usr/lib64/xulrunner-devel-1.9.1/lib/libmozreg_s.a(VerReg.o): In function `VR_EnumUninstall':
(.text+0xf6c): undefined reference to `PL_strcpy'
/usr/lib64/xulrunner-devel-1.9.1/lib/libmozreg_s.a(VerReg.o): In function `VR_EnumUninstall':
(.text+0xf77): undefined reference to `PL_strcat'
/usr/lib64/xulrunner-devel-1.9.1/lib/libmozreg_s.a(VerReg.o): In function `VR_EnumUninstall':
(.text+0xf8a): undefined reference to `PL_strcpy'
/usr/lib64/xulrunner-devel-1.9.1/lib/libmozreg_s.a(VerReg.o): In function `VR_UninstallFileExistsInList':
(.text+0x103c): undefined reference to `PL_strlen'
/usr/lib64/xulrunner-devel-1.9.1/lib/libmozreg_s.a(VerReg.o): In function `VR_UninstallFileExistsInList':
(.text+0x108c): undefined reference to `PL_strlen'
/usr/lib64/xulrunner-devel-1.9.1/lib/libmozreg_s.a(VerReg.o): In function `VR_UninstallFileExistsInList':
(.text+0x109b): undefined reference to `PL_strlen'
/usr/lib64/xulrunner-devel-1.9.1/lib/libmozreg_s.a(VerReg.o): In function `VR_UninstallFileExistsInList':
(.text+0x10b9): undefined reference to `PL_strcat'
/usr/lib64/xulrunner-devel-1.9.1/lib/libmozreg_s.a(VerReg.o): In function `VR_UninstallAddFileToList':
(.text+0x1194): undefined reference to `PL_strlen'
/usr/lib64/xulrunner-devel-1.9.1/lib/libmozreg_s.a(VerReg.o): In function `VR_UninstallAddFileToList':
(.text+0x11e4): undefined reference to `PL_strlen'
/usr/lib64/xulrunner-devel-1.9.1/lib/libmozreg_s.a(VerReg.o): In function `VR_UninstallAddFileToList':
(.text+0x11f3): undefined reference to `PL_strlen'
/usr/lib64/xulrunner-devel-1.9.1/lib/libmozreg_s.a(VerReg.o): In function `VR_UninstallAddFileToList':
(.text+0x1211): undefined reference to `PL_strcat'
/usr/lib64/xulrunner-devel-1.9.1/lib/libmozreg_s.a(VerReg.o): In function `VR_GetUninstallUserName':
(.text+0x12e9): undefined reference to `PL_strlen'
/usr/lib64/xulrunner-devel-1.9.1/lib/libmozreg_s.a(VerReg.o): In function `VR_GetUninstallUserName':
(.text+0x131d): undefined reference to `PL_strlen'
/usr/lib64/xulrunner-devel-1.9.1/lib/libmozreg_s.a(VerReg.o): In function `VR_UninstallCreateNode':
(.text+0x1484): undefined reference to `PL_strlen'
/usr/lib64/xulrunner-devel-1.9.1/lib/libmozreg_s.a(VerReg.o): In function `VR_CreateRegistry':
(.text+0x1936): undefined reference to `PL_strlen'
/usr/lib64/xulrunner-devel-1.9.1/lib/libmozreg_s.a(VerReg.o): In function `VR_CreateRegistry':
(.text+0x1954): undefined reference to `PL_strcpy'
/usr/lib64/xulrunner-devel-1.9.1/lib/libmozreg_s.a(VerReg.o): In function `VR_CreateRegistry':
(.text+0x1963): undefined reference to `PL_strcat'
/usr/lib64/xulrunner-devel-1.9.1/lib/libmozreg_s.a(VerReg.o): In function `VR_UninstallDestroy':
(.text+0x1b24): undefined reference to `PL_strlen'
/usr/lib64/xulrunner-devel-1.9.1/lib/libmozreg_s.a(VerReg.o): In function `VR_UninstallDestroy':
(.text+0x1b74): undefined reference to `PL_strlen'
/usr/lib64/xulrunner-devel-1.9.1/lib/libmozreg_s.a(VerReg.o): In function `VR_UninstallDeleteSharedFilesKey':
(.text+0x1c4c): undefined reference to `PL_strlen'
/usr/lib64/xulrunner-devel-1.9.1/lib/libmozreg_s.a(VerReg.o): In function `VR_UninstallDeleteSharedFilesKey':
(.text+0x1c94): undefined reference to `PL_strlen'
/usr/lib64/xulrunner-devel-1.9.1/lib/libmozreg_s.a(VerReg.o): In function `VR_UninstallDeleteSharedFilesKey':
(.text+0x1ce4): undefined reference to `PL_strlen'
/usr/lib64/xulrunner-devel-1.9.1/lib/libmozreg_s.a(VerReg.o):(.text+0x1cf3): more undefined references to `PL_strlen' follow
/usr/lib64/xulrunner-devel-1.9.1/lib/libmozreg_s.a(VerReg.o): In function `VR_UninstallDeleteSharedFilesKey':
(.text+0x1d11): undefined reference to `PL_strcat'
/usr/lib64/xulrunner-devel-1.9.1/lib/libmozreg_s.a(VerReg.o): In function `VR_UninstallDeleteFileFromList':
(.text+0x2024): undefined reference to `PL_strlen'
/usr/lib64/xulrunner-devel-1.9.1/lib/libmozreg_s.a(VerReg.o): In function `VR_UninstallDeleteFileFromList':
(.text+0x2074): undefined reference to `PL_strlen'
/usr/lib64/xulrunner-devel-1.9.1/lib/libmozreg_s.a(VerReg.o): In function `VR_UninstallDeleteFileFromList':
(.text+0x20dc): undefined reference to `PL_strlen'
/usr/lib64/xulrunner-devel-1.9.1/lib/libmozreg_s.a(VerReg.o): In function `VR_UninstallDeleteFileFromList':
(.text+0x20eb): undefined reference to `PL_strlen'
/usr/lib64/xulrunner-devel-1.9.1/lib/libmozreg_s.a(VerReg.o): In function `VR_UninstallDeleteFileFromList':
(.text+0x2109): undefined reference to `PL_strcat'
/usr/lib64/xulrunner-devel-1.9.1/lib/libmozreg_s.a(VerReg.o): In function `VR_UninstallEnumSharedFiles':
(.text+0x21ca): undefined reference to `PL_strlen'
/usr/lib64/xulrunner-devel-1.9.1/lib/libmozreg_s.a(VerReg.o): In function `VR_UninstallEnumSharedFiles':
(.text+0x2244): undefined reference to `PL_strlen'
/usr/lib64/xulrunner-devel-1.9.1/lib/libmozreg_s.a(VerReg.o): In function `VR_UninstallEnumSharedFiles':
(.text+0x22ac): undefined reference to `PL_strlen'
/usr/lib64/xulrunner-devel-1.9.1/lib/libmozreg_s.a(VerReg.o): In function `VR_UninstallEnumSharedFiles':
(.text+0x22bc): undefined reference to `PL_strlen'
/usr/lib64/xulrunner-devel-1.9.1/lib/libmozreg_s.a(VerReg.o): In function `VR_UninstallEnumSharedFiles':
(.text+0x22dc): undefined reference to `PL_strcat'
/usr/lib64/xulrunner-devel-1.9.1/lib/libmozreg_s.a(VerReg.o): In function `VR_SetRegDirectory':
(.text+0x2456): undefined reference to `PL_strdup'
/usr/lib64/xulrunner-devel-1.9.1/lib/libmozreg_s.a(vr_stubs.o): In function `vr_findVerRegName':
(.text+0x68): undefined reference to `PL_strlen'
/usr/lib64/xulrunner-devel-1.9.1/lib/libmozreg_s.a(vr_stubs.o): In function `vr_findVerRegName':
(.text+0x76): undefined reference to `PL_strlen'
/usr/lib64/xulrunner-devel-1.9.1/lib/libmozreg_s.a(vr_stubs.o): In function `vr_findVerRegName':
(.text+0x92): undefined reference to `PL_strcpy'
/usr/lib64/xulrunner-devel-1.9.1/lib/libmozreg_s.a(vr_stubs.o): In function `vr_findVerRegName':
(.text+0xa1): undefined reference to `PL_strcat'
/usr/lib64/xulrunner-devel-1.9.1/lib/libmozreg_s.a(vr_stubs.o): In function `vr_findVerRegName':
(.text+0xa9): undefined reference to `PL_strdup'
/usr/lib64/xulrunner-devel-1.9.1/lib/libmozreg_s.a(vr_stubs.o): In function `vr_findGlobalRegName':
(.text+0xfe): undefined reference to `PL_strlen'
/usr/lib64/xulrunner-devel-1.9.1/lib/libmozreg_s.a(vr_stubs.o): In function `vr_findGlobalRegName':
(.text+0x10c): undefined reference to `PL_strlen'
/usr/lib64/xulrunner-devel-1.9.1/lib/libmozreg_s.a(vr_stubs.o): In function `vr_findGlobalRegName':
(.text+0x128): undefined reference to `PL_strcpy'
/usr/lib64/xulrunner-devel-1.9.1/lib/libmozreg_s.a(vr_stubs.o): In function `vr_findGlobalRegName':
(.text+0x137): undefined reference to `PL_strcat'
/usr/lib64/xulrunner-devel-1.9.1/lib/libmozreg_s.a(vr_stubs.o): In function `vr_findGlobalRegName':
(.text+0x13f): undefined reference to `PL_strdup'
/usr/lib64/xulrunner-devel-1.9.1/lib/libmozreg_s.a(vr_stubs.o): In function `vr_findGlobalRegName':
(.text+0x178): undefined reference to `PL_strdup'
collect2: ld returned 1 exit status
gmake[5]: *** [libbrowsercomps.so] Error 1
gmake[5]: Leaving directory `/var/tmp/portage/www-client/mozilla-firefox-3.5_beta4/work/mozilla-1.9.1/browser/components/build'
gmake[4]: *** [libs] Error 2
gmake[4]: Leaving directory `/var/tmp/portage/www-client/mozilla-firefox-3.5_beta4/work/mozilla-1.9.1/browser/components'
gmake[3]: *** [libs] Error 2
gmake[3]: Leaving directory `/var/tmp/portage/www-client/mozilla-firefox-3.5_beta4/work/mozilla-1.9.1/browser'
gmake[2]: *** [libs_tier_app] Error 2
gmake[2]: Leaving directory `/var/tmp/portage/www-client/mozilla-firefox-3.5_beta4/work/mozilla-1.9.1'
gmake[1]: *** [tier_app] Error 2
gmake[1]: Leaving directory `/var/tmp/portage/www-client/mozilla-firefox-3.5_beta4/work/mozilla-1.9.1'
make: *** [default] Error 2


I already re-emerged / updated nss and nspr but no fix !

I'll try removing the as-needed ldflags if that helps

thanks !
_________________
https://github.com/kernelOfTruth/ZFS-for-SystemRescueCD/tree/ZFS-for-SysRescCD-4.9.0
https://github.com/kernelOfTruth/pulseaudio-equalizer-ladspa

Hardcore Gentoo Linux user since 2004 :D
Back to top
View user's profile Send private message
laughinggnome
n00b
n00b


Joined: 07 Mar 2006
Posts: 45

PostPosted: Thu Apr 30, 2009 4:09 pm    Post subject: Reply with quote

scary wrote:
Removing the --as-needed LDFLAG when building mozilla-firefox solved the problem for me :)


And it solved it for me as well. Cheers!
Back to top
View user's profile Send private message
Display posts from previous:   
Reply to topic    Gentoo Forums Forum Index Unsupported Software All times are GMT
Page 1 of 1

 
Jump to:  
You cannot post new topics in this forum
You cannot reply to topics in this forum
You cannot edit your posts in this forum
You cannot delete your posts in this forum
You cannot vote in polls in this forum