Gentoo Forums
Gentoo Forums
Gentoo Forums
Quick Search: in
Dino fails to compile
View unanswered posts
View posts from last 24 hours

 
Reply to topic    Gentoo Forums Forum Index Unsupported Software
View previous topic :: View next topic  
Author Message
audiodef
Watchman
Watchman


Joined: 06 Jul 2005
Posts: 6316
Location: /usr/lib64/lv2

PostPosted: Wed Sep 23, 2009 3:16 am    Post subject: Dino fails to compile Reply with quote

Like so:

Code:

track.hpp:197: error: ISO C++ forbids declaration of 'signal' with no type
track.hpp:197: error: expected ';' before '<' token
track.hpp:198: error: ISO C++ forbids declaration of 'signal' with no type
track.hpp:198: error: expected ';' before '<' token
track.hpp:199: error: ISO C++ forbids declaration of 'signal' with no type
track.hpp:199: error: expected ';' before '<' token
track.hpp:200: error: ISO C++ forbids declaration of 'signal' with no type
track.hpp:200: error: expected ';' before '<' token
track.hpp:201: error: ISO C++ forbids declaration of 'signal' with no type
track.hpp:201: error: expected ';' before '<' token
track.hpp:202: error: ISO C++ forbids declaration of 'signal' with no type
track.hpp:202: error: expected ';' before '<' token
track.hpp:203: error: ISO C++ forbids declaration of 'signal' with no type
track.hpp:203: error: expected ';' before '<' token
track.cpp: In member function 'void Dino::Track::set_name(const std::string&)':
track.cpp:282: error: 'signal_name_changed' was not declared in this scope
track.cpp: In member function 'Dino::Track::PatternIterator Dino::Track::add_pattern(const std::string&, int, int)':
track.cpp:299: error: 'signal_pattern_added' was not declared in this scope
track.cpp: In member function 'Dino::Track::PatternIterator Dino::Track::duplicate_pattern(Dino::Track::ConstPatternIterator)':
track.cpp:318: error: 'signal_pattern_added' was not declared in this scope
track.cpp: In member function 'void Dino::Track::remove_pattern(int)':
track.cpp:338: error: 'signal_pattern_removed' was not declared in this scope
track.cpp: In member function 'Dino::Track::SequenceIterator Dino::Track::set_sequence_entry(int, int, unsigned int)':
track.cpp:388: error: 'signal_sequence_entry_added' was not declared in this scope
track.cpp: In member function 'void Dino::Track::set_seq_entry_length(Dino::Track::SequenceIterator, unsigned int)':
track.cpp:414: error: 'signal_sequence_entry_changed' was not declared in this scope
track.cpp: In member function 'bool Dino::Track::remove_sequence_entry(Dino::Track::SequenceIterator)':
track.cpp:432: error: 'signal_sequence_entry_removed' was not declared in this scope
track.cpp: In member function 'void Dino::Track::set_length(int)':
track.cpp:462: error: 'signal_length_changed' was not declared in this scope
make[3]: *** [track.lo] Error 1
make[3]: *** Waiting for unfinished jobs....
make[3]: Leaving directory `/var/tmp/portage/media-sound/dino-0.2.2/work/dino-0.2.2/src/libdinoseq'
make[2]: *** [all-recursive] Error 1
make[2]: Leaving directory `/var/tmp/portage/media-sound/dino-0.2.2/work/dino-0.2.2/src'
make[1]: *** [all] Error 2
make[1]: Leaving directory `/var/tmp/portage/media-sound/dino-0.2.2/work/dino-0.2.2/src'
make: *** [all-recursive] Error 1
 *
 * ERROR: media-sound/dino-0.2.2 failed.
 * Call stack:
 *               ebuild.sh, line   49:  Called src_compile
 *             environment, line 2334:  Called die
 * The specific snippet of code:
 *       emake || die
 *  The die message:
 *   (no error message)
 *
 * If you need support, post the topmost build error, and the call stack if relevant.
 * A complete build log is located at '/var/tmp/portage/media-sound/dino-0.2.2/temp/build.log'.
 * The ebuild environment file is located at '/var/tmp/portage/media-sound/dino-0.2.2/temp/environment'.
 * This ebuild used the following eclasses from overlays:
 *   /usr/local/portage/layman/pro-audio/eclass/jackmidi.eclass
 * This ebuild is from an overlay named 'proaudio': '/usr/local/portage/layman/pro-audio/'


Anything I can do to fix?
_________________
Gentoo Studio: A Gentoo-based, professional digital audio workstation OS.
Back to top
View user's profile Send private message
gringo
Advocate
Advocate


Joined: 27 Apr 2003
Posts: 3793

PostPosted: Wed Sep 23, 2009 3:03 pm    Post subject: Reply with quote

looks pretty close to : http://lists.gnu.org/archive/html/dino-list/2009-04/msg00001.html

i´d say try to pull from svn, maybe they have fixed it already, or just try with another gcc version.

hope this helps.

cheers
_________________
Error: Failing not supported by current locale
Back to top
View user's profile Send private message
Display posts from previous:   
Reply to topic    Gentoo Forums Forum Index Unsupported Software All times are GMT
Page 1 of 1

 
Jump to:  
You cannot post new topics in this forum
You cannot reply to topics in this forum
You cannot edit your posts in this forum
You cannot delete your posts in this forum
You cannot vote in polls in this forum