Gentoo Forums
Gentoo Forums
Gentoo Forums
Quick Search: in
[gelöst] Emerge Blockers: Bitte helft mir!
View unanswered posts
View posts from last 24 hours
View posts from last 7 days

Goto page Previous  1, 2  
Reply to topic    Gentoo Forums Forum Index Deutsches Forum (German)
View previous topic :: View next topic  
Author Message
Josef.95
Advocate
Advocate


Joined: 03 Sep 2007
Posts: 3649
Location: Germany

PostPosted: Sat Jan 23, 2010 1:05 pm    Post subject: Reply with quote

Code:
[ 78%] Building CXX object plasma/CMakeFiles/plasma.dir/widgets/webview.o
[ 78%] Building CXX object plasma/CMakeFiles/plasma.dir/glapplet.o
[ 78%] Built target file-handbook
make[2]: *** Keine Regel vorhanden, um das Target »/usr/lib64/qt4/libQtOpenGL.so«,
benötigt von »lib/libplasma.so.3.0.0«, zu erstellen. Schluss.
make[2]: *** Warte auf noch nicht beendete Prozesse...
[ 78%] Building CXX object plasma/CMakeFiles/plasma.dir/widgets/videowidget.o
Scanning dependencies of target help-handbook
[ 78%] Generating index.cache.bz2
make[1]: *** [plasma/CMakeFiles/plasma.dir/all] Fehler 2
make[1]: *** Warte auf noch nicht beendete Prozesse...
[ 78%] Built target ftp-handbook
[ 78%] Built target help-handbook
make: *** [all] Fehler 2

Karsten1973 wrote:
Sagen irgendjemand die Fehlermeldungen was sinnvolles?
Nicht wirklich, bin da aber auch kein Fachmann...

Würde kdelibs mit USE="-handbook" durchgehen?

Code:
$ equery b libQtOpenGL.so                                 
 * Searching for libQtOpenGL.so ...                                           
x11-libs/qt-opengl
(gekürzt)

Evtl. liegt es aber auch an Qt ?!
Sind die Qt libs alle sauber gebaut worden?
ist natürlich ein ganz schöner haufen..., aber im zweifel baue die doch noch mal neu, zb via
Code:
 emerge -av1 $(qlist -I -C x11-libs/qt)
(hierfür müsste "portage-utils" installiert sein)
Back to top
View user's profile Send private message
Karsten1973
Apprentice
Apprentice


Joined: 17 Dec 2004
Posts: 298
Location: Berlin, Germany

PostPosted: Sat Jan 23, 2010 1:06 pm    Post subject: Reply with quote

Max Steel wrote:
Hmmm, kannst du uns mal die komplette build.log gnopasten? soll heißen:
cat /var/tmp/portage/kde-base/kdelibs-4.3.4/temp/build.log | gnopaster
http://nopaste.info/a64446d332.html
Quote:

(Von allen Paketen wo du akut Fehler findest.
(Gibt auch andere nopaste Dienste.)

wie sieht deine aktuelle make.conf aus?
cat /etc/make.conf | gnopaster

Mit qt-4.6 läufts auch.
http://nopaste.info/ff146da325.html
_________________
I could be arguing on my own time.
Back to top
View user's profile Send private message
Karsten1973
Apprentice
Apprentice


Joined: 17 Dec 2004
Posts: 298
Location: Berlin, Germany

PostPosted: Sat Jan 23, 2010 1:16 pm    Post subject: Reply with quote

Da das mit dem build.log der kdelibs nicht so richtig geklappt hat

http://www.cyberpunk2020.de/wp-content/uploads/build.log
_________________
I could be arguing on my own time.
Back to top
View user's profile Send private message
Max Steel
Advocate
Advocate


Joined: 12 Feb 2007
Posts: 2044
Location: My own world! I and Gentoo!

PostPosted: Sat Jan 23, 2010 1:20 pm    Post subject: Reply with quote

Ich würde probieren ob ein Update von qt auf die Version 4.6.1 etwas bringt.

Mit 4.6.0 ist es hier gerade durchgelaufen.
_________________
mfg
Steel
___________________
Sorry for my bad English.

Heim-PC: Intel i7-5820K, 32GB RAM, GTX 1080
Laptop: Intel Core i5-4300U, 16GB RAM, Intel Graphic
Arbeit-PC: Intel i5-3470S, 16GB RAM, Intel Graphic


Last edited by Max Steel on Sat Jan 23, 2010 1:21 pm; edited 2 times in total
Back to top
View user's profile Send private message
Karsten1973
Apprentice
Apprentice


Joined: 17 Dec 2004
Posts: 298
Location: Berlin, Germany

PostPosted: Sat Jan 23, 2010 1:20 pm    Post subject: Reply with quote

localhost ~ # equery b libQtOpenGL.so
[ Searching for file(s) libQtOpenGL.so in *... ]
x11-libs/qt-opengl-4.5.3-r1 (/usr/lib64/qt4/libQtOpenGL.so -> libQtOpenGL.so.4.5.3)
app-emulation/emul-linux-x86-qtlibs-20091231 (/usr/lib32/qt4/libQtOpenGL.so -> libQtOpenGL.so.4.5.3)
localhost ~ #
_________________
I could be arguing on my own time.
Back to top
View user's profile Send private message
Karsten1973
Apprentice
Apprentice


Joined: 17 Dec 2004
Posts: 298
Location: Berlin, Germany

PostPosted: Sat Jan 23, 2010 1:35 pm    Post subject: Reply with quote

kdelibs mit -handbook zu komplieren führt zu diesem Fehler:

Quote:
[ 79%] Building CXX object kde3support/CMakeFiles/kde3support.dir/kdecore/k3process.o
[ 79%] Building CXX object kde3support/CMakeFiles/kde3support.dir/kdecore/k3processcontroller.o
[ 79%] Building CXX object kde3support/CMakeFiles/kde3support.dir/kdecore/k3procio.o
/var/tmp/portage/kde-base/kdelibs-4.3.4/work/kdelibs-4.3.4/kde3support/kdecore/k3process.cpp: In member function »void K3Process::setupEnvironment()«:
/var/tmp/portage/kde-base/kdelibs-4.3.4/work/kdelibs-4.3.4/kde3support/kdecore/k3process.cpp:151: Warnung: Der Rückgabewert von »int chdir(const char*)«, der mit dem Attribut warn_unused_result deklariert wurde, wird ignoriert
/var/tmp/portage/kde-base/kdelibs-4.3.4/work/kdelibs-4.3.4/kde3support/kdecore/k3process.cpp: In member function »virtual bool K3Process::start(K3Process::RunMode, QFlags<K3Process::CommunicationFlag>)«:
/var/tmp/portage/kde-base/kdelibs-4.3.4/work/kdelibs-4.3.4/kde3support/kdecore/k3process.cpp:347: Warnung: Der Rückgabewert von »ssize_t write(int, const void*, size_t)«, der mit dem Attribut warn_unused_result deklariert wurde, wird ignoriert
/var/tmp/portage/kde-base/kdelibs-4.3.4/work/kdelibs-4.3.4/kde3support/kdecore/k3processcontroller.cpp: In static member function »static void K3ProcessController::theSigCHLDHandler(int)«:
/var/tmp/portage/kde-base/kdelibs-4.3.4/work/kdelibs-4.3.4/kde3support/kdecore/k3processcontroller.cpp:206: Warnung: Der Rückgabewert von »ssize_t write(int, const void*, size_t)«, der mit dem Attribut warn_unused_result deklariert wurde, wird ignoriert
/var/tmp/portage/kde-base/kdelibs-4.3.4/work/kdelibs-4.3.4/kde3support/kdecore/k3processcontroller.cpp: In member function »void K3ProcessController::rescheduleCheck()«:
/var/tmp/portage/kde-base/kdelibs-4.3.4/work/kdelibs-4.3.4/kde3support/kdecore/k3processcontroller.cpp:239: Warnung: Der Rückgabewert von »ssize_t write(int, const void*, size_t)«, der mit dem Attribut warn_unused_result deklariert wurde, wird ignoriert
/var/tmp/portage/kde-base/kdelibs-4.3.4/work/kdelibs-4.3.4/kde3support/kdecore/k3processcontroller.cpp: In member function »void K3ProcessController::slotDoHousekeeping()«:
/var/tmp/portage/kde-base/kdelibs-4.3.4/work/kdelibs-4.3.4/kde3support/kdecore/k3processcontroller.cpp:246: Warnung: Der Rückgabewert von »ssize_t read(int, void*, size_t)«, der mit dem Attribut warn_unused_result deklariert wurde, wird ignoriert
In file included from /var/tmp/portage/kde-base/kdelibs-4.3.4/work/kdelibs-4.3.4/kde3support/kdecore/k3procio.cpp:20:
/var/tmp/portage/kde-base/kdelibs-4.3.4/work/kdelibs-4.3.4/kde3support/kdecore/k3process.h:267: Warnung: »virtual bool K3Process::start(K3Process::RunMode, QFlags<K3Process::CommunicationFlag>)« war versteckt
/var/tmp/portage/kde-base/kdelibs-4.3.4/work/kdelibs-4.3.4/kde3support/kdecore/k3procio.h:88: Warnung: von »bool K3ProcIO::start(K3Process::RunMode, bool)«
Linking CXX shared library ../lib/libkde3support.so
[ 79%] Built target kde3support
make: *** [all] Fehler 2
*
* ERROR: kde-base/kdelibs-4.3.4 failed.
* Call stack:


Ich versuche jetzt mal das qt upgrade auf 4.6.1
_________________
I could be arguing on my own time.
Back to top
View user's profile Send private message
Max Steel
Advocate
Advocate


Joined: 12 Feb 2007
Posts: 2044
Location: My own world! I and Gentoo!

PostPosted: Sat Jan 23, 2010 1:57 pm    Post subject: Reply with quote

Bitte etwas mehr Output, der eigentliche Fehler ist hier leider noch nicht dabei.

Ansonsten jo, probier mal das Update.
_________________
mfg
Steel
___________________
Sorry for my bad English.

Heim-PC: Intel i7-5820K, 32GB RAM, GTX 1080
Laptop: Intel Core i5-4300U, 16GB RAM, Intel Graphic
Arbeit-PC: Intel i5-3470S, 16GB RAM, Intel Graphic
Back to top
View user's profile Send private message
Karsten1973
Apprentice
Apprentice


Joined: 17 Dec 2004
Posts: 298
Location: Berlin, Germany

PostPosted: Sat Jan 23, 2010 2:00 pm    Post subject: Reply with quote

gerne:

Quote:
/var/tmp/portage/kde-base/kdelibs-4.3.4/work/kdelibs-4.3.4/plasma/widgets/pushbutton.cpp: In member function »void Plasma::PushButton::setIcon(const QIcon&)«:
/var/tmp/portage/kde-base/kdelibs-4.3.4/work/kdelibs-4.3.4/plasma/widgets/pushbutton.cpp:243: Warnung: »void KPushButton::setIcon(const QIcon&)« ist veraltet (deklariert bei /var/tmp/portage/kde-base/kdelibs-4.
3.4/work/kdelibs-4.3.4/kdeui/widgets/kpushbutton.h:109)
[ 77%] Building CXX object kate/CMakeFiles/testkateregression.dir/utils/katedynamicanimation.o
[ 77%] Building CXX object plasma/CMakeFiles/plasma.dir/widgets/radiobutton.o
[ 77%] Building CXX object plasma/CMakeFiles/plasma.dir/widgets/scrollbar.o
[ 77%] Building CXX object kate/CMakeFiles/testkateregression.dir/utils/katestyletreewidget.o
[ 77%] Building CXX object plasma/CMakeFiles/plasma.dir/widgets/signalplotter.o
[ 77%] Building CXX object kate/CMakeFiles/testkateregression.dir/utils/katepartpluginmanager.o
[ 77%] Building CXX object plasma/CMakeFiles/plasma.dir/widgets/slider.o
[ 77%] Building CXX object kate/CMakeFiles/testkateregression.dir/utils/katehistorymodel.o
[ 77%] [ 77%] Building CXX object kate/CMakeFiles/testkateregression.dir/tests/test_regression.o
Building CXX object plasma/CMakeFiles/plasma.dir/widgets/spinbox.o
[ 77%] Building CXX object plasma/CMakeFiles/plasma.dir/widgets/toolbutton.o
[ 77%] Built target data-handbook
/var/tmp/portage/kde-base/kdelibs-4.3.4/work/kdelibs-4.3.4/kate/tests/test_regression.cpp: In member function »void RegressionTest::doFailureReport(const QString&, int)«:
/var/tmp/portage/kde-base/kdelibs-4.3.4/work/kdelibs-4.3.4/kate/tests/test_regression.cpp:884: Warnung: Der Rückgabewert von »char* getcwd(char*, size_t)«, der mit dem Attribut warn_unused_result deklariert wur
de, wird ignoriert
/var/tmp/portage/kde-base/kdelibs-4.3.4/work/kdelibs-4.3.4/kate/tests/test_regression.cpp:885: Warnung: Der Rückgabewert von »int chdir(const char*)«, der mit dem Attribut warn_unused_result deklariert wurde, w
ird ignoriert
/var/tmp/portage/kde-base/kdelibs-4.3.4/work/kdelibs-4.3.4/kate/tests/test_regression.cpp:919: Warnung: Der Rückgabewert von »int chdir(const char*)«, der mit dem Attribut warn_unused_result deklariert wurde, w
ird ignoriert
In file included from /var/tmp/portage/kde-base/kdelibs-4.3.4/work/kdelibs-4.3.4/kate/tests/test_regression.cpp:1377:
/var/tmp/portage/kde-base/kdelibs-4.3.4/work/kdelibs-4.3.4/kate/tests/test_regression.cpp: At global scope:
/var/tmp/portage/kde-base/kdelibs-4.3.4/work/kdelibs-4.3.4/kate/tests/test_regression.cpp:821: Warnung: »void pause(int)« definiert, aber nicht verwendet
[ 77%] [ 77%] Building CXX object plasma/CMakeFiles/plasma.dir/widgets/busywidget.o
Building CXX object kate/CMakeFiles/testkateregression.dir/tests/codecompletiontestmodel.o
[ 77%] Building CXX object plasma/CMakeFiles/plasma.dir/widgets/scrollwidget.o
[ 77%] [ 77%] Building CXX object plasma/CMakeFiles/plasma.dir/widgets/svgwidget.o
Building CXX object kate/CMakeFiles/testkateregression.dir/tests/completiontest.o
/var/tmp/portage/kde-base/kdelibs-4.3.4/work/kdelibs-4.3.4/plasma/widgets/scrollwidget.cpp: In member function »void Plasma::ScrollWidgetPrivate::adjustClipping()«:
/var/tmp/portage/kde-base/kdelibs-4.3.4/work/kdelibs-4.3.4/plasma/widgets/scrollwidget.cpp:105: Warnung: Variable »clip« wird nicht verwendet
[ 77%] Building CXX object plasma/CMakeFiles/plasma.dir/widgets/tabbar.o
[ 77%] Building CXX object plasma/CMakeFiles/plasma.dir/widgets/textbrowser.o
[ 77%] Building CXX object plasma/CMakeFiles/plasma.dir/widgets/treeview.o
[ 77%] Building CXX object plasma/CMakeFiles/plasma.dir/widgets/textedit.o
[ 77%] Building CXX object plasma/CMakeFiles/plasma.dir/widgets/webview.o
/var/tmp/portage/kde-base/kdelibs-4.3.4/work/kdelibs-4.3.4/kate/tests/completiontest.cpp: In member function »void CompletionTest::testAbortImmideatelyAfterStart()«:
/var/tmp/portage/kde-base/kdelibs-4.3.4/work/kdelibs-4.3.4/kate/tests/completiontest.cpp:447: Warnung: Variable »model« wird nicht verwendet
/var/tmp/portage/kde-base/kdelibs-4.3.4/work/kdelibs-4.3.4/kate/tests/completiontest.cpp:449: Warnung: Variable »testModel« wird nicht verwendet
[ 77%] Linking CXX executable testkateregression
Building CXX object plasma/CMakeFiles/plasma.dir/glapplet.o
make[2]: *** Keine Regel vorhanden, um das Target »/usr/lib64/qt4/libQtOpenGL.so«,
benötigt von »lib/libplasma.so.3.0.0«, zu erstellen. Schluss.
make[2]: *** Warte auf noch nicht beendete Prozesse...
[ 77%] Building CXX object plasma/CMakeFiles/plasma.dir/widgets/videowidget.o
Scanning dependencies of target file-handbook
[ 77%] Generating index.cache.bz2
make[1]: *** [plasma/CMakeFiles/plasma.dir/all] Fehler 2
make[1]: *** Warte auf noch nicht beendete Prozesse...
[ 78%] Built target testkateregression
[ 78%] Built target file-handbook
make: *** [all] Fehler 2
*
* ERROR: kde-base/kdelibs-4.3.4 failed.
* Call stack:
* ebuild.sh, line 49: Called src_compile
* environment, line 3778: Called kde4-base_src_compile
* environment, line 2869: Called cmake-utils_src_compile
* environment, line 1010: Called _execute_optionaly 'src_compile'
* environment, line 429: Called enable_cmake-utils_src_compile
* environment, line 1379: Called cmake-utils_src_make
* environment, line 1029: Called die
* The specific snippet of code:
* emake "$@" || die "Make failed!";
* The die message:
* Make failed!
*
* If you need support, post the topmost build error, and the call stack if relevant.
* A complete build log is located at '/var/tmp/portage/kde-base/kdelibs-4.3.4/temp/build.log'.
* The ebuild environment file is located at '/var/tmp/portage/kde-base/kdelibs-4.3.4/temp/environment'.
*

>>> Failed to emerge kde-base/kdelibs-4.3.4, Log file:

_________________
I could be arguing on my own time.
Back to top
View user's profile Send private message
Karsten1973
Apprentice
Apprentice


Joined: 17 Dec 2004
Posts: 298
Location: Berlin, Germany

PostPosted: Sat Jan 23, 2010 3:54 pm    Post subject: Reply with quote

kdelibs hat gerade zu ende kompiliert - das neue qt scheint hier den nötigen Schub gebracht zu haben. Drückt mir den Daumen für den Rest der Pakete!
_________________
I could be arguing on my own time.
Back to top
View user's profile Send private message
Karsten1973
Apprentice
Apprentice


Joined: 17 Dec 2004
Posts: 298
Location: Berlin, Germany

PostPosted: Sat Jan 23, 2010 7:19 pm    Post subject: Reply with quote

Danke für die Hilfe, ich bin durch! Qt war der Schlingel... offenbar ist kde 4.3.4 nicht mit einer qt-3.x aus dem stable branch kompatibel...
_________________
I could be arguing on my own time.
Back to top
View user's profile Send private message
Max Steel
Advocate
Advocate


Joined: 12 Feb 2007
Posts: 2044
Location: My own world! I and Gentoo!

PostPosted: Sat Jan 23, 2010 7:57 pm    Post subject: Reply with quote

Karsten1973 wrote:
kde 4.3.4 nicht mit einer qt-3.x aus dem stable branch kompatibel...


KDE-4 ist sowieso nicht mit qt-3 kompatibel.
KDE-3 ist aber auch nicht mit qt-4 kompatibel ^^
qt-3 ist für KDE-3
und qt-4 für KDE-4 ;)
_________________
mfg
Steel
___________________
Sorry for my bad English.

Heim-PC: Intel i7-5820K, 32GB RAM, GTX 1080
Laptop: Intel Core i5-4300U, 16GB RAM, Intel Graphic
Arbeit-PC: Intel i5-3470S, 16GB RAM, Intel Graphic
Back to top
View user's profile Send private message
Karsten1973
Apprentice
Apprentice


Joined: 17 Dec 2004
Posts: 298
Location: Berlin, Germany

PostPosted: Sat Jan 23, 2010 8:32 pm    Post subject: Reply with quote

Ulkig eben nur, das ich bei 4.3.3 super damit hinkam, und bei 4.3.4 qt zum Problem wurde. Damit hab ich eben nicht mehr gerechnet.
_________________
I could be arguing on my own time.
Back to top
View user's profile Send private message
Display posts from previous:   
Reply to topic    Gentoo Forums Forum Index Deutsches Forum (German) All times are GMT
Goto page Previous  1, 2
Page 2 of 2

 
Jump to:  
You cannot post new topics in this forum
You cannot reply to topics in this forum
You cannot edit your posts in this forum
You cannot delete your posts in this forum
You cannot vote in polls in this forum