Gentoo Forums
Gentoo Forums
Gentoo Forums
Quick Search: in
[kde-testing] and [kde-crazy] KDE4 overlays thread (part 5)
View unanswered posts
View posts from last 24 hours

Goto page Previous  1, 2, 3 ... 11, 12, 13 ... 19, 20, 21  Next  
Reply to topic    Gentoo Forums Forum Index Unsupported Software
View previous topic :: View next topic  
Author Message
Lustmored
Apprentice
Apprentice


Joined: 28 May 2010
Posts: 206
Location: Poland

PostPosted: Sun Jan 09, 2011 2:19 pm    Post subject: Reply with quote

Ouh I see than. So it compiles fine without HAL, although it always warn me about locale set to some strange ANSI :|

Quote:
System locale charset is ANSI_X3.4-1968
Your system's locale charset (i.e. the charset used to encode filenames) is set to ANSI_X3.4-1968. It is highly unlikely that this has been done intentionally. Most likely the locale is not set at all. An invalid setting will result in problems when creating data projects.
Solution: To properly set the locale charset make sure the LC_* environment variables are set. Normally the distribution setup tools take care of this.


Something bad?

[EDIT] Nevermind, my locales were not set
Back to top
View user's profile Send private message
Finswimmer
Moderator
Moderator


Joined: 02 Sep 2004
Posts: 5467
Location: Langen (Hessen), Germany

PostPosted: Sun Jan 09, 2011 10:41 pm    Post subject: Reply with quote

Code:
 * Package:    app-pda/funambol-client-sdk-9999
 * Repository: kde
 * Maintainer: kde@gentoo.org
 * USE:        amd64 elibc_glibc kernel_linux multilib userland_GNU
 * FEATURES:   sandbox
>>> Unpacking source...
 * subversion check out start -->
 *      repository: https://client-sdk.forge.funambol.org/svn/client-sdk/trunk/cpp-sdk

-----------------------------------------------------------------------
ATTENTION!  Your password for authentication realm:

   <https://client-sdk.forge.funambol.org:443> CollabNet Subversion Repository


The SVN serves seems to need a user/password...
_________________
Bitte auf Rechtschreibung, korrekte Formatierung und Höflichkeit achten!
Danke
Back to top
View user's profile Send private message
wrc1944
Advocate
Advocate


Joined: 15 Aug 2002
Posts: 3260
Location: Gainesville, Florida

PostPosted: Mon Jan 10, 2011 12:17 am    Post subject: Reply with quote

TheDodger wrote:
Quote:
k3b has changed to git.
you *must* patch the ebuild per hand to compile him.
Thanks much, but I already knew about the patch you posted on P. 6 (IIRC)
In fact, I used it before the last overlay sync- worked great. :) However, on bugzilla they said it was fixed in the overlay, so I figured I didn't need to do that every time I synced the overlay. Apparently it's not fixed, as the 9999 ebuild doesn't point to git. https://bugs.gentoo.org/show_bug.cgi?id=348223

Seems like kwebkitpart now has the same type problem. :(
_________________
Main box- AsRock x370 Gaming K4
Ryzen 1700, 3.0GHz, 16GB GSkill Flare DDR4 3200mhz
Samsung SATA 1000GB, Radeon HD R7 350 2GB DDR5
Gentoo ~amd64 plasma, glibc-2.30-r2, gcc-9.2.0 kernel-5.4.1-gentoo USE=experimental
Back to top
View user's profile Send private message
Lustmored
Apprentice
Apprentice


Joined: 28 May 2010
Posts: 206
Location: Poland

PostPosted: Mon Jan 10, 2011 11:36 pm    Post subject: Reply with quote

KDEPIM from overlay is completely not working. I mean - ebuilds does not work. I have it installed other way and runs fine ;)

There are problems with tarballs (4.5.94.1 ?)
Kalarm needed patch for me to work (patch from upstream mailing list):
/var/paludis/repositories/my/kde-base/kalarm/files/disable-kalarm-akonadi.diff wrote:
--- kalarm/CMakeLists.txt.orig 2011-01-08 15:37:37.483307819 +0100
+++ kalarm/CMakeLists.txt 2011-01-08 15:37:58.416490765 +0100
@@ -5,6 +5,11 @@
# Akonadi for KAlarm is still experimental.
option(KALARM_USE_AKONADI "Build to use Akonadi" TRUE)

+# Kalarm from kdepim master needs kdepimlibs 4.7
+if(NOT ${KDE_VERSION} VERSION_GREATER 4.6.40)
+ set(KALARM_USE_AKONADI FALSE)
+endif()
+
if(KALARM_USE_AKONADI)
add_definitions(-DUSE_AKONADI)
else(KALARM_USE_AKONADI)


And of course it needs akonadi-server-1.4.95, but that one is already in overlay :)
Back to top
View user's profile Send private message
LukynZ
Apprentice
Apprentice


Joined: 19 Dec 2008
Posts: 230
Location: The Czech Republic

PostPosted: Tue Jan 11, 2011 10:44 am    Post subject: Reply with quote

same problem here...kdepim 4.5.94.1 doesn't exists
Back to top
View user's profile Send private message
Finswimmer
Moderator
Moderator


Joined: 02 Sep 2004
Posts: 5467
Location: Langen (Hessen), Germany

PostPosted: Tue Jan 11, 2011 4:26 pm    Post subject: Reply with quote

LukynZ wrote:
same problem here...kdepim 4.5.94.1 doesn't exists


It seems as if only kdepim-4.5.94 exists
_________________
Bitte auf Rechtschreibung, korrekte Formatierung und Höflichkeit achten!
Danke
Back to top
View user's profile Send private message
mkyral
Apprentice
Apprentice


Joined: 06 May 2007
Posts: 156
Location: Czech Republic

PostPosted: Tue Jan 11, 2011 7:58 pm    Post subject: qt designer crash Reply with quote

Someone else with qt designer crashing on startup? I re-merged qt-gui - no change. Revdep-rebuild found nothing.
I did not found relevant bug on bugs.gentoo.org or http://bugreports.qt.nokia.com.

qt-gui-4.7.1-r1 - I'm not sure when exactly it started crashing - I did not used designer about month.

Code:
$ designer                                                                                                                                                                                                                           
*** glibc detected *** designer: free(): invalid pointer: 0x0000000001952210 ***
======= Backtrace: =========
/lib/libc.so.6[0x3a296727a6]
/usr/lib64/qt4/libQtDesigner.so.4(_ZN18qdesigner_internal14WidgetDataBase21defaultPropertyValuesERK7QString+0x157)[0x7f170e1a2e47]
/usr/lib64/qt4/libQtDesigner.so.4(_ZN18qdesigner_internal14WidgetDataBase25grabDefaultPropertyValuesEv+0x79)[0x7f170e1a31b9]
designer[0x433019]
designer[0x42c2d5]
designer[0x42c839]
designer[0x42b1ef]
/lib/libc.so.6(__libc_start_main+0xfd)[0x3a2961ecdd]
designer[0x4184b9]
======= Memory map: ========
00400000-0046c000 r-xp 00000000 08:05 957818                             /usr/bin/designer
0066b000-0066c000 r--p 0006b000 08:05 957818                             /usr/bin/designer
0066c000-0066e000 rw-p 0006c000 08:05 957818                             /usr/bin/designer
0066e000-0066f000 rw-p 00000000 00:00 0
011db000-01a2b000 rw-p 00000000 00:00 0                                  [heap]
3a29200000-3a2921e000 r-xp 00000000 08:05 1651757                        /lib64/ld-2.12.2.so
3a2941d000-3a2941e000 r--p 0001d000 08:05 1651757                        /lib64/ld-2.12.2.so
3a2941e000-3a2941f000 rw-p 0001e000 08:05 1651757                        /lib64/ld-2.12.2.so
3a2941f000-3a29420000 rw-p 00000000 00:00 0
3a29600000-3a29762000 r-xp 00000000 08:05 1651781                        /lib64/libc-2.12.2.so
3a29762000-3a29962000 ---p 00162000 08:05 1651781                        /lib64/libc-2.12.2.so
3a29962000-3a29966000 r--p 00162000 08:05 1651781                        /lib64/libc-2.12.2.so
3a29966000-3a29967000 rw-p 00166000 08:05 1651781                        /lib64/libc-2.12.2.so
3a29967000-3a2996c000 rw-p 00000000 00:00 0
3a29a00000-3a29a81000 r-xp 00000000 08:05 1651876                        /lib64/libm-2.12.2.so
3a29a81000-3a29c80000 ---p 00081000 08:05 1651876                        /lib64/libm-2.12.2.so
3a29c80000-3a29c81000 r--p 00080000 08:05 1651876                        /lib64/libm-2.12.2.so
3a29c81000-3a29c82000 rw-p 00081000 08:05 1651876                        /lib64/libm-2.12.2.so
3a29e00000-3a29e18000 r-xp 00000000 08:05 1651857                        /lib64/libpthread-2.12.2.so
3a29e18000-3a2a017000 ---p 00018000 08:05 1651857                        /lib64/libpthread-2.12.2.so
3a2a017000-3a2a018000 r--p 00017000 08:05 1651857                        /lib64/libpthread-2.12.2.so
3a2a018000-3a2a019000 rw-p 00018000 08:05 1651857                        /lib64/libpthread-2.12.2.so
3a2a019000-3a2a01d000 rw-p 00000000 00:00 0
3a2a200000-3a2a202000 r-xp 00000000 08:05 1651863                        /lib64/libdl-2.12.2.so
3a2a202000-3a2a402000 ---p 00002000 08:05 1651863                        /lib64/libdl-2.12.2.so
3a2a402000-3a2a403000 r--p 00002000 08:05 1651863                        /lib64/libdl-2.12.2.so
3a2a403000-3a2a404000 rw-p 00003000 08:05 1651863                        /lib64/libdl-2.12.2.so
3a2a600000-3a2a616000 r-xp 00000000 08:05 1652306                        /lib64/libz.so.1.2.5
3a2a616000-3a2a816000 ---p 00016000 08:05 1652306                        /lib64/libz.so.1.2.5
3a2a816000-3a2a817000 r--p 00016000 08:05 1652306                        /lib64/libz.so.1.2.5
3a2a817000-3a2a818000 rw-p 00017000 08:05 1652306                        /lib64/libz.so.1.2.5
3a2aa00000-3a2aa15000 r-xp 00000000 08:05 1652305                        /lib64/libgcc_s.so.1
3a2aa15000-3a2ac14000 ---p 00015000 08:05 1652305                        /lib64/libgcc_s.so.1
3a2ac14000-3a2ac15000 r--p 00014000 08:05 1652305                        /lib64/libgcc_s.so.1
3a2ac15000-3a2ac16000 rw-p 00015000 08:05 1652305                        /lib64/libgcc_s.so.1
3a2ae00000-3a2aeeb000 r-xp 00000000 08:05 695224                         /usr/lib64/gcc/x86_64-pc-linux-gnu/4.5.2/libstdc++.so.6.0.14
3a2aeeb000-3a2b0ea000 ---p 000eb000 08:05 695224                         /usr/lib64/gcc/x86_64-pc-linux-gnu/4.5.2/libstdc++.so.6.0.14
3a2b0ea000-3a2b0f2000 r--p 000ea000 08:05 695224                         /usr/lib64/gcc/x86_64-pc-linux-gnu/4.5.2/libstdc++.so.6.0.14
3a2b0f2000-3a2b0f4000 rw-p 000f2000 08:05 695224                         /usr/lib64/gcc/x86_64-pc-linux-gnu/4.5.2/libstdc++.so.6.0.14
3a2b0f4000-3a2b109000 rw-p 00000000 00:00 0
3a2b200000-3a2b208000 r-xp 00000000 08:05 1651859                        /lib64/librt-2.12.2.so
3a2b208000-3a2b407000 ---p 00008000 08:05 1651859                        /lib64/librt-2.12.2.so
3a2b407000-3a2b408000 r--p 00007000 08:05 1651859                        /lib64/librt-2.12.2.so
3a2b408000-3a2b409000 rw-p 00008000 08:05 1651859                        /lib64/librt-2.12.2.so
3a2b600000-3a2b708000 r-xp 00000000 08:05 681449                         /usr/lib64/libglib-2.0.so.0.2600.1
3a2b708000-3a2b907000 ---p 00108000 08:05 681449                         /usr/lib64/libglib-2.0.so.0.2600.1
3a2b907000-3a2b908000 r--p 00107000 08:05 681449                         /usr/lib64/libglib-2.0.so.0.2600.1
3a2b908000-3a2b909000 rw-p 00108000 08:05 681449                         /usr/lib64/libglib-2.0.so.0.2600.1
3a2b909000-3a2b90a000 rw-p 00000000 00:00 0
3a2ba00000-3a2ba04000 r-xp 00000000 08:05 681455                         /usr/lib64/libgthread-2.0.so.0.2600.1
3a2ba04000-3a2bc03000 ---p 00004000 08:05 681455                         /usr/lib64/libgthread-2.0.so.0.2600.1
3a2bc03000-3a2bc04000 r--p 00003000 08:05 681455                         /usr/lib64/libgthread-2.0.so.0.2600.1
3a2bc04000-3a2bc05000 rw-p 00004000 08:05 681455                         /usr/lib64/libgthread-2.0.so.0.2600.1
3a2be00000-3a2be1d000 r-xp 00000000 08:05 681463                         /usr/lib64/libxcb.so.1.1.0
3a2be1d000-3a2c01c000 ---p 0001d000 08:05 681463                         /usr/lib64/libxcb.so.1.1.0
3a2c01c000-3a2c01d000 r--p 0001c000 08:05 681463                         /usr/lib64/libxcb.so.1.1.0
3a2c01d000-3a2c01e000 rw-p 0001d000 08:05 681463                         /usr/lib64/libxcb.so.1.1.0
3a2c200000-3a2c33c000 r-xp 00000000 08:05 681464                         /usr/lib64/libX11.so.6.3.0
3a2c33c000-3a2c53c000 ---p 0013c000 08:05 681464                         /usr/lib64/libX11.so.6.3.0
3a2c53c000-3a2c53d000 r--p 0013c000 08:05 681464                         /usr/lib64/libX11.so.6.3.0
3a2c53d000-3a2c542000 rw-p 0013d000 08:05 681464                         /usr/lib64/libX11.so.6.3.0
3a2c600000-3a2c602000 r-xp 00000000 08:05 681460                         /usr/lib64/libXau.so.6.0.0
3a2c602000-3a2c802000 ---p 00002000 08:05 681460                         /usr/lib64/libXau.so.6.0.0Neúspěšně ukončen (SIGABRT)
Back to top
View user's profile Send private message
LukynZ
Apprentice
Apprentice


Joined: 19 Dec 2008
Posts: 230
Location: The Czech Republic

PostPosted: Wed Jan 12, 2011 6:44 am    Post subject: Reply with quote

Finswimmer wrote:
LukynZ wrote:
same problem here...kdepim 4.5.94.1 doesn't exists


It seems as if only kdepim-4.5.94 exists


I am sometimes wondering, if the ebuilds are even tested before putting them into the trees, 'case some fails are really only about "just change the version, it will surely works"
Back to top
View user's profile Send private message
guilc
Bodhisattva
Bodhisattva


Joined: 15 Nov 2003
Posts: 3326
Location: Paris - France

PostPosted: Wed Jan 12, 2011 12:45 pm    Post subject: Reply with quote

Ebuild IS tested, but the 4.5.94.1 tarballs are curently only available to devs, for tests and packaging.
It will be soon released to public FTP...
_________________
Merci de respecter les règles du forum.

Mon site perso : https://www.xwing.info
Mon PORTDIR_OVERLAY : https://gentoo.xwing.info ou layman -a xwing
Back to top
View user's profile Send private message
Lustmored
Apprentice
Apprentice


Joined: 28 May 2010
Posts: 206
Location: Poland

PostPosted: Wed Jan 12, 2011 4:31 pm    Post subject: Reply with quote

Indeed:

ftp://ftp.kde.org/pub/kde/unstable/kdepim/4.5.94.1/src/

But empty so far :lol:
Back to top
View user's profile Send private message
ToeiRei
Veteran
Veteran


Joined: 03 Jan 2005
Posts: 1173
Location: Austria

PostPosted: Wed Jan 12, 2011 5:05 pm    Post subject: Reply with quote

Finswimmer wrote:
LukynZ wrote:
same problem here...kdepim 4.5.94.1 doesn't exists


It seems as if only kdepim-4.5.94 exists


Still in ktown - available for packagers; ( ftp://ktown.kde.org/pub/kde/unstable/kdepim/4.5.94.1/src )
_________________
Please stand by - The mailer daemon is busy burning your messages in hell...
Back to top
View user's profile Send private message
LukynZ
Apprentice
Apprentice


Joined: 19 Dec 2008
Posts: 230
Location: The Czech Republic

PostPosted: Wed Jan 12, 2011 5:20 pm    Post subject: Reply with quote

Compiling now :)
Back to top
View user's profile Send private message
Finswimmer
Moderator
Moderator


Joined: 02 Sep 2004
Posts: 5467
Location: Langen (Hessen), Germany

PostPosted: Wed Jan 12, 2011 5:52 pm    Post subject: Reply with quote

kde-base/kdepim-runtime-4.5.94.1:

Code:
 *
 * kde-base/kde-l10n-4.5.95
 *      /usr/share/locale/en_GB/LC_MESSAGES/accountwizard_maildir.mo
 *      /usr/share/locale/en_GB/LC_MESSAGES/accountwizard_pop3.mo
 *      /usr/share/locale/en_GB/LC_MESSAGES/akonadi-filestore.mo
 *      /usr/share/locale/en_GB/LC_MESSAGES/akonadi_birthdays_resource.mo
 *      /usr/share/locale/en_GB/LC_MESSAGES/akonadi_imap_resource.mo
 *      /usr/share/locale/en_GB/LC_MESSAGES/akonadi_invitations_agent.mo
 *      /usr/share/locale/en_GB/LC_MESSAGES/akonadi_kdeaccounts_resource.mo
 *      /usr/share/locale/en_GB/LC_MESSAGES/akonadi_knut_resource.mo
 *      /usr/share/locale/en_GB/LC_MESSAGES/akonadi_kolabproxy_resource.mo
 *      /usr/share/locale/en_GB/LC_MESSAGES/akonadi_kresourceassistant.mo
 *      /usr/share/locale/en_GB/LC_MESSAGES/akonadi_localbookmarks_resource.mo
 *      /usr/share/locale/en_GB/LC_MESSAGES/akonadi_mixedmaildir_resource.mo
 *      /usr/share/locale/en_GB/LC_MESSAGES/akonadi_pop3_resource.mo
 *      /usr/share/locale/en_GB/LC_MESSAGES/akonadi_serializer_plugins.mo
 *      /usr/share/locale/en_GB/LC_MESSAGES/akonadi_vcarddir_resource.mo
 *      /usr/share/locale/en_GB/LC_MESSAGES/akonaditray.mo
 *      /usr/share/locale/en_GB/LC_MESSAGES/kaddressbookmigrator.mo
 *      /usr/share/locale/en_GB/LC_MESSAGES/kcal_akonadi.mo
 *      /usr/share/locale/en_GB/LC_MESSAGES/kio_akonadi.mo
 *      /usr/share/locale/en_GB/LC_MESSAGES/kresources_shared_akonadi.mo
 *
 * Package 'kde-base/kdepim-runtime-4.5.94.1' NOT merged due to file
 * collisions. If necessary, refer to your elog messages for the whole
 * content of the above message.

_________________
Bitte auf Rechtschreibung, korrekte Formatierung und Höflichkeit achten!
Danke
Back to top
View user's profile Send private message
firephoto
Veteran
Veteran


Joined: 29 Oct 2003
Posts: 1604
Location: +48° 5' 23.40", -119° 48' 30.00"

PostPosted: Thu Jan 13, 2011 1:54 am    Post subject: Reply with quote

Anyone having issues with powerdevil in 4.6 with it not wanting to have any control over switching off the monitor after the set time?

I thought it was working on one box but it turns out it's just the xorg defaults apparently. I can set it to 1 minute in the performance profile and nothing happens, not even anything in the .xsession-errors. Seems the same with radeon drivers on one box and nvidia drivers on the other.
_________________
#gentoo-kde on freenode
Back to top
View user's profile Send private message
hf.farhad
n00b
n00b


Joined: 18 Oct 2010
Posts: 9

PostPosted: Fri Jan 14, 2011 2:21 pm    Post subject: Reply with quote

Is there any chance for kdepim-9999 ebuilds to get fixed anytime soon? I can't send emails with kmail after last update. kmail just hangs!

another problem is that plasma-runtime-9999 fails to build.
Code:

[ 38%] Building CXX object plasma/kpart/CMakeFiles/plasma-kpart.dir/scripting/rect.o                                                                                             
/var/tmp/portage/kde-base/plasma-runtime-9999/work/plasma-runtime-9999/plasma/declarativeimports/core/dataengineconsumer.cpp:107: warning: unused parameter 'location'           
/var/tmp/portage/kde-base/plasma-runtime-9999/work/plasma-runtime-9999/plasma/declarativeimports/core/dataengineconsumer.cpp:107: warning: unused parameter 'name'
[ 38%] Building CXX object plasma/kpart/CMakeFiles/plasma-kpart.dir/scripting/scriptengine.o
[ 38%] Scanning dependencies of target plasma_appletscript_declarative                                                                                                           
Built target graphicslayoutsbindingsplugin                                                                                                                                       
[ 38%] Building CXX object plasma/containments/newspaper/CMakeFiles/plasma_containment_newspaper.dir/appletmovespacer.o                                                         
[ 39%] Building CXX object plasma/kpart/CMakeFiles/plasma-kpart.dir/scripting/widget.o                                                                                           
[ 40%] Building CXX object plasma/kpart/CMakeFiles/plasma-kpart.dir/plasmakpartcorona.o                                                                                         
[ 41%] Building CXX object plasma/kpart/CMakeFiles/plasma-kpart.dir/plasmakpartview.o                                                                                           
Linking CXX executable plasmapkg                                                                                                                                                 
[ 42%] Building CXX object plasma/containments/newspaper/CMakeFiles/plasma_containment_newspaper.dir/applettitlebar.o                                                           
[ 43%] Building CXX object plasma/containments/newspaper/CMakeFiles/plasma_containment_newspaper.dir/appletscontainer.o                                                         
[ 44%] Building CXX object plasma/containments/newspaper/CMakeFiles/plasma_containment_newspaper.dir/appletsview.o                                                               
[ 45%] Building CXX object plasma/declarativeimports/core/CMakeFiles/corebindingsplugin.dir/theme.o                                                                             
[ 46%] Building CXX object plasma/kpart/CMakeFiles/plasma-kpart.dir/plasmakpart.o                                                                                               
[ 47%] Building CXX object plasma/scriptengines/javascript/CMakeFiles/plasma_appletscript_declarative.dir/plasma_appletscript_declarative_automoc.o                             
[ 47%] Built target plasmapkg                                                                                                                                                   
[ 48%] Building CXX object plasma/scriptengines/javascript/CMakeFiles/plasma_dataenginescript_javascript.dir/simplebindings/dataengine.o
[ 49%] Building CXX object plasma/declarativeimports/core/CMakeFiles/corebindingsplugin.dir/datamodel.o                                                                         
/var/tmp/portage/kde-base/plasma-runtime-9999/work/plasma-runtime-9999/plasma/kpart/plasmakpartcorona.cpp: In member function 'void PlasmaKPartCorona::init()':                 
/var/tmp/portage/kde-base/plasma-runtime-9999/work/plasma-runtime-9999/plasma/kpart/plasmakpartcorona.cpp:44: error: 'setDefaultContainmentPlugin' was not declared in this scope
make[2]: *** [plasma/kpart/CMakeFiles/plasma-kpart.dir/plasmakpartcorona.o] Error 1
make[2]: *** Waiting for unfinished jobs....
[ 50%] Building CXX object plasma/declarativeimports/core/CMakeFiles/corebindingsplugin.dir/datasource.o
/var/tmp/portage/kde-base/plasma-runtime-9999/work/plasma-runtime-9999/plasma/containments/newspaper/applettitlebar.cpp:48: warning: unused parameter 'widget'                   
[ 51%] Linking CXX shared module ../../../lib/plasma_runnerscript_javascript.so
Building CXX object plasma/scriptengines/javascript/CMakeFiles/plasma_dataenginescript_javascript.dir/simplebindings/i18n.o                                                     
Scanning dependencies of target plasma_appletscript_simple_javascript                                                                                                           
[ 52%] Building CXX object plasma/declarativeimports/core/CMakeFiles/corebindingsplugin.dir/svgitem.o                                                                           
Linking CXX shared library ../../../lib/libgraphicswidgetsbindingsplugin.so                                                                                                     
/var/tmp/portage/kde-base/plasma-runtime-9999/work/plasma-runtime-9999/plasma/containments/newspaper/appletsview.cpp:472: warning: unused parameter 'event'                     
[ 53%] [ 54%] Building CXX object plasma/scriptengines/javascript/CMakeFiles/plasma_appletscript_declarative.dir/common/javascriptaddonpackagestructure.o
Building CXX object plasma/scriptengines/javascript/CMakeFiles/plasma_dataenginescript_javascript.dir/simplebindings/qscriptnonguibookkeeping.o                                 
[ 54%] Built target plasma_runnerscript_javascript                                                                                                                               
[ 55%] Building CXX object plasma/containments/newspaper/CMakeFiles/plasma_containment_newspaper.dir/dragcountdown.o
[ 55%] Building CXX object plasma/declarativeimports/core/CMakeFiles/corebindingsplugin.dir/framesvgitem.o                                                                       
[ 56%] Building CXX object plasma/scriptengines/javascript/CMakeFiles/plasma_appletscript_declarative.dir/common/declarativescriptenv.o                                         
[ 56%] Built target graphicswidgetsbindingsplugin                                                                                                                               
[ 56%] Building CXX object plasma/scriptengines/javascript/CMakeFiles/plasma_appletscript_declarative.dir/declarative/packageaccessmanager.o
[ 57%] Building CXX object plasma/scriptengines/javascript/CMakeFiles/plasma_appletscript_declarative.dir/declarative/packageaccessmanagerfactory.o                             
[ 58%] Building CXX object plasma/scriptengines/javascript/CMakeFiles/plasma_appletscript_declarative.dir/plasmoid/abstractjsappletscript.o                                     
[ 59%] Building CXX object plasma/scriptengines/javascript/CMakeFiles/plasma_appletscript_declarative.dir/plasmoid/appletauthorization.o                                         
[ 60%] Building CXX object plasma/scriptengines/javascript/CMakeFiles/plasma_appletscript_declarative.dir/plasmoid/appletinterface.o                                             
[ 61%] Building CXX object plasma/scriptengines/javascript/CMakeFiles/plasma_appletscript_declarative.dir/plasmoid/declarativeappletscript.o                                     
make[1]: *** [plasma/kpart/CMakeFiles/plasma-kpart.dir/all] Error 2                                                                                                             
make[1]: *** Waiting for unfinished jobs....
[ 62%] Building CXX object plasma/scriptengines/javascript/CMakeFiles/plasma_appletscript_declarative.dir/plasmoid/engineaccess.o
/var/tmp/portage/kde-base/plasma-runtime-9999/work/plasma-runtime-9999/plasma/scriptengines/javascript/declarative/packageaccessmanager.cpp:40: warning: unused parameter 'data'
/var/tmp/portage/kde-base/plasma-runtime-9999/work/plasma-runtime-9999/plasma/scriptengines/javascript/declarative/packageaccessmanager.cpp:40: warning: unused parameter 'maxSize'
[ 63%] Building CXX object plasma/scriptengines/javascript/CMakeFiles/plasma_appletscript_declarative.dir/plasmoid/themedsvg.o
[ 63%] Building CXX object plasma/scriptengines/javascript/CMakeFiles/plasma_appletscript_declarative.dir/simplebindings/bytearrayclass.o                                       
/var/tmp/portage/kde-base/plasma-runtime-9999/work/plasma-runtime-9999/plasma/containments/newspaper/dragcountdown.cpp:79: warning: unused parameter 'option'                   
/var/tmp/portage/kde-base/plasma-runtime-9999/work/plasma-runtime-9999/plasma/containments/newspaper/dragcountdown.cpp:79: warning: unused parameter 'widget'
Linking CXX shared module ../../../lib/plasma_dataenginescript_javascript.so
[ 64%] Building CXX object plasma/scriptengines/javascript/CMakeFiles/plasma_appletscript_declarative.dir/simplebindings/bytearrayprototype.o                                   
[ 65%] Building CXX object plasma/scriptengines/javascript/CMakeFiles/plasma_appletscript_declarative.dir/simplebindings/dataengine.o                                           
[ 66%] Building CXX object plasma/scriptengines/javascript/CMakeFiles/plasma_appletscript_declarative.dir/simplebindings/dataenginereceiver.o                                   
[ 67%] Building CXX object plasma/scriptengines/javascript/CMakeFiles/plasma_appletscript_simple_javascript.dir/plasma_appletscript_simple_javascript_automoc.o                 
Linking CXX shared module ../../../lib/plasma_containment_newspaper.so                                                                                                           
[ 68%] Building CXX object plasma/scriptengines/javascript/CMakeFiles/plasma_appletscript_simple_javascript.dir/common/javascriptaddonpackagestructure.o                         
[ 68%] [ 69%] Built target plasma_dataenginescript_javascript                                                                                                                   
[ 70%] Building CXX object plasma/scriptengines/javascript/CMakeFiles/plasma_appletscript_simple_javascript.dir/common/jsscriptenv.o
Building CXX object plasma/scriptengines/javascript/CMakeFiles/plasma_appletscript_declarative.dir/simplebindings/filedialogproxy.o                                             
Linking CXX shared library ../../../lib/libcorebindingsplugin.so                                                                                                                 
[ 71%] Building CXX object plasma/scriptengines/javascript/CMakeFiles/plasma_appletscript_declarative.dir/simplebindings/i18n.o                                                 
[ 72%] Building CXX object plasma/scriptengines/javascript/CMakeFiles/plasma_appletscript_simple_javascript.dir/plasmoid/abstractjsappletscript.o                               
[ 73%] Building CXX object plasma/scriptengines/javascript/CMakeFiles/plasma_appletscript_declarative.dir/simplebindings/icon.o                                                 
[ 73%] Building CXX object plasma/scriptengines/javascript/CMakeFiles/plasma_appletscript_declarative.dir/simplebindings/qscriptbookkeeping.o                                   
[ 74%] Building CXX object plasma/scriptengines/javascript/CMakeFiles/plasma_appletscript_declarative.dir/simplebindings/url.o                                                   
[ 74%] [ 74%] Built target corebindingsplugin                                                                                                                                   
Built target plasma_containment_newspaper
[ 75%] [ 76%] Building CXX object plasma/scriptengines/javascript/CMakeFiles/plasma_appletscript_simple_javascript.dir/plasmoid/appletauthorization.o
Building CXX object plasma/scriptengines/javascript/CMakeFiles/plasma_appletscript_simple_javascript.dir/plasmoid/jsappletinterface.o                                           
[ 76%] Building CXX object plasma/scriptengines/javascript/CMakeFiles/plasma_appletscript_simple_javascript.dir/plasmoid/simplejavascriptapplet.o                               
[ 77%] Building CXX object plasma/scriptengines/javascript/CMakeFiles/plasma_appletscript_simple_javascript.dir/plasmoid/themedsvg.o                                             
[ 78%] Building CXX object plasma/scriptengines/javascript/CMakeFiles/plasma_appletscript_simple_javascript.dir/simplebindings/animationgroup.o                                 
[ 79%] [ 80%] Building CXX object plasma/scriptengines/javascript/CMakeFiles/plasma_appletscript_simple_javascript.dir/simplebindings/anchorlayout.o                             
Building CXX object plasma/scriptengines/javascript/CMakeFiles/plasma_appletscript_simple_javascript.dir/simplebindings/dataenginereceiver.o                                     
[ 81%] Building CXX object plasma/scriptengines/javascript/CMakeFiles/plasma_appletscript_simple_javascript.dir/simplebindings/bytearrayclass.o                                 
[ 82%] Building CXX object plasma/scriptengines/javascript/CMakeFiles/plasma_appletscript_simple_javascript.dir/simplebindings/bytearrayprototype.o                             
[ 83%] Building CXX object plasma/scriptengines/javascript/CMakeFiles/plasma_appletscript_simple_javascript.dir/simplebindings/color.o                                           
[ 83%] Building CXX object plasma/scriptengines/javascript/CMakeFiles/plasma_appletscript_simple_javascript.dir/simplebindings/dataengine.o                                     
[ 84%] Building CXX object plasma/scriptengines/javascript/CMakeFiles/plasma_appletscript_simple_javascript.dir/simplebindings/easingcurve.o                                     
[ 85%] Building CXX object plasma/scriptengines/javascript/CMakeFiles/plasma_appletscript_simple_javascript.dir/simplebindings/font.o                                           
[ 86%] Building CXX object plasma/scriptengines/javascript/CMakeFiles/plasma_appletscript_simple_javascript.dir/simplebindings/filedialogproxy.o                                 
[ 87%] Building CXX object plasma/scriptengines/javascript/CMakeFiles/plasma_appletscript_simple_javascript.dir/simplebindings/graphicsitem.o                                   
[ 88%] Building CXX object plasma/scriptengines/javascript/CMakeFiles/plasma_appletscript_simple_javascript.dir/simplebindings/icon.o                                           
[ 89%] [ 89%] Building CXX object plasma/scriptengines/javascript/CMakeFiles/plasma_appletscript_simple_javascript.dir/simplebindings/i18n.o                                     
Building CXX object plasma/scriptengines/javascript/CMakeFiles/plasma_appletscript_simple_javascript.dir/simplebindings/linearlayout.o                                           
[ 90%] Building CXX object plasma/scriptengines/javascript/CMakeFiles/plasma_appletscript_simple_javascript.dir/simplebindings/gridlayout.o                                     
Linking CXX shared module ../../../lib/plasma_appletscript_declarative.so                                                                                                       
[ 91%] Building CXX object plasma/scriptengines/javascript/CMakeFiles/plasma_appletscript_simple_javascript.dir/simplebindings/painter.o                                         
[ 92%] Building CXX object plasma/scriptengines/javascript/CMakeFiles/plasma_appletscript_simple_javascript.dir/simplebindings/pen.o                                             
[ 93%] Building CXX object plasma/scriptengines/javascript/CMakeFiles/plasma_appletscript_simple_javascript.dir/simplebindings/pixmap.o                                         
[ 94%] Building CXX object plasma/scriptengines/javascript/CMakeFiles/plasma_appletscript_simple_javascript.dir/simplebindings/point.o                                           
[ 95%] Building CXX object plasma/scriptengines/javascript/CMakeFiles/plasma_appletscript_simple_javascript.dir/simplebindings/rect.o                                           
[ 96%] Building CXX object plasma/scriptengines/javascript/CMakeFiles/plasma_appletscript_simple_javascript.dir/simplebindings/qscriptbookkeeping.o                             
[ 96%] Building CXX object plasma/scriptengines/javascript/CMakeFiles/plasma_appletscript_simple_javascript.dir/simplebindings/size.o                                           
[ 97%] Building CXX object plasma/scriptengines/javascript/CMakeFiles/plasma_appletscript_simple_javascript.dir/simplebindings/sizepolicy.o                                     
[ 98%] [ 98%] Built target plasma_appletscript_declarative                                                                                                                       
[ 99%] Building CXX object plasma/scriptengines/javascript/CMakeFiles/plasma_appletscript_simple_javascript.dir/simplebindings/timer.o
Building CXX object plasma/scriptengines/javascript/CMakeFiles/plasma_appletscript_simple_javascript.dir/simplebindings/uiloader.o                                               
[100%] Building CXX object plasma/scriptengines/javascript/CMakeFiles/plasma_appletscript_simple_javascript.dir/simplebindings/url.o                                             
Linking CXX shared module ../../../lib/plasma_appletscript_simple_javascript.so                                                                                                 
[100%] Built target plasma_appletscript_simple_javascript                                                                                                                       
make: *** [all] Error 2
emake failed
 * ERROR: kde-base/plasma-runtime-9999 failed:
 *   Make failed!
 *
 * Call stack:
 *     ebuild.sh, line   56:  Called src_compile
 *   environment, line 4328:  Called kde4-meta_src_compile
 *   environment, line 3378:  Called kde4-base_src_compile
 *   environment, line 3012:  Called cmake-utils_src_compile
 *   environment, line 1190:  Called _execute_optionaly 'src_compile'
 *   environment, line  573:  Called enable_cmake-utils_src_compile
 *   environment, line 1567:  Called cmake-utils_src_make
 *   environment, line 1209:  Called die
 * The specific snippet of code:
 *           emake "$@" || die "Make failed!";
 *
 * If you need support, post the output of 'emerge --info =kde-base/plasma-runtime-9999',
 * the complete build log and the output of 'emerge -pqv =kde-base/plasma-runtime-9999'.
 * This ebuild used the following eclasses from overlays:
 *   /var/lib/layman/kde/eclass/kde4-meta.eclass
 *   /var/lib/layman/kde/eclass/kde4-base.eclass
 *   /var/lib/layman/kde/eclass/kde4-functions.eclass
 * This ebuild is from an overlay named 'kde': '/var/lib/layman/kde/'
 * The complete build log is located at '/var/tmp/portage/kde-base/plasma-runtime-9999/temp/build.log'.
 * The ebuild environment file is located at '/var/tmp/portage/kde-base/plasma-runtime-9999/temp/environment'.
 * S: '/var/tmp/portage/kde-base/plasma-runtime-9999/work/plasma-runtime-9999'


kalzium fails to build to, but this one fails because of some changes in repository structure, emerge can not export a directory from the repository..

Thanks, Farhad
Back to top
View user's profile Send private message
Lustmored
Apprentice
Apprentice


Joined: 28 May 2010
Posts: 206
Location: Poland

PostPosted: Fri Jan 14, 2011 3:05 pm    Post subject: Reply with quote

KMail problem is probably upstream (as -9999 version usually are). You can try removing and re-adding your SMTP account in KMail config. For me it helped with similar problem (although I'm not on -9999).
Back to top
View user's profile Send private message
hf.farhad
n00b
n00b


Joined: 18 Oct 2010
Posts: 9

PostPosted: Fri Jan 14, 2011 3:48 pm    Post subject: Reply with quote

Lustmored wrote:
KMail problem is probably upstream (as -9999 version usually are). You can try removing and re-adding your SMTP account in KMail config. For me it helped with similar problem (although I'm not on -9999).

The thing is, that I can't even build @kdepim-live , because kdepim is moved to git and ebuilds are not fixed , therefore, emerge tries to fetch the code from subversion repository and fails, I'm using kdepim stuff from kde 4.5, and everything else is from kde-live, I think there is some incompability here?
Back to top
View user's profile Send private message
keba
Guru
Guru


Joined: 02 Jun 2006
Posts: 328
Location: Switzerland

PostPosted: Sat Jan 15, 2011 11:16 am    Post subject: pykde4 fails to build Reply with quote

Hey guys,
Pykde4 (4.5.95) fails to build. PyQt4 (4.8.2) is installed. I've searched the forums but I didn't find a solution. Does anyone know how to solve this? Some here have succeeded in building in it...
Thanks

Code:

[ 77%] Building CXX object python/pykde4/CMakeFiles/python_module_PyKDE4_phonon.dir/sip/phonon/sipphononpart7.o
Dans le fichier inclus à partir de /usr/include/python2.6/Python.h:8,
          à partir de /usr/include/python2.6/sip.h:32,
          à partir de /var/tmp/portage/kde-base/pykde4-4.5.95/work/pykde4-4.5.95_build/python/pykde4/sip/phonon/sipAPIphonon.h:11,
          à partir de /var/tmp/portage/kde-base/pykde4-4.5.95/work/pykde4-4.5.95_build/python/pykde4/sip/phonon/sipphononpart7.cpp:7:
/usr/include/python2.6/pyconfig.h:1079:1: attention : « _XOPEN_SOURCE » redéfini
<command-line>: attention : ceci est la localisation d'une précédente définition
Linking CXX shared library ../../lib/pykde/phonon.so
[ 77%] Built target python_module_PyKDE4_phonon
make: *** [all] Erreur 2
emake failed
 * ERROR: kde-base/pykde4-4.5.95 failed:
 *   Make failed!
 *
 * Call stack:
 *     ebuild.sh, line   56:  Called src_compile
 *   environment, line 6629:  Called kde4-meta_src_compile
 *   environment, line 3940:  Called kde4-base_src_compile
 *   environment, line 3574:  Called cmake-utils_src_compile
 *   environment, line 1752:  Called _execute_optionaly 'src_compile'
 *   environment, line  706:  Called enable_cmake-utils_src_compile
 *   environment, line 2129:  Called cmake-utils_src_make
 *   environment, line 1771:  Called die
 * The specific snippet of code:
 *           emake "$@" || die "Make failed!";
 *
 * If you need support, post the output of 'emerge --info =kde-base/pykde4-4.5.95',
 * the complete build log and the output of 'emerge -pqv =kde-base/pykde4-4.5.95'.
 * This ebuild used the following eclasses from overlays:
 *   /var/lib/layman/kde/eclass/kde4-meta.eclass
 *   /var/lib/layman/kde/eclass/kde4-base.eclass
 *   /var/lib/layman/kde/eclass/kde4-functions.eclass
 * This ebuild is from an overlay named 'kde': '/var/lib/layman/kde/'
 * The complete build log is located at '/var/tmp/portage/kde-base/pykde4-4.5.95/temp/build.log'.
 * The ebuild environment file is located at '/var/tmp/portage/kde-base/pykde4-4.5.95/temp/environment'.
 * S: '/var/tmp/portage/kde-base/pykde4-4.5.95/work/pykde4-4.5.95'

_________________
Prayer can change the world!
Back to top
View user's profile Send private message
asturm
Developer
Developer


Joined: 05 Apr 2007
Posts: 7206
Location: Austria

PostPosted: Sun Jan 16, 2011 1:42 pm    Post subject: Reply with quote

k3b with the git-supporting eclass built fine for me, it can't be a matter of days to release those ebuilds to the kde overlay.

edit: amarok-2.4.0 can't find an embedded database, but mariadb was built with +embedded.
_________________
backend.cpp:92:2: warning: #warning TODO - this error message is about as useful as a cooling unit in the arctic
Back to top
View user's profile Send private message
Shining Arcanine
Veteran
Veteran


Joined: 24 Sep 2009
Posts: 1110

PostPosted: Sun Jan 16, 2011 9:50 pm    Post subject: Reply with quote

Has anyone managed to install KDE 4.6 RC2 without semantic desktop support? I tried upgrading, but =kde-base/kdebase-runtime-meta-4.5.95 required =kde-base/attica-4.5.95, which required semantic desktop.
Back to top
View user's profile Send private message
kernelOfTruth
Watchman
Watchman


Joined: 20 Dec 2005
Posts: 6111
Location: Vienna, Austria; Germany; hello world :)

PostPosted: Mon Jan 17, 2011 12:15 pm    Post subject: Reply with quote

*sigh*

why was sys-auth/polkit-kde moved to sys-auth/polkit-kde-agent ?

after I synced portage automatically moved that package to that slot / renamed it


portage wrote:
* Messages for package sys-auth/polkit-kde-0.95.1-r1:

* This package will overwrite one or more files that may belong to other
* packages (see list below). You can use a command such as `portageq
* owners / <filename>` to identify the installed package that owns a
* file. If portageq reports that only one package owns a file then do
* NOT file a bug report. A bug report is only useful if it identifies at
* least two or more packages that are known to install the same file(s).
* If a collision occurs and you can not explain where the file came from
* then you should simply ignore the collision since there is not enough
* information to determine if a real problem exists. Please do NOT file
* a bug report at https://bugs.gentoo.org unless you report exactly which
* two packages install the same file(s). Once again, please do NOT file
* a bug report unless you have completely understood the above message.
*
* Detected file collision(s):
*
* /usr/lib64/kde4/libexec/polkit-kde-authentication-agent-1
* /usr/share/autostart/polkit-kde-authentication-agent-1.desktop
* /usr/share/doc/polkit-kde-0.95.1-r1/agent.README.porting.bz2
*
* Searching all installed packages for file collisions...
*
* Press Ctrl-C to Stop
*
* sys-auth/polkit-kde-agent-0.95.1-r1
* /usr/lib64/kde4/libexec/polkit-kde-authentication-agent-1
* /usr/share/autostart/polkit-kde-authentication-agent-1.desktop
* /usr/share/doc/polkit-kde-0.95.1-r1/agent.README.porting.bz2
*
* Package 'sys-auth/polkit-kde-0.95.1-r1' NOT merged due to file
* collisions. If necessary, refer to your elog messages for the whole
* content of the above message.
* One or more packages are either masked or have missing dependencies:
*
* >=sys-auth/polkit-kde-0.95.1 pulled in by:
* (kde-base/kdelibs-4.5.5::gentoo, installed)
*
* ~dev-python/qscintilla-python-2.4.6 pulled in by:
* (x11-libs/qscintilla-2.4.6::gentoo, installed)


nice :?

btw: portage did the slot-move by itself - wasn't me :P
_________________
https://github.com/kernelOfTruth/ZFS-for-SystemRescueCD/tree/ZFS-for-SysRescCD-4.9.0
https://github.com/kernelOfTruth/pulseaudio-equalizer-ladspa

Hardcore Gentoo Linux user since 2004 :D
Back to top
View user's profile Send private message
mkyral
Apprentice
Apprentice


Joined: 06 May 2007
Posts: 156
Location: Czech Republic

PostPosted: Wed Jan 19, 2011 8:44 pm    Post subject: Reply with quote

genstorm wrote:
edit: amarok-2.4.0 can't find an embedded database, but mariadb was built with +embedded.


Hi,
did you find any workaround? Currently I lost my music database - Amarok shows no tracks in collection and I'm not able to setup the directory with music as the root of collection. If I check some directory, the 'Use' button does nothing and it is not saved even I click on OK. I tried embedded and external database - no change. Even return to 2.3.90 changed nothing :-(

I'm not sure what happen this, I'm not able to find any releted errors in logs :-(
Back to top
View user's profile Send private message
asturm
Developer
Developer


Joined: 05 Apr 2007
Posts: 7206
Location: Austria

PostPosted: Wed Jan 19, 2011 11:17 pm    Post subject: Reply with quote

Not yet, I had more important things to do.

What helped not: deleting the mysqle folder in .kde4/.../apps/amarok
_________________
backend.cpp:92:2: warning: #warning TODO - this error message is about as useful as a cooling unit in the arctic
Back to top
View user's profile Send private message
mkyral
Apprentice
Apprentice


Joined: 06 May 2007
Posts: 156
Location: Czech Republic

PostPosted: Thu Jan 20, 2011 6:04 am    Post subject: Reply with quote

genstorm wrote:
Not yet, I had more important things to do.

What helped not: deleting the mysqle folder in .kde4/.../apps/amarok


I renamed the whole .kde4 directory and started with default cofiguration - doesn't help :-(
Back to top
View user's profile Send private message
wrc1944
Advocate
Advocate


Joined: 15 Aug 2002
Posts: 3260
Location: Gainesville, Florida

PostPosted: Fri Jan 21, 2011 7:44 am    Post subject: Reply with quote

kde-4.6.0 final tagged. http://websvn.kde.org/tags/KDE/4.6.0 :)
_________________
Main box- AsRock x370 Gaming K4
Ryzen 1700, 3.0GHz, 16GB GSkill Flare DDR4 3200mhz
Samsung SATA 1000GB, Radeon HD R7 350 2GB DDR5
Gentoo ~amd64 plasma, glibc-2.30-r2, gcc-9.2.0 kernel-5.4.1-gentoo USE=experimental
Back to top
View user's profile Send private message
Display posts from previous:   
Reply to topic    Gentoo Forums Forum Index Unsupported Software All times are GMT
Goto page Previous  1, 2, 3 ... 11, 12, 13 ... 19, 20, 21  Next
Page 12 of 21

 
Jump to:  
You cannot post new topics in this forum
You cannot reply to topics in this forum
You cannot edit your posts in this forum
You cannot delete your posts in this forum
You cannot vote in polls in this forum