Gentoo Forums
Gentoo Forums
Gentoo Forums
Quick Search: in
cmake-Update schlägt fehl
View unanswered posts
View posts from last 24 hours
View posts from last 7 days

 
Reply to topic    Gentoo Forums Forum Index Deutsches Forum (German)
View previous topic :: View next topic  
Author Message
mario88
Tux's lil' helper
Tux's lil' helper


Joined: 25 Jul 2003
Posts: 122
Location: Vienna

PostPosted: Mon Dec 20, 2010 12:33 am    Post subject: cmake-Update schlägt fehl Reply with quote

Mir schlägt leider das Update auf cmake-2.8.3 fehl.
Folgendes steht bei der entscheidenden Stelle im Log:
Code:

[ 12%] Building CXX object Source/kwsys/CMakeFiles/cmsysTestsCxx.dir/testAutoPtr.o
[ 13%] Building CXX object Source/kwsys/CMakeFiles/cmsysTestsCxx.dir/testHashSTL.o
[ 13%] Building CXX object Source/CMakeFiles/CMakeLib.dir/cmStandardIncludes.o
[ 13%] Building CXX object Source/CMakeFiles/CMakeLib.dir/cmArchiveWrite.o
[ 13%] Building CXX object Source/kwsys/CMakeFiles/cmsysTestsCxx.dir/testRegistry.o
/var/tmp/portage/dev-util/cmake-2.8.3/work/cmake-2.8.3/Source/cmArchiveWrite.cxx: In constructor ‘cmArchiveWrite::cmArchiveWrite(std::ostream&, cmArchiveWrite::Compress, cmArchiveWrite::Type)’:
/var/tmp/portage/dev-util/cmake-2.8.3/work/cmake-2.8.3/Source/cmArchiveWrite.cxx:118: error: ‘archive_write_set_format_zip’ was not declared in this scope
make[2]: *** [Source/CMakeFiles/CMakeLib.dir/cmArchiveWrite.o] Error 1
make[1]: *** [Source/CMakeFiles/CMakeLib.dir/all] Error 2
make[1]: *** Waiting for unfinished jobs....
[ 14%] Building CXX object Source/kwsys/CMakeFiles/cmsysTestsCxx.dir/testIOS.o
[ 14%] Building CXX object Source/kwsys/CMakeFiles/cmsysTestsCxx.dir/testSystemTools.o
[ 15%] Building CXX object Source/kwsys/CMakeFiles/cmsysTestsCxx.dir/testCommandLineArguments.o
[ 15%] Building CXX object Source/kwsys/CMakeFiles/cmsysTestsCxx.dir/testCommandLineArguments1.o
[ 15%] Building CXX object Source/kwsys/CMakeFiles/cmsysTestsCxx.dir/testSystemInformation.o
[ 16%] Building CXX object Source/kwsys/CMakeFiles/cmsysTestsCxx.dir/testDynamicLoader.o
Linking CXX executable cmsysTestsCxx
[ 16%] Built target cmsysTestsCxx
make: *** [all] Error 2
emake failed

Weiß jemand eventuell woran das liegen könnte?

danke im Voraus
_________________
Cyber Anarchist
Back to top
View user's profile Send private message
Josef.95
Advocate
Advocate


Joined: 03 Sep 2007
Posts: 3626
Location: Germany

PostPosted: Mon Dec 20, 2010 1:58 am    Post subject: Reply with quote

Hi

Ein --sync und eine aktuelle >=app-arch/libarchive -2.8.x Version sollten vermutlich helfen, siehe hierzu auch Bug #348887
Back to top
View user's profile Send private message
Display posts from previous:   
Reply to topic    Gentoo Forums Forum Index Deutsches Forum (German) All times are GMT
Page 1 of 1

 
Jump to:  
You cannot post new topics in this forum
You cannot reply to topics in this forum
You cannot edit your posts in this forum
You cannot delete your posts in this forum
You cannot vote in polls in this forum