Gentoo Forums
Gentoo Forums
Gentoo Forums
Quick Search: in
[gelöst] emerge liefert nur noch Feherlmeldung
View unanswered posts
View posts from last 24 hours
View posts from last 7 days

 
Reply to topic    Gentoo Forums Forum Index Deutsches Forum (German)
View previous topic :: View next topic  
Author Message
Todie77
n00b
n00b


Joined: 11 Apr 2011
Posts: 45
Location: Duisburg

PostPosted: Mon Apr 18, 2011 7:12 am    Post subject: [gelöst] emerge liefert nur noch Feherlmeldung Reply with quote

Hallo, häng mit meinem Gentoo immer noch im Textmodus, kann nichts installieren. emerge (egal was) liefert immer die gleiche Fehllermeldung.
Was ist da los ?

Torsten

Quote:

# emerge XXX

* ebuild.sh, line XXX: called die
* environment, line XXX: bla bla bla...
* The specific snippet of code:
* die "econf failed"
* if you need support, post the output of "emerge --info =dev-libs/cyrrus-sasl-2.1.23-r2"
* the complet built log and the output of "emerge --pqv =dev-libs/cyrrus-sasl-2.1.23-r2"
* the complet built log is located at (home/Port_logdir/dev-lib:cyrus-sasl-2.1.23-r2:20110417-221202.log
*The ebuilt environment is located at /var/tmp/portage/dev-libs/cyrus-sasl-2.1.23-r2/temp/environment
* S: /var/tmp/portage/dev-libs/cyrus-sasl-2.1.23-r2/work/cyrus-sasl-2.1.23-r2



emerge --info =dev-libs/cyrrus-sasl-2.1.23-r2 sagt:

Quote:

app-shells/bash: 4.2_p8
dev-lang/python: 2.7.1-r1, 3.1.3-r1
dev-util/cmake: 2.8.4
sys-apps/baselayout: 2.0.2
sys-apps/openrc: 0.8.1
sys-apps/sandbox: 2.5
sys-devel/autoconf: 2.68
sys-devel/automake: 1.11.1-r1
sys-devel/binutils: 2.21
sys-devel/gcc: 4.5.2
sys-devel/gcc-config: 1.4.1
sys-devel/libtool: 2.4-r1
sys-devel/make: 3.82
sys-kernel/linux-headers: 2.6.38
virtual/os-headers: 0
ACCEPT_KEYWORDS="x86 ~x86"
ACCEPT_LICENSE="* -@EULA"
CBUILD="i686-pc-linux-gnu"
CFLAGS="-O2 -march=i686 -pipe"
CHOST="i686-pc-linux-gnu"
CONFIG_PROTECT="/etc"
CONFIG_PROTECT_MASK="/etc/ca-certificates.conf /etc/env.d /etc/fonts/fonts.conf /etc/gconf /etc/gentoo-release /etc/sandbox.d /etc/terminfo"
CXXFLAGS="-O2 -march=i686 -pipe"
DISTDIR="/usr/portage/distfiles"
FEATURES="assume-digests binpkg-logs distlocks fixlafiles fixpackages news parallel-fetch protect-owned sandbox sfperms strict unknown-features-warn unmerge-logs unmerge-orphans userfetch"
FFLAGS=""
GENTOO_MIRRORS="ftp://de-mirror.org/distro/gentoo/ ftp://ftp.wh2.tu-dresden.de/pub/mirrors/gentoo ftp://mirror.netcologne.de/gentoo/ ftp://linux.rz.ruhr-uni-bochum.de/gentoo-mirror/ ftp://ftp.halifax.rwth-aachen.de/gentoo/ ftp://sunsite.informatik.rwth-aachen.de/pub/Linux/gentoo ftp://ftp.spline.inf.fu-berlin.de/mirrors/gentoo/ ftp://ftp.join.uni-muenster.de/pub/linux/distributions/gentoo"
LDFLAGS="-Wl,-O1 -Wl,--as-needed"
MAKEOPTS="-j2"
PKGDIR="/usr/portage/packages"
PORTAGE_CONFIGROOT="/"
PORTAGE_RSYNC_OPTS="--recursive --links --safe-links --perms --times --compress --force --whole-file --delete --stats --timeout=180 --exclude=/distfiles --exclude=/local --exclude=/packages"
PORTAGE_TMPDIR="/var/tmp"
PORTDIR="/usr/portage"
PORTDIR_OVERLAY=""
SYNC="rsync://rsync10.de.gentoo.org/gentoo-portage"
Portage 2.1.9.46 (default/linux/x86/10.0/desktop, [unavailable], glibc-2.13-r2, 2.6.38-gentoo-r1 i686)
=================================================================
System Settings
=================================================================
System uname: Linux-2.6.38-gentoo-r1-i686-AMD_Athlon-tm-_Processor-with-gentoo-2.0.2
Timestamp of tree: Fri, 15 Apr 2011 12:45:01 +0000
USE="X X86 a52 aac acl acpi alsa apm arts avi bitmap-fonts bluetooth branding bzip2 cairo cdr cli consolekit cracklib crypt cups cxx dbus declarative dri dts dvd dvdr emboss encode exif f77 fam firefox flac foomaticdb fortran gbdm gdbm gdu gif gpm gtk iconv imlib ipv6 jpeg kde lcms ldap libg++ libnotify libwww mad mikmod mng modules motif mp3 mp4 mpeg mudflap ncurses nls nptl nptlonly ogg oggvorbis opengl openmp oss pam pango pcre pdf pdflib perl png policykit ppds pppd python qt qt3 qt3support qt4 quicktime readline sdl session spell sql ssl startup-notification svg svga sysfs tcpd tiff truetype udev unicode usb vorbis webkit x264 x86 xcb xm12 xml xmms xorg xulrunner xv xvid xy zlib" ALSA_CARDS="ali5451 als4000 atiixp atiixp-modem bt87x ca0106 cmipci emu10k1 emu10k1x ens1370 ens1371 es1938 es1968 fm801 hda-intel intel8x0 intel8x0m maestro3 trident usb-audio via82xx via82xx-modem ymfpci" ALSA_PCM_PLUGINS="adpcm alaw asym copy dmix dshare dsnoop empty extplug file hooks iec958 ioplug ladspa lfloat linear meter mmap_emul mulaw multi null plug rate route share shm softvol" APACHE2_MODULES="actions alias auth_basic authn_alias authn_anon authn_dbm authn_default authn_file authz_dbm authz_default authz_groupfile authz_host authz_owner authz_user autoindex cache cgi cgid dav dav_fs dav_lock deflate dir disk_cache env expires ext_filter file_cache filter headers include info log_config logio mem_cache mime mime_magic negotiation rewrite setenvif speling status unique_id userdir usertrack vhost_alias" CAMERAS="ptp2" COLLECTD_PLUGINS="df interface irq load memory rrdtool swap syslog" ELIBC="glibc" GPSD_PROTOCOLS="ashtech aivdm earthmate evermore fv18 garmin garmintxt gpsclock itrax mtk3301 nmea ntrip navcom oceanserver oldstyle oncore rtcm104v2 rtcm104v3 sirf superstar2 timing tsip tripmate tnt ubx" INPUT_DEVICES="keyboard mouse evdev" KERNEL="linux" LCD_DEVICES="bayrad cfontz cfontz633 glk hd44780 lb216 lcdm001 mtxorb ncurses text" PHP_TARGETS="php5-3" RUBY_TARGETS="ruby18" USERLAND="GNU" VIDEO_CARDS="fbdev glint intel mach64 mga neomagic nouveau nv r128 radeon savage sis tdfx trident vesa via vmware dummy v4l" XTABLES_ADDONS="quota2 psd pknock lscan length2 ipv4options ipset ipp2p iface geoip fuzzy condition tee tarpit sysrq steal rawnat logmark ipmark dhcpmac delude chaos account"
Unset: CPPFLAGS, CTARGET, EMERGE_DEFAULT_OPTS, INSTALL_MASK, LANG, LC_ALL, LINGUAS, PORTAGE_BUNZIP2_COMMAND, PORTAGE_COMPRESS, PORTAGE_COMPRESS_FLAGS, PORTAGE_RSYNC_EXTRA_OPTS



emerge --pqv =dev-libs/cyrrus-sasl-2.1.23-r2 sagt:

Quote:

--pqv unkown argument


letztes build log:
Quote:

 * Package: dev-libs/cyrus-sasl-2.1.23-r2
 * Repository: gentoo
 * Maintainer: net-mail@gentoo.org
 * USE: crypt elibc_glibc gdbm kernel_linux ldap pam ssl userland_GNU x86
 * FEATURES: sandbox
>>> Unpacking source...
>>> Unpacking cyrus-sasl-2.1.23.tar.gz to /var/tmp/portage/dev-libs/cyrus-sasl-2.1.23-r2/work
* Applying cyrus-sasl-2.1.17-pgsql-include.patch ...
 [ ok ]
* Applying cyrus-sasl-2.1.22-as-needed.patch ...
 [ ok ]
* Applying cyrus-sasl-2.1.19-checkpw.c.patch ...
 [ ok ]
* Applying cyrus-sasl-2.1.22-crypt.patch ...
 [ ok ]
* Applying cyrus-sasl-2.1.22-qa.patch ...
 [ ok ]
* Applying cyrus-sasl-2.1.22-gcc44.patch ...
 [ ok ]
* Applying cyrus-sasl-2.1.23-authd-fix.patch ...
 [ ok ]
* Applying cyrus-sasl-2.1.23+db-5.0.patch ...
 [ ok ]
* Running eautoreconf in '/var/tmp/portage/dev-libs/cyrus-sasl-2.1.23-r2/work/cyrus-sasl-2.1.23/saslauthd' ...
* Running aclocal -I /var/tmp/portage/dev-libs/cyrus-sasl-2.1.23-r2/work/cyrus-sasl-2.1.23/cmulocal -I /var/tmp/portage/dev-libs/cyrus-sasl-2.1.23-r2/work/cyrus-sasl-2.1.23/config ...
 [ ok ]
* Running autoconf -I /var/tmp/portage/dev-libs/cyrus-sasl-2.1.23-r2/work/cyrus-sasl-2.1.23/cmulocal -I /var/tmp/portage/dev-libs/cyrus-sasl-2.1.23-r2/work/cyrus-sasl-2.1.23/config ...
 [ ok ]
* Running autoheader -I /var/tmp/portage/dev-libs/cyrus-sasl-2.1.23-r2/work/cyrus-sasl-2.1.23/cmulocal -I /var/tmp/portage/dev-libs/cyrus-sasl-2.1.23-r2/work/cyrus-sasl-2.1.23/config ...
 [ ok ]
* Running automake --add-missing --copy ...
 [ ok ]
* Running eautoreconf in '/var/tmp/portage/dev-libs/cyrus-sasl-2.1.23-r2/work/cyrus-sasl-2.1.23' ...
* Running aclocal -I /var/tmp/portage/dev-libs/cyrus-sasl-2.1.23-r2/work/cyrus-sasl-2.1.23/cmulocal -I /var/tmp/portage/dev-libs/cyrus-sasl-2.1.23-r2/work/cyrus-sasl-2.1.23/config ...
 [ ok ]
* Running libtoolize --copy --force --install --automake ...
 [ ok ]
* Running aclocal -I /var/tmp/portage/dev-libs/cyrus-sasl-2.1.23-r2/work/cyrus-sasl-2.1.23/cmulocal -I /var/tmp/portage/dev-libs/cyrus-sasl-2.1.23-r2/work/cyrus-sasl-2.1.23/config ...
 [ ok ]
* Running autoconf -I /var/tmp/portage/dev-libs/cyrus-sasl-2.1.23-r2/work/cyrus-sasl-2.1.23/cmulocal -I /var/tmp/portage/dev-libs/cyrus-sasl-2.1.23-r2/work/cyrus-sasl-2.1.23/config ...
 [ ok ]
* Running autoheader -I /var/tmp/portage/dev-libs/cyrus-sasl-2.1.23-r2/work/cyrus-sasl-2.1.23/cmulocal -I /var/tmp/portage/dev-libs/cyrus-sasl-2.1.23-r2/work/cyrus-sasl-2.1.23/config ...
 [ ok ]
* Running automake --add-missing --copy ...
 [ ok ]
* Running elibtoolize in: cyrus-sasl-2.1.23/config/
* Applying portage-1.2.0.patch ...
* Applying sed-1.5.6.patch ...
* Applying as-needed-2.2.6.patch ...
* Applying uclibc-ltconf-1.3.0.patch ...
* Running elibtoolize in: cyrus-sasl-2.1.23/saslauthd/config/
* Applying portage-1.3.3.patch ...
* Applying sed-1.5.6.patch ...
* Applying tmp-1.3.5.patch ...
* Applying uclibc-ltconf-1.3.0.patch ...
>>> Source unpacked in /var/tmp/portage/dev-libs/cyrus-sasl-2.1.23-r2/work
>>> Compiling source in /var/tmp/portage/dev-libs/cyrus-sasl-2.1.23-r2/work/cyrus-sasl-2.1.23 ...
* Building with GNU DB as database backend for your SASLdb
/var/tmp/portage/dev-libs/cyrus-sasl-2.1.23-r2/temp/environment: line 5048: pg_config: command not found
* econf: updating cyrus-sasl-2.1.23/config/config.guess with /usr/share/gnuconfig/config.guess
* econf: updating cyrus-sasl-2.1.23/config/config.sub with /usr/share/gnuconfig/config.sub
* econf: updating cyrus-sasl-2.1.23/saslauthd/config/config.guess with /usr/share/gnuconfig/config.guess
* econf: updating cyrus-sasl-2.1.23/saslauthd/config/config.sub with /usr/share/gnuconfig/config.sub
./configure --prefix=/usr --build=i686-pc-linux-gnu --host=i686-pc-linux-gnu --mandir=/usr/share/man --infodir=/usr/share/info --datadir=/usr/share --sysconfdir=/etc --localstatedir=/var/lib --enable-login --enable-ntlm --enable-auth-sasldb --disable-krb4 --disable-otp --with-saslauthd=/var/lib/sasl2 --with-pwcheck=/var/lib/sasl2 --with-configdir=/etc/sasl2 --with-plugindir=/usr/lib/sasl2 --with-dbpath=/etc/sasl2/sasldb2 --with-openssl --with-pam --with-ldap --enable-ldapdb --disable-sample --disable-gssapi --disable-java --without-javahome --without-mysql --without-pgsql --without-sqlite --disable-srp --disable-sql --with-dblib=gdbm
configure: creating cache ./config.cache
checking build system type... i686-pc-linux-gnu
checking host system type... i686-pc-linux-gnu
checking target system type... i686-pc-linux-gnu
checking for a BSD-compatible install... /usr/bin/install -c
checking whether build environment is sane... yes
checking for a thread-safe mkdir -p... /bin/mkdir -p
checking for gawk... gawk
checking whether make sets $(MAKE)... yes
checking for i686-pc-linux-gnu-gcc... i686-pc-linux-gnu-gcc
checking whether the C compiler works... no
configure: error: in `/var/tmp/portage/dev-libs/cyrus-sasl-2.1.23-r2/work/cyrus-sasl-2.1.23':
configure: error: C compiler cannot create executables
See `config.log' for more details

!!! Please attach the following file when seeking support:
!!! /var/tmp/portage/dev-libs/cyrus-sasl-2.1.23-r2/work/cyrus-sasl-2.1.23/config.log
* ERROR: dev-libs/cyrus-sasl-2.1.23-r2 failed (compile phase):
* econf failed
*
* Call stack:
* ebuild.sh, line 56: Called src_compile
* environment, line 5048: Called econf '--enable-login' '--enable-ntlm' '--enable-auth-sasldb' '--disable-krb4' '--disable-otp' '--with-saslauthd=/var/lib/sasl2' '--with-pwcheck=/var/lib/sasl2' '--with-configdir=/etc/sasl2' '--with-plugindir=/usr/lib/sasl2' '--with-dbpath=/etc/sasl2/sasldb2' '--with-openssl' '--with-pam' '--with-ldap' '--enable-ldapdb' '--disable-sample' '--disable-gssapi' '--disable-java' '--without-javahome' '--without-mysql' '--without-pgsql' '--without-sqlite' '--disable-srp' '--disable-sql' '--with-dblib=gdbm'
* ebuild.sh, line 557: Called die
* The specific snippet of code:
* die "econf failed"
*
* If you need support, post the output of 'emerge --info =dev-libs/cyrus-sasl-2.1.23-r2',
* the complete build log and the output of 'emerge -pqv =dev-libs/cyrus-sasl-2.1.23-r2'.
!!! When you file a bug report, please include the following information:
GENTOO_VM= CLASSPATH="" JAVA_HOME=""
JAVACFLAGS="" COMPILER=""
and of course, the output of emerge --info
* The complete build log is located at '/home/.Port_Logdir/dev-libs:cyrus-sasl-2.1.23-r2:20110418-050020.log'.
* The ebuild environment file is located at '/var/tmp/portage/dev-libs/cyrus-sasl-2.1.23-r2/temp/environment'.
* S: '/var/tmp/portage/dev-libs/cyrus-sasl-2.1.23-r2/work/cyrus-sasl-2.1.23'



Last edited by Todie77 on Wed Apr 20, 2011 11:51 am; edited 2 times in total
Back to top
View user's profile Send private message
Todie77
n00b
n00b


Joined: 11 Apr 2011
Posts: 45
Location: Duisburg

PostPosted: Mon Apr 18, 2011 6:18 pm    Post subject: /var/tmp/portage/dev-libs/cyrus-sasl-2.1.23-r2/work/cyrus-sa Reply with quote

/var/tmp/portage/dev-libs/cyrus-sasl-2.1.23-r2/work/cyrus-sasl-2.1.23/config.log

Quote:

knoppix@Microknoppix:~$ sudo cat /media/sda3/var/tmp/portage/dev-libs/cyrus-sasl-2.1.23-r2/work/cyrus-sasl-2.1.23/config.log
This file contains any messages produced by compilers while
running configure, to aid debugging if configure makes a mistake.

It was created by configure, which was
generated by GNU Autoconf 2.68. Invocation command line was

$ ./configure --prefix=/usr --build=i686-pc-linux-gnu --host=i686-pc-linux-gnu --mandir=/usr/share/man --infodir=/usr/share/info --datadir=/usr/share --sysconfdir=/etc --localstatedir=/var/lib --enable-login --enable-ntlm --enable-auth-sasldb --disable-krb4 --disable-otp --with-saslauthd=/var/lib/sasl2 --with-pwcheck=/var/lib/sasl2 --with-configdir=/etc/sasl2 --with-plugindir=/usr/lib/sasl2 --with-dbpath=/etc/sasl2/sasldb2 --with-openssl --with-pam --with-ldap --enable-ldapdb --disable-sample --disable-gssapi --disable-java --without-javahome --without-mysql --without-pgsql --without-sqlite --disable-srp --disable-sql --with-dblib=gdbm

## --------- ##
## Platform. ##
## --------- ##

hostname = vegan
uname -m = i686
uname -r = 2.6.38-gentoo-r1
uname -s = Linux
uname -v = #1 SMP Thu Apr 14 01:27:57 CEST 2011

/usr/bin/uname -p = AMD Athlon(tm) Processor
/bin/uname -X = unknown

/bin/arch = unknown
/usr/bin/arch -k = unknown
/usr/convex/getsysinfo = unknown
/usr/bin/hostinfo = unknown
/bin/machine = unknown
/usr/bin/oslevel = unknown
/bin/universe = unknown

PATH: /usr/lib/portage/bin/ebuild-helpers
PATH: /usr/local/sbin
PATH: /usr/local/bin
PATH: /usr/sbin
PATH: /usr/bin
PATH: /sbin
PATH: /bin
PATH: /opt/bin
PATH: /usr/i686-pc-linux-gnu/gcc-bin/4.4.5


## ----------- ##
## Core tests. ##
## ----------- ##

configure:2595: creating cache ./config.cache
configure:2635: checking build system type
configure:2649: result: i686-pc-linux-gnu
configure:2669: checking host system type
configure:2682: result: i686-pc-linux-gnu
configure:2702: checking target system type
configure:2715: result: i686-pc-linux-gnu
configure:2758: checking for a BSD-compatible install
configure:2826: result: /usr/bin/install -c
configure:2837: checking whether build environment is sane
configure:2887: result: yes
configure:3028: checking for a thread-safe mkdir -p
configure:3067: result: /bin/mkdir -p
configure:3080: checking for gawk
configure:3096: found /usr/bin/gawk
configure:3107: result: gawk
configure:3118: checking whether make sets $(MAKE)
configure:3140: result: yes
configure:3252: checking for i686-pc-linux-gnu-gcc
configure:3268: found /usr/bin/i686-pc-linux-gnu-gcc
configure:3279: result: i686-pc-linux-gnu-gcc
configure:3548: checking for C compiler version
configure:3557: i686-pc-linux-gnu-gcc --version >&5
* gcc-config: Active gcc profile is invalid!
gcc-config: error: could not run/locate 'i686-pc-linux-gnu-gcc'
configure:3568: $? = 1
configure:3557: i686-pc-linux-gnu-gcc -v >&5
* gcc-config: Active gcc profile is invalid!
gcc-config: error: could not run/locate 'i686-pc-linux-gnu-gcc'
configure:3568: $? = 1
configure:3557: i686-pc-linux-gnu-gcc -V >&5
* gcc-config: Active gcc profile is invalid!
gcc-config: error: could not run/locate 'i686-pc-linux-gnu-gcc'
configure:3568: $? = 1
configure:3557: i686-pc-linux-gnu-gcc -qversion >&5
* gcc-config: Active gcc profile is invalid!
gcc-config: error: could not run/locate 'i686-pc-linux-gnu-gcc'
configure:3568: $? = 1
configure:3588: checking whether the C compiler works
configure:3610: i686-pc-linux-gnu-gcc -O2 -march=i686 -pipe -fno-strict-aliasing -D_XOPEN_SOURCE -D_XOPEN_SOURCE_EXTENDED -D_BSD_SOURCE -DLDAP_DEPRECATED -Wl,-O1 -Wl,--as-needed conftest.c >&5
* gcc-config: Active gcc profile is invalid!
gcc-config: error: could not run/locate 'i686-pc-linux-gnu-gcc'
configure:3614: $? = 1
configure:3652: result: no
configure: failed program was:
| /* confdefs.h */
| #define PACKAGE_NAME ""
| #define PACKAGE_TARNAME ""
| #define PACKAGE_VERSION ""
| #define PACKAGE_STRING ""
| #define PACKAGE_BUGREPORT ""
| #define PACKAGE_URL ""
| #define PACKAGE "cyrus-sasl"
| #define VERSION "2.1.23"
| /* end confdefs.h. */
|
| int
| main ()
| {
|
| ;
| return 0;
| }
configure:3657: error: in `/var/tmp/portage/dev-libs/cyrus-sasl-2.1.23-r2/work/cyrus-sasl-2.1.23':
configure:3659: error: C compiler cannot create executables
See `config.log' for more details

## ---------------- ##
## Cache variables. ##
## ---------------- ##

ac_cv_build=i686-pc-linux-gnu
ac_cv_env_CC_set=
ac_cv_env_CC_value=
ac_cv_env_CFLAGS_set=set
ac_cv_env_CFLAGS_value='-O2 -march=i686 -pipe -fno-strict-aliasing'
ac_cv_env_CPPFLAGS_set=set
ac_cv_env_CPPFLAGS_value=' -D_XOPEN_SOURCE -D_XOPEN_SOURCE_EXTENDED -D_BSD_SOURCE -DLDAP_DEPRECATED'
ac_cv_env_CPP_set=
ac_cv_env_CPP_value=
ac_cv_env_LDFLAGS_set=set
ac_cv_env_LDFLAGS_value='-Wl,-O1 -Wl,--as-needed'
ac_cv_env_LIBS_set=
ac_cv_env_LIBS_value=
ac_cv_env_build_alias_set=set
ac_cv_env_build_alias_value=i686-pc-linux-gnu
ac_cv_env_host_alias_set=set
ac_cv_env_host_alias_value=i686-pc-linux-gnu
ac_cv_env_target_alias_set=
ac_cv_env_target_alias_value=
ac_cv_host=i686-pc-linux-gnu
ac_cv_path_install='/usr/bin/install -c'
ac_cv_path_mkdir=/bin/mkdir
ac_cv_prog_AWK=gawk
ac_cv_prog_CC=i686-pc-linux-gnu-gcc
ac_cv_prog_make_make_set=yes
ac_cv_target=i686-pc-linux-gnu

## ----------------- ##
## Output variables. ##
## ----------------- ##

ACLOCAL='${SHELL} /var/tmp/portage/dev-libs/cyrus-sasl-2.1.23-r2/work/cyrus-sasl-2.1.23/config/missing --run aclocal-1.11 -I $(top_srcdir)/cmulocal -I $(top_srcdir)/config'
AMDEPBACKSLASH=''
AMDEP_FALSE=''
AMDEP_TRUE=''
AMTAR='${SHELL} /var/tmp/portage/dev-libs/cyrus-sasl-2.1.23-r2/work/cyrus-sasl-2.1.23/config/missing --run tar'
AR=''
AUTOCONF='${SHELL} /var/tmp/portage/dev-libs/cyrus-sasl-2.1.23-r2/work/cyrus-sasl-2.1.23/config/missing --run autoconf'
AUTOHEADER='${SHELL} /var/tmp/portage/dev-libs/cyrus-sasl-2.1.23-r2/work/cyrus-sasl-2.1.23/config/missing --run autoheader'
AUTOMAKE='${SHELL} /var/tmp/portage/dev-libs/cyrus-sasl-2.1.23-r2/work/cyrus-sasl-2.1.23/config/missing --run automake-1.11'
AWK='gawk'
CC='i686-pc-linux-gnu-gcc'
CCDEPMODE=''
CFLAGS='-O2 -march=i686 -pipe -fno-strict-aliasing'
CMU_LIB_SUBDIR=''
CPP=''
CPPFLAGS=' -D_XOPEN_SOURCE -D_XOPEN_SOURCE_EXTENDED -D_BSD_SOURCE -DLDAP_DEPRECATED'
CYGPATH_W='echo'
DEFS=''
DEPDIR=''
DIRS=''
DLLTOOL=''
DMALLOC_LIBS=''
DSYMUTIL=''
DUMPBIN=''
ECHO_C=''
ECHO_N='-n'
ECHO_T=''
EGREP=''
EXEEXT=''
FGREP=''
GETADDRINFOOBJS=''
GETNAMEINFOOBJS=''
GETSUBOPT=''
GREP=''
GSSAPIBASE_LIBS=''
GSSAPI_LIBS=''
INSTALL_DATA='${INSTALL} -m 644'
INSTALL_PROGRAM='${INSTALL}'
INSTALL_SCRIPT='${INSTALL}'
INSTALL_STRIP_PROGRAM='$(install_sh) -c -s'
IPCTYPE=''
JAVAC=''
JAVADOC=''
JAVAH=''
JAVAROOT=''
JAVA_FALSE=''
JAVA_INCLUDES=''
JAVA_TRUE=''
LD=''
LDFLAGS='-Wl,-O1 -Wl,--as-needed'
LIBOBJS=''
LIBS=''
LIBTOOL=''
LIB_CRYPT=''
LIB_DES=''
LIB_DOOR=''
LIB_LDAP=''
LIB_MYSQL=''
LIB_PGSQL=''
LIB_SOCKET=''
LIB_SQLITE=''
LIPO=''
LN_S=''
LTGETADDRINFOOBJS=''
LTGETNAMEINFOOBJS=''
LTLIBOBJS=''
LTSNPRINTFOBJS=''
MACOSX_FALSE=''
MACOSX_TRUE=''
MAKEINFO='${SHELL} /var/tmp/portage/dev-libs/cyrus-sasl-2.1.23-r2/work/cyrus-sasl-2.1.23/config/missing --run makeinfo'
MANIFEST_TOOL=''
MKDIR_P='/bin/mkdir -p'
NM=''
NMEDIT=''
NO_SASL_DB_MANS_FALSE=''
NO_SASL_DB_MANS_TRUE=''
NTLM_LIBS=''
OBJDUMP=''
OBJEXT=''
OTOOL64=''
OTOOL=''
OTP_LIBS=''
PACKAGE='cyrus-sasl'
PACKAGE_BUGREPORT=''
PACKAGE_NAME=''
PACKAGE_STRING=''
PACKAGE_TARNAME=''
PACKAGE_URL=''
PACKAGE_VERSION=''
PASSDSS_LIBS=''
PATH_SEPARATOR=':'
PLAIN_LIBS=''
PURECOV=''
PURIFY=''
PWCHECKMETH=''
PWCHECK_FALSE=''
PWCHECK_TRUE=''
RANLIB=''
SAMPLE_FALSE=''
SAMPLE_TRUE=''
SASLAUTHD_FALSE=''
SASLAUTHD_TRUE=''
SASL_DB_BACKEND=''
SASL_DB_BACKEND_STATIC=''
SASL_DB_INC=''
SASL_DB_LIB=''
SASL_DB_MANS=''
SASL_DB_UTILS=''
SASL_DL_LIB=''
SASL_KRB_LIB=''
SASL_MECHS=''
SASL_STATIC_LIBS=''
SASL_STATIC_OBJS=''
SASL_STATIC_SRCS=''
SASL_UTIL_HEADERS_EXTRA=''
SASL_UTIL_LIBS_EXTRA=''
SED=''
SET_MAKE=''
SFIO_INC_FLAGS=''
SFIO_LIB_FLAGS=''
SHELL='/bin/sh'
SMTPTEST_PROGRAM=''
SNPRINTFOBJS=''
SRP_LIBS=''
STRIP=''
VERSION='2.1.23'
ac_ct_AR=''
ac_ct_CC=''
ac_ct_DUMPBIN=''
am__EXEEXT_FALSE=''
am__EXEEXT_TRUE=''
am__fastdepCC_FALSE=''
am__fastdepCC_TRUE=''
am__include=''
am__isrc=''
am__leading_dot='.'
am__quote=''
am__tar='${AMTAR} chof - "$$tardir"'
am__untar='${AMTAR} xf -'
bindir='${exec_prefix}/bin'
build='i686-pc-linux-gnu'
build_alias='i686-pc-linux-gnu'
build_cpu='i686'
build_os='linux-gnu'
build_vendor='pc'
configdir=''
datadir='/usr/share'
datarootdir='${prefix}/share'
docdir='${datarootdir}/doc/${PACKAGE}'
dvidir='${docdir}'
exec_prefix='NONE'
host='i686-pc-linux-gnu'
host_alias='i686-pc-linux-gnu'
host_cpu='i686'
host_os='linux-gnu'
host_vendor='pc'
htmldir='${docdir}'
includedir='${prefix}/include'
infodir='/usr/share/info'
install_sh='${SHELL} /var/tmp/portage/dev-libs/cyrus-sasl-2.1.23-r2/work/cyrus-sasl-2.1.23/config/install-sh'
libdir='${exec_prefix}/lib'
libexecdir='${exec_prefix}/libexec'
localedir='${datarootdir}/locale'
localstatedir='/var/lib'
mandir='/usr/share/man'
mkdir_p='/bin/mkdir -p'
oldincludedir='/usr/include'
pdfdir='${docdir}'
plugindir=''
prefix='/usr'
program_transform_name='s,x,x,'
psdir='${docdir}'
sbindir='${exec_prefix}/sbin'
sharedstatedir='${prefix}/com'
subdirs=''
sysconfdir='/etc'
target='i686-pc-linux-gnu'
target_alias=''
target_cpu='i686'
target_os='linux-gnu'
target_vendor='pc'

## ----------- ##
## confdefs.h. ##
## ----------- ##

/* confdefs.h */
#define PACKAGE_NAME ""
#define PACKAGE_TARNAME ""
#define PACKAGE_VERSION ""
#define PACKAGE_STRING ""
#define PACKAGE_BUGREPORT ""
#define PACKAGE_URL ""
#define PACKAGE "cyrus-sasl"
#define VERSION "2.1.23"

configure: exit 77
knoppix@Microknoppix:~$
Back to top
View user's profile Send private message
Todie77
n00b
n00b


Joined: 11 Apr 2011
Posts: 45
Location: Duisburg

PostPosted: Mon Apr 18, 2011 6:24 pm    Post subject: Active gcc profile is invalid! Reply with quote

Das scheint wohl der Fehler zu sein,

Quote:

* gcc-config: Active gcc profile is invalid!
gcc-config: error: could not run/locate 'i686-pc-linux-gnu-gcc'
configure:3568: $? = 1
configure:3557: i686-pc-linux-gnu-gcc -v >&5


Quote:

configure:3657: error: in `/var/tmp/portage/dev-libs/cyrus-sasl-2.1.23-r2/work/cyrus-sasl-2.1.23':
configure:3659: error: C compiler cannot create executables
See `config.log' for more details


Leider habe ich keinen Plan, wie ich das beheben kann. Kann mir da jemand weiterhelfen ?
Back to top
View user's profile Send private message
Josef.95
Advocate
Advocate


Joined: 03 Sep 2007
Posts: 3627
Location: Germany

PostPosted: Mon Apr 18, 2011 7:05 pm    Post subject: Reply with quote

Hmm.., das du als Gentoo Neuling aber auch gleich komplett mit dem testing Zweig loslegst..., ist das so wirklich beabsichtigt?

Zu deinem gcc
Schaue mit
Code:
 # gcc-config -l
(ist ein kleines L) was für Versionen verfügbar sind, und setze dann deine gewünschte Version mit
Code:
# gcc-config <gewünschte_Version>
und danach dann noch ein
Code:
# env-update && source /etc/profile
und ein
# fix_libtool_files.sh <alte gcc Version>

Für genaueres siehe bitte auch in der Gentoo GCC-Aktualisierungsanleitung
Back to top
View user's profile Send private message
Todie77
n00b
n00b


Joined: 11 Apr 2011
Posts: 45
Location: Duisburg

PostPosted: Mon Apr 18, 2011 8:44 pm    Post subject: Reply with quote

Quote:

Hmm.., das du als Gentoo Neuling aber auch gleich komplett mit dem testing Zweig loslegst..., ist das so wirklich beabsichtigt?


Nee, ich bin einfach mal den Hinweisen in den Fehlermeldungen gefolgt. (Wenn du das meinst...)
Jetzt läuft aber alles wieder, danke. Jetzt kann ich mir hoffentlich eine grafische Oberfläche bauen.
Hab' mir da ja was angetan, bin wohl noch lange nicht weit genug für Gentoo. Naja, jetzt bin ich ins kalte Wasser gesprungen.
Back to top
View user's profile Send private message
franzf
Advocate
Advocate


Joined: 29 Mar 2005
Posts: 4408

PostPosted: Tue Apr 19, 2011 5:20 am    Post subject: Reply with quote

Todie77 wrote:
Quote:

Hmm.., das du als Gentoo Neuling aber auch gleich komplett mit dem testing Zweig loslegst..., ist das so wirklich beabsichtigt?


Nee, ich bin einfach mal den Hinweisen in den Fehlermeldungen gefolgt. (Wenn du das meinst...)

Ne, meint er nicht:
Quote:
ACCEPT_KEYWORDS="x86 ~x86"

x86 markiert stable, ~x86 testing. stable enthält - wie der Name es andeutet - stabile ebuilds (ebuilds sind ausführlich getestet, die Programmversion läuft stabil, ...). testing hingegen ist der Zweig, in dem neue Versionen erstmal abgelegt werden, um sie zu testen, Fehler zu beseitigen, neue Features zu aktivieren, usw.
Testing bereitet manchmal Probleme, weshalb es insbesondere für Anfänger nicht zu empfehlen ist.
Welcher Anleitung folgst du denn bzw. welche zusätzlichen Quellen ziehst du hinzu?
Back to top
View user's profile Send private message
Todie77
n00b
n00b


Joined: 11 Apr 2011
Posts: 45
Location: Duisburg

PostPosted: Tue Apr 19, 2011 12:31 pm    Post subject: Reply with quote

OK, danke, alles klar. Ich benutze einfach nur das offiziell Gentoo Handbuch auf gentoo.org, habe da dann wohl etwas nicht aufmerksam genug gelesen. Werde ich gleich mal aendern.
Back to top
View user's profile Send private message
Josef.95
Advocate
Advocate


Joined: 03 Sep 2007
Posts: 3627
Location: Germany

PostPosted: Tue Apr 19, 2011 2:55 pm    Post subject: Reply with quote

Hmm.., ich vermute einem Downgrade des Basissystems vom testing zum stable Zweig könnte Schwierigkeiten bereiten..
Ich habe sowas zwar noch nie gemacht, aber man liest an vielen Stellen das es unter anderen mit glibc Probleme geben könnte. Und ein downgrade von OpenRC mitsamt baselayout könnte eventuell auch kritisch werden...

Sprich, die globale Demaskierung (ACCEPT_KEYWORDS) in deiner make.conf solltest du nicht so ohne weiteres wieder rausnehmen.
Eventuell hat ja noch jemand anderes einen guten Tipp wie man das am besten (ohne Neuinstallation) wieder hinbiegen kann?
Back to top
View user's profile Send private message
Finswimmer
Moderator
Moderator


Joined: 02 Sep 2004
Posts: 5467
Location: Langen (Hessen), Germany

PostPosted: Tue Apr 19, 2011 3:07 pm    Post subject: Reply with quote

Josef.95 wrote:
Hmm.., ich vermute einem Downgrade des Basissystems vom testing zum stable Zweig könnte Schwierigkeiten bereiten..
Ich habe sowas zwar noch nie gemacht, aber man liest an vielen Stellen das es unter anderen mit glibc Probleme geben könnte. Und ein downgrade von OpenRC mitsamt baselayout könnte eventuell auch kritisch werden...

Sprich, die globale Demaskierung (ACCEPT_KEYWORDS) in deiner make.conf solltest du nicht so ohne weiteres wieder rausnehmen.
Eventuell hat ja noch jemand anderes einen guten Tipp wie man das am besten (ohne Neuinstallation) wieder hinbiegen kann?


Richtig,

daher ist dieses Vorgehen sinnvoll:

Alle aktuellen Pakete in package.keywords schreiben lassen.
Ich habe evtl. zuhause noch das Skript.

Danach auf Stable wechseln.
_________________
Bitte auf Rechtschreibung, korrekte Formatierung und Höflichkeit achten!
Danke
Back to top
View user's profile Send private message
Josef.95
Advocate
Advocate


Joined: 03 Sep 2007
Posts: 3627
Location: Germany

PostPosted: Fri Apr 22, 2011 1:23 pm    Post subject: Reply with quote

@Todie77
Nur noch mal als Hinweis:
Da du mit dem Basissystem nun eh schon auf testing bist und somit baselayout-2 und openrc verwendest, beachte bitte auch den
Baselayout and OpenRC Migration Guide
Back to top
View user's profile Send private message
Display posts from previous:   
Reply to topic    Gentoo Forums Forum Index Deutsches Forum (German) All times are GMT
Page 1 of 1

 
Jump to:  
You cannot post new topics in this forum
You cannot reply to topics in this forum
You cannot edit your posts in this forum
You cannot delete your posts in this forum
You cannot vote in polls in this forum