Gentoo Forums
Gentoo Forums
Gentoo Forums
Quick Search: in
emerge mutter fails
View unanswered posts
View posts from last 24 hours

 
Reply to topic    Gentoo Forums Forum Index Unsupported Software
View previous topic :: View next topic  
Author Message
zrebec
Tux's lil' helper
Tux's lil' helper


Joined: 07 Dec 2004
Posts: 129
Location: Bratislava / Slovakia

PostPosted: Sat Jul 02, 2011 7:45 pm    Post subject: emerge mutter fails Reply with quote

Hello gentoo fans,

i have "gnome" gentoo overlay by layman and I tried emerge mutter but I really don't know where could be a problem. By the message, it should be problem just in this version (maybe some syntax error in source code? but really don't know)

Code:

   prefix:                   /usr
   source code location:     .
   compiler:        x86_64-pc-linux-gnu-gcc

   GConf:                    yes
   XFree86 Xinerama:         no
   Solaris Xinerama:         no
   Startup notification:     yes
   libcanberra:              yes
   Introspection:            no (disabled, use --enable-introspection to enable)
   Session management:       yes
   Shape extension:          yes
   Xsync:                    yes
   Xcursor:                  yes

This is the stable branch of mutter
>>> Source configured.
>>> Compiling source in /var/tmp/portage/x11-wm/mutter-3.0.2.1/work/mutter-3.0.2.1 ...
make -j3
make  all-recursive
make[1]: Entering directory `/var/tmp/portage/x11-wm/mutter-3.0.2.1/work/mutter-3.0.2.1'
Making all in src
make[2]: Entering directory `/var/tmp/portage/x11-wm/mutter-3.0.2.1/work/mutter-3.0.2.1/src'
  GEN    stamp-mutter-marshal.h
  GEN    mutter-marshal.c
  GEN    stamp-mutter-enum-types.h
  GEN    mutter-enum-types.c
make  all-recursive
make[3]: Entering directory `/var/tmp/portage/x11-wm/mutter-3.0.2.1/work/mutter-3.0.2.1/src'
Making all in wm-tester
make[4]: Entering directory `/var/tmp/portage/x11-wm/mutter-3.0.2.1/work/mutter-3.0.2.1/src/wm-tester'
  CC     main.o
  CC     test-gravity.o
  CC     test-resizing.o
  CC     focus-window.o
  CC     test-size-hints.o
  CCLD   test-gravity
  CCLD   test-resizing
  CCLD   focus-window
  CCLD   test-size-hints
  CCLD   wm-tester
make[4]: Leaving directory `/var/tmp/portage/x11-wm/mutter-3.0.2.1/work/mutter-3.0.2.1/src/wm-tester'
Making all in tools
make[4]: Entering directory `/var/tmp/portage/x11-wm/mutter-3.0.2.1/work/mutter-3.0.2.1/src/tools'
  CC     mutter-message.o
  CC     mutter-window-demo.o
  CC     mutter-mag.o
  CC     mutter-grayscale.o
  CCLD   mutter-message
  CCLD   mutter-mag
  CCLD   mutter-window-demo
  CCLD   mutter-grayscale
make[4]: Leaving directory `/var/tmp/portage/x11-wm/mutter-3.0.2.1/work/mutter-3.0.2.1/src/tools'
Making all in compositor/plugins
make[4]: Entering directory `/var/tmp/portage/x11-wm/mutter-3.0.2.1/work/mutter-3.0.2.1/src/compositor/plugins'
  CC     default_la-default.lo
  CCLD   default.la
make[4]: Leaving directory `/var/tmp/portage/x11-wm/mutter-3.0.2.1/work/mutter-3.0.2.1/src/compositor/plugins'
make[4]: Entering directory `/var/tmp/portage/x11-wm/mutter-3.0.2.1/work/mutter-3.0.2.1/src'
  CC     async-getprop.lo
  CC     bell.lo
  CC     boxes.lo
  CC     cogl-utils.lo
  CC     compositor.lo
  CC     meta-background-actor.lo
  CC     meta-module.lo
  CC     meta-plugin.lo
  CC     meta-plugin-manager.lo
  CC     meta-shadow-factory.lo
  CC     meta-shaped-texture.lo
  CC     meta-texture-tower.lo
  CC     meta-window-actor.lo
  CC     meta-window-group.lo
  CC     meta-window-shape.lo
  CC     region-utils.lo
  CC     above-tab-keycode.lo
  CC     constraints.lo
  CC     core.lo
  CC     delete.lo
  CC     display.lo
  CC     draw-workspace.lo
  CC     edge-resistance.lo
  CC     errors.lo
  CC     eventqueue.lo
  CC     frame.lo
  CC     gradient.lo
  CC     group-props.lo
  CC     group.lo
  CC     iconcache.lo
  CC     keybindings.lo
  CC     main.lo
  CC     place.lo
  CC     prefs.lo
  CC     screen.lo
  CC     session.lo
  CC     stack.lo
  CC     stack-tracker.lo
  CC     util.lo
  CC     window-props.lo
  CC     window.lo
  CC     workspace.lo
  CC     xprops.lo
  CC     fixedtip.lo
  CC     frames.lo
  CC     menu.lo
  CC     metaaccellabel.lo
  CC     resizepopup.lo
  CC     tabpopup.lo
  CC     tile-preview.lo
  CC     theme-parser.lo
  CC     theme.lo
  CC     ui.lo
  CC     preview-widget.lo
  CC     mutter-marshal.lo
  CC     mutter-enum-types.lo
  CC     mutter.o
  CC     theme-viewer.o
core/mutter.c: In function ‘main’:
core/mutter.c:84:7: error: ‘MetaPluginManager’ undeclared (first use in this function)
core/mutter.c:84:7: note: each undeclared identifier is reported only once for each function it appears in
core/mutter.c:84:26: error: ‘mgr’ undeclared (first use in this function)
core/mutter.c:88:7: warning: implicit declaration of function ‘meta_plugin_manager_get_default’
core/mutter.c:88:7: warning: nested extern declaration of ‘meta_plugin_manager_get_default’
core/mutter.c:92:11: warning: implicit declaration of function ‘meta_plugin_manager_load’
core/mutter.c:92:11: warning: nested extern declaration of ‘meta_plugin_manager_load’
make[4]: *** [mutter.o] Error 1
make[4]: *** Waiting for unfinished jobs....
make[4]: Leaving directory `/var/tmp/portage/x11-wm/mutter-3.0.2.1/work/mutter-3.0.2.1/src'
make[3]: *** [all-recursive] Error 1
make[3]: Leaving directory `/var/tmp/portage/x11-wm/mutter-3.0.2.1/work/mutter-3.0.2.1/src'
make[2]: *** [all] Error 2
make[2]: Leaving directory `/var/tmp/portage/x11-wm/mutter-3.0.2.1/work/mutter-3.0.2.1/src'
make[1]: *** [all-recursive] Error 1
make[1]: Leaving directory `/var/tmp/portage/x11-wm/mutter-3.0.2.1/work/mutter-3.0.2.1'
make: *** [all] Error 2
emake failed
 * ERROR: x11-wm/mutter-3.0.2.1 failed (compile phase):
 *   compile failure
 *
 * Call stack:
 *     ebuild.sh, line   56:  Called src_compile
 *   environment, line 3202:  Called gnome2_src_compile
 *   environment, line 2474:  Called die
 * The specific snippet of code:
 *       emake || die "compile failure"
 *
 * If you need support, post the output of 'emerge --info =x11-wm/mutter-3.0.2.1',
 * the complete build log and the output of 'emerge -pqv =x11-wm/mutter-3.0.2.1'.
 * This ebuild used the following eclasses from overlays:
 *   /var/lib/layman/gnome/eclass/gnome2.eclass
 * This ebuild is from an overlay named 'gnome': '/var/lib/layman/gnome/'
 * The complete build log is located at '/var/tmp/portage/x11-wm/mutter-3.0.2.1/temp/build.log'.
 * The ebuild environment file is located at '/var/tmp/portage/x11-wm/mutter-3.0.2.1/temp/environment'.
 * S: '/var/tmp/portage/x11-wm/mutter-3.0.2.1/work/mutter-3.0.2.1'


please, have you this problem aslo? And you found the solution? thanks for any advice please. any idea.

thank you very much for any response
_________________
Many regards
Back to top
View user's profile Send private message
clouds222
Apprentice
Apprentice


Joined: 13 Jul 2009
Posts: 187
Location: Shanghai

PostPosted: Wed May 16, 2012 5:24 am    Post subject: Reply with quote

I have the same issue with mutter-3.2.2
Back to top
View user's profile Send private message
Display posts from previous:   
Reply to topic    Gentoo Forums Forum Index Unsupported Software All times are GMT
Page 1 of 1

 
Jump to:  
You cannot post new topics in this forum
You cannot reply to topics in this forum
You cannot edit your posts in this forum
You cannot delete your posts in this forum
You cannot vote in polls in this forum