Gentoo Forums
Gentoo Forums
Gentoo Forums
Quick Search: in
can't emerge any mozilla-progs after emerge -e world SOLVED]
View unanswered posts
View posts from last 24 hours

 
Reply to topic    Gentoo Forums Forum Index Portage & Programming
View previous topic :: View next topic  
Author Message
DawgG
l33t
l33t


Joined: 17 Sep 2003
Posts: 822

PostPosted: Mon Jul 25, 2011 3:11 pm    Post subject: can't emerge any mozilla-progs after emerge -e world SOLVED] Reply with quote

After the disk with my /usr-partition died i had to
Code:
emerge -e world
(this command is the very shortened version :wink: ). Everything went quite well except that i cannot emerge any mozilla-progs anymore (and some others): xulrunner, firefox-[4|5], thunderbird. emerge dies at the same place of all of them:
(this is xulrunner with python-2.6)
Code:
/usr/bin/python2.6 ../../config/buildlist.py ../../dist/bin/chrome.manifest "manifest components/nsDefaultCLH.manifest"
make[4]: Leaving directory `/var/tmp/portage/net-libs/xulrunner-2.0.1-r1/work/mozilla-2.0/toolkit/components'
make[3]: Leaving directory `/var/tmp/portage/net-libs/xulrunner-2.0.1-r1/work/mozilla-2.0/toolkit'
make[2]: *** [libs_tier_platform] Error 2
make[2]: Leaving directory `/var/tmp/portage/net-libs/xulrunner-2.0.1-r1/work/mozilla-2.0'
make[1]: *** [tier_platform] Error 2
make[1]: Leaving directory `/var/tmp/portage/net-libs/xulrunner-2.0.1-r1/work/mozilla-2.0'
make: *** [default] Error 2
emake failed
 * ERROR: net-libs/xulrunner-2.0.1-r1 failed (compile phase):
 *   emake failed
 *
 * Call stack:
 *     ebuild.sh, line   56:  Called src_compile
 *   environment, line 6275:  Called _eapi2_src_compile
 *     ebuild.sh, line  667:  Called die
 * The specific snippet of code:
 *              emake || die "emake failed"

i tried with python 2.6 and 2.7, i recompiled glibc, gcc, libtool and binutils, i ran python-updater and revdep-rebuild, i even ran lafilefixer. i used /var/tmp/portage on disk and tmpfs - emerge always produces the same error.

Do you have any ideas what might be wrong here?
Here's my emerge --info

Code:
Portage 2.1.10.7 (default/linux/amd64/10.0/desktop, gcc-4.5.2, glibc-2.13-r4, 2.6.39-gentoo-r3 x86_64)
=================================================================
System uname: Linux-2.6.39-gentoo-r3-x86_64-Intel-R-_Core-TM-_i5_CPU_750_@_2.67GHz-with-gentoo-2.0.3
Timestamp of tree: Mon, 25 Jul 2011 13:15:01 +0000
app-shells/bash:          4.2_p10
dev-java/java-config:     2.1.11-r3
dev-lang/python:          2.6.7-r2, 2.7.2-r2, 3.2-r2
dev-util/cmake:           2.8.5-r2
dev-util/pkgconfig:       0.26
sys-apps/baselayout:      2.0.3
sys-apps/openrc:          0.8.3-r1
sys-apps/sandbox:         2.5
sys-devel/autoconf:       2.13, 2.68
sys-devel/automake:       1.10.3, 1.11.1-r1
sys-devel/binutils:       2.21.1
sys-devel/gcc:            4.5.2
sys-devel/gcc-config:     1.4.1-r1
sys-devel/libtool:        2.4-r1
sys-devel/make:           3.82-r1
sys-kernel/linux-headers: 2.6.38 (virtual/os-headers)
sys-libs/glibc:           2.13-r4
Repositories:

gentoo
    location: /usr/portage
    sync: rsync://rsync.europe.gentoo.org/gentoo-portage
    priority: -1000

x-portage
    location: /usr/local/portage
    masters: gentoo
    priority: 0

ABI="amd64"
ACCEPT_KEYWORDS="amd64 ~amd64"


THX for your help!

SOLVED
see below
_________________
DUMM KLICKT GUT.


Last edited by DawgG on Tue Jul 26, 2011 2:29 pm; edited 1 time in total
Back to top
View user's profile Send private message
tomk
Bodhisattva
Bodhisattva


Joined: 23 Sep 2003
Posts: 7221
Location: Sat in front of my computer

PostPosted: Mon Jul 25, 2011 3:27 pm    Post subject: Reply with quote

The actual error is probably a bit further up, most likely it's curl-related as per bug 375899.
_________________
Search | Read | Answer | Report | Strip
Back to top
View user's profile Send private message
DawgG
l33t
l33t


Joined: 17 Sep 2003
Posts: 822

PostPosted: Tue Jul 26, 2011 9:23 am    Post subject: solution Reply with quote

thx for the reply.
gimp with the curl-useflag is also affected by this bug, but the buildlog was a little more explicit so i emerged it w/out the curl-useflag.

SOLUTION:
it is indeed related to this bug 375899. the ebuild is not fixed yet so i downgraded to net-misc/curl-7.21.6 and now all the pkgs compile.
_________________
DUMM KLICKT GUT.
Back to top
View user's profile Send private message
Display posts from previous:   
Reply to topic    Gentoo Forums Forum Index Portage & Programming All times are GMT
Page 1 of 1

 
Jump to:  
You cannot post new topics in this forum
You cannot reply to topics in this forum
You cannot edit your posts in this forum
You cannot delete your posts in this forum
You cannot vote in polls in this forum