Gentoo Forums
Gentoo Forums
Gentoo Forums
Quick Search: in
gnome 3.2 and shotwell
View unanswered posts
View posts from last 24 hours

 
Reply to topic    Gentoo Forums Forum Index Unsupported Software
View previous topic :: View next topic  
Author Message
jancici
Apprentice
Apprentice


Joined: 27 Jan 2004
Posts: 284
Location: Slovakia

PostPosted: Fri Oct 07, 2011 8:20 pm    Post subject: gnome 3.2 and shotwell Reply with quote

I am trying to update to gnome 3.2.
I have seen some problems to emerge libunique as dependecny of shotwell, so I did USE=-shotwell
so I have gnome 3.2 now running

I would like to try and use shotwell, so I am enabling that USE but again I am getting this error.
is there any solution to emerge that library?

Code:
make[4]: Leaving directory `/var/tmp/portage/dev-libs/libunique-1.1.6/work/libunique-1.1.6/unique/bacon'
Making all in dbus
make[4]: Entering directory `/var/tmp/portage/dev-libs/libunique-1.1.6/work/libunique-1.1.6/unique/dbus'
  GEN    uniquebackend-bindings.h
  GEN    uniquebackend-glue.h
make  all-am
make[5]: Entering directory `/var/tmp/portage/dev-libs/libunique-1.1.6/work/libunique-1.1.6/unique/dbus'
  CC     libunique_dbus_la-uniquefactory-dbus.lo
  CC     libunique_dbus_la-uniquebackend-dbus.lo
  CCLD   libunique-dbus.la
make[5]: Leaving directory `/var/tmp/portage/dev-libs/libunique-1.1.6/work/libunique-1.1.6/unique/dbus'
make[4]: Leaving directory `/var/tmp/portage/dev-libs/libunique-1.1.6/work/libunique-1.1.6/unique/dbus'
make[4]: Entering directory `/var/tmp/portage/dev-libs/libunique-1.1.6/work/libunique-1.1.6/unique'
  CC     uniqueapp.lo
  CC     uniquebackend.lo
  CC     uniquemessage.lo
In file included from ../unique/uniqueapp.h:26:0,
                 from ./uniquebackend.h:27,
                 from ./uniquebackend.c:46:
../unique/uniquemessage.h:51:16: error: expected '=', ',', ';', 'asm' or '__attribute__' before 'guchar'
../unique/uniquemessage.h:66:16: error: expected '=', ',', ';', 'asm' or '__attribute__' before 'gchar'
In file included from ./uniqueapp.h:26:0,
                 from ./uniqueapp.c:67:
../unique/uniquemessage.h:51:16: error: expected '=', ',', ';', 'asm' or '__attribute__' before 'guchar'
../unique/uniquemessage.h:66:16: error: expected '=', ',', ';', 'asm' or '__attribute__' before 'gchar'
In file included from ./uniquemessage.c:30:0:
./uniquemessage.h:51:16: error: expected '=', ',', ';', 'asm' or '__attribute__' before 'guchar'
./uniquemessage.h:66:16: error: expected '=', ',', ';', 'asm' or '__attribute__' before 'gchar'
In file included from ./uniquebackend.c:46:0:
./uniquebackend.h:97:16: error: expected '=', ',', ';', 'asm' or '__attribute__' before 'gchar'
./uniquebackend.h:100:16: error: expected '=', ',', ';', 'asm' or '__attribute__' before 'gchar'
In file included from ./uniquebackend.c:47:0:
./uniqueinternals.h:47:16: error: expected '=', ',', ';', 'asm' or '__attribute__' before 'gchar'
./uniqueinternals.h:51:16: error: expected '=', ',', ';', 'asm' or '__attribute__' before 'gchar'
./uniquebackend.c:114:16: error: expected '=', ',', ';', 'asm' or '__attribute__' before 'gchar'
./uniquebackend.c:157:16: error: expected '=', ',', ';', 'asm' or '__attribute__' before 'gchar'
make[4]: *** [uniquebackend.lo] Error 1
make[4]: *** Waiting for unfinished jobs....
In file included from ./uniqueapp.c:68:0:
./uniquebackend.h:97:16: error: expected '=', ',', ';', 'asm' or '__attribute__' before 'gchar'
./uniquebackend.h:100:16: error: expected '=', ',', ';', 'asm' or '__attribute__' before 'gchar'
In file included from ./uniqueapp.c:71:0:
./uniqueinternals.h:47:16: error: expected '=', ',', ';', 'asm' or '__attribute__' before 'gchar'
./uniqueinternals.h:51:16: error: expected '=', ',', ';', 'asm' or '__attribute__' before 'gchar'
./uniqueapp.c: In function 'unique_app_get_property':
./uniqueapp.c:324:7: warning: passing argument 2 of 'g_value_set_string' makes pointer from integer without a cast
/usr/include/glib-2.0/gobject/gvaluetypes.h:213:13: note: expected 'const gchar *' but argument is of type 'int'
./uniqueapp.c:327:7: warning: passing argument 2 of 'g_value_set_string' makes pointer from integer without a cast
/usr/include/glib-2.0/gobject/gvaluetypes.h:213:13: note: expected 'const gchar *' but argument is of type 'int'
./uniqueapp.c: In function 'unique_app_send_message':
./uniqueapp.c:645:3: warning: passing argument 1 of 'g_strdup' makes pointer from integer without a cast
/usr/include/glib-2.0/glib/gstrfuncs.h:190:22: note: expected 'const gchar *' but argument is of type 'int'
./uniqueapp.c: In function 'unique_app_emit_message_received':
./uniqueapp.c:696:14: warning: assignment makes pointer from integer without a cast
./uniqueapp.c: At top level:
./uniqueapp.c:784:16: error: expected '=', ',', ';', 'asm' or '__attribute__' before 'gchar'
./uniqueapp.c:866:16: error: expected '=', ',', ';', 'asm' or '__attribute__' before 'gchar'
make[4]: *** [uniqueapp.lo] Error 1
In file included from ./uniqueinternals.h:7:0,
                 from ./uniquemessage.c:31:
./uniquebackend.h:97:16: error: expected '=', ',', ';', 'asm' or '__attribute__' before 'gchar'
./uniquebackend.h:100:16: error: expected '=', ',', ';', 'asm' or '__attribute__' before 'gchar'
In file included from ./uniquemessage.c:31:0:
./uniqueinternals.h:47:16: error: expected '=', ',', ';', 'asm' or '__attribute__' before 'gchar'
./uniqueinternals.h:51:16: error: expected '=', ',', ';', 'asm' or '__attribute__' before 'gchar'
./uniquemessage.c:188:16: error: expected '=', ',', ';', 'asm' or '__attribute__' before 'guchar'
./uniquemessage.c:528:16: error: expected '=', ',', ';', 'asm' or '__attribute__' before 'gchar'
make[4]: *** [uniquemessage.lo] Error 1
make[4]: Leaving directory `/var/tmp/portage/dev-libs/libunique-1.1.6/work/libunique-1.1.6/unique'
make[3]: *** [all-recursive] Error 1
make[3]: Leaving directory `/var/tmp/portage/dev-libs/libunique-1.1.6/work/libunique-1.1.6/unique'
make[2]: *** [all] Error 2
make[2]: Leaving directory `/var/tmp/portage/dev-libs/libunique-1.1.6/work/libunique-1.1.6/unique'
make[1]: *** [all-recursive] Error 1
make[1]: Leaving directory `/var/tmp/portage/dev-libs/libunique-1.1.6/work/libunique-1.1.6'
make: *** [all] Error 2
emake failed
 * ERROR: dev-libs/libunique-1.1.6 failed (compile phase):
 *   compile failure
 *
 * Call stack:
 *     ebuild.sh, line   56:  Called src_compile
 *   environment, line 3238:  Called gnome2_src_compile
 *   environment, line 2515:  Called die
 * The specific snippet of code:
 *       emake || die "compile failure"
 *
 * If you need support, post the output of 'emerge --info =dev-libs/libunique-1.1.6',
 * the complete build log and the output of 'emerge -pqv =dev-libs/libunique-1.1.6'.
 * The complete build log is located at '/var/tmp/portage/dev-libs/libunique-1.1.6/temp/build.log'.
 * The ebuild environment file is located at '/var/tmp/portage/dev-libs/libunique-1.1.6/temp/environment'.
 * S: '/var/tmp/portage/dev-libs/libunique-1.1.6/work/libunique-1.1.6'

>>> Failed to emerge dev-libs/libunique-1.1.6, Log file:

>>>  '/var/tmp/portage/dev-libs/libunique-1.1.6/temp/build.log'



thanks
Back to top
View user's profile Send private message
Display posts from previous:   
Reply to topic    Gentoo Forums Forum Index Unsupported Software All times are GMT
Page 1 of 1

 
Jump to:  
You cannot post new topics in this forum
You cannot reply to topics in this forum
You cannot edit your posts in this forum
You cannot delete your posts in this forum
You cannot vote in polls in this forum