Gentoo Forums
Gentoo Forums
Gentoo Forums
Quick Search: in
compiz-fusion 0.9.2 from desktop-overlay; doesn't compile
View unanswered posts
View posts from last 24 hours

 
Reply to topic    Gentoo Forums Forum Index Unsupported Software
View previous topic :: View next topic  
Author Message
BrummieJim
l33t
l33t


Joined: 22 Jul 2005
Posts: 642

PostPosted: Wed Mar 28, 2012 7:21 pm    Post subject: compiz-fusion 0.9.2 from desktop-overlay; doesn't compile Reply with quote

Hi,
Just trying to get this to compile from the desktop-overlay as part of an emerge -puDN world, but can't get it to compile. Doesn't give any indication as to why? Also doesn't seem like I can downgrade to 0.8.6?
The error is
Code:

> Emerging (1 of 5) x11-plugins/compiz-plugins-extra-0.9.2 from desktop-effects
 * compiz-plugins-extra-0.9.2.tar.bz2 RMD160 SHA1 SHA256 size ;-) ...    [ ok ]
>>> Unpacking source...
>>> Unpacking compiz-plugins-extra-0.9.2.tar.bz2 to /var/tmp/portage/x11-plugins/compiz-plugins-extra-0.9.2/work
>>> Source unpacked in /var/tmp/portage/x11-plugins/compiz-plugins-extra-0.9.2/work
>>> Preparing source in /var/tmp/portage/x11-plugins/compiz-plugins-extra-0.9.2/work/plugins-extra ...
>>> Source prepared.
>>> Configuring source in /var/tmp/portage/x11-plugins/compiz-plugins-extra-0.9.2/work/plugins-extra ...
>>> Working in BUILD_DIR: "/var/tmp/portage/x11-plugins/compiz-plugins-extra-0.9.2/work/compiz-plugins-extra-0.9.2_build"
cmake --no-warn-unused-cli -C /var/tmp/portage/x11-plugins/compiz-plugins-extra-0.9.2/temp/gentoo_common_config.cmake -DCMAKE_INSTALL_PREFIX=/usr -DCOMPIZ_DISABLE_SCHEMAS_INSTALL=ON -DCMAKE_BUILD_TYPE=Gentoo -DCMAKE_INSTALL_DO_STRIP=OFF -DCMAKE_USER_MAKE_RULES_OVERRIDE=/var/tmp/portage/x11-plugins/compiz-plugins-extra-0.9.2/temp/gentoo_rules.cmake  /var/tmp/portage/x11-plugins/compiz-plugins-extra-0.9.2/work/plugins-extra
Not searching for unused variables given on the command line.
loading initial cache file /var/tmp/portage/x11-plugins/compiz-plugins-extra-0.9.2/temp/gentoo_common_config.cmake
-- The C compiler identification is GNU
-- The CXX compiler identification is GNU
-- Check for working C compiler: /usr/bin/x86_64-pc-linux-gnu-gcc
-- Check for working C compiler: /usr/bin/x86_64-pc-linux-gnu-gcc -- works
-- Detecting C compiler ABI info
-- Detecting C compiler ABI info - done
-- Check for working CXX compiler: /usr/bin/x86_64-pc-linux-gnu-g++
-- Check for working CXX compiler: /usr/bin/x86_64-pc-linux-gnu-g++ -- works
-- Detecting CXX compiler ABI info
-- Detecting CXX compiler ABI info - done
-- checking for module 'compiz'
--   found compiz, version 0.9.0
-- Performing Test HAVE_SCANDIR_POSIX
-- Performing Test HAVE_SCANDIR_POSIX - Success
-- Boost version: 1.46.1
-- Found the following Boost libraries:
--   serialization
-- checking for module 'compiz-composite'
--   found compiz-composite, version 0.9.0
-- checking for module 'compiz-opengl'
--   found compiz-opengl, version 0.9.0
-- checking for module 'compiz'
--   found compiz, version 0.9.0
-- checking for module 'compiz-scale'
--   found compiz-scale, version 0.9.0
-- checking for module 'compiz-text'
--   found compiz-text, version 0.9.0
-- checking for module 'compiz-cube'
--   found compiz-cube, version 0.9.0
-- checking for module 'compiz-mousepoll'
--   found compiz-mousepoll, version 0.9.0
-- checking for module 'cairo'
--   found cairo, version 1.10.2
-- checking for module 'cairo-xlib-xrender'
--   found cairo-xlib-xrender, version 1.10.2
-- checking for module 'libnotify'
--   found libnotify, version 0.7.4
-- checking for module 'gtk+-2.0'
--   found gtk+-2.0, version 2.24.8
-- Looking for XOpenDisplay in /usr/lib64/libX11.so;/usr/lib64/libXext.so
-- Looking for XOpenDisplay in /usr/lib64/libX11.so;/usr/lib64/libXext.so - found
-- Looking for gethostbyname
-- Looking for gethostbyname - found
-- Looking for connect
-- Looking for connect - found
-- Looking for remove
-- Looking for remove - found
-- Looking for shmat
-- Looking for shmat - found
-- Looking for IceConnectionNumber in ICE
-- Looking for IceConnectionNumber in ICE - found
-- Found X11: /usr/lib64/libX11.so
-- Found OpenGL: /usr/lib64/libGL.so
-- checking for module 'compiz-animation'
--   found compiz-animation, version 0.9.0

************************************************************
* Compiz Buildsystem                                       *
*                                                          *
* Package : Compiz Plugins Extra                           *
* Version : 0.9.0                                          *
************************************************************

Plugin configure check results:

  splash        : Yes
  mblur         : Yes
  crashhandler  : Yes
  bicubic       : Yes
  scalefilter   : Yes
  cubeaddon     : Yes
  firepaint     : Yes
  wallpaper     : Yes
  maximumize    : Yes
  addhelper     : Yes
  group         : Yes
  trailfocus    : Yes
  showdesktop   : Yes
  grid          : Yes
  showmouse     : Yes
  notification  : Yes
  extrawm       : Yes
  animationaddon: Yes
  reflex        : Yes
  bench         : Yes
  fadedesktop   : Yes
  td            : Yes
  widget        : Yes
  gears         : Yes
  shelf         : Yes
  loginout      : Yes

************************************************************

-- <<< Gentoo configuration >>>
Build type      Gentoo
Install path    /usr
Compiler flags:
C               -Wall
C++             -Wall
Linker flags:
Executable       -Wl,-O1 -Wl,--as-needed
Module           -Wl,-O1 -Wl,--as-needed
Shared           -Wl,-O1 -Wl,--as-needed

-- Configuring done
-- Generating done
-- Build files have been written to: /var/tmp/portage/x11-plugins/compiz-plugins-extra-0.9.2/work/compiz-plugins-extra-0.9.2_build
>>> Source configured.
>>> Compiling source in /var/tmp/portage/x11-plugins/compiz-plugins-extra-0.9.2/work/plugins-extra ...
>>> Working in BUILD_DIR: "/var/tmp/portage/x11-plugins/compiz-plugins-extra-0.9.2/work/compiz-plugins-extra-0.9.2_build"
make -j3
[  1%] Generating ../generated/splash.xml
[  2%] [  2%] Generating ../generated/mblur.xml
Generating ../generated/crashhandler.xml
[  3%] [  3%] Generating ../generated/splash_options.h
[  4%] Generating ../generated/mblur_options.h
Generating ../generated/crashhandler_options.h
[  5%] [  5%] [  6%] Generating ../generated/mblur_options.cpp
Generating ../generated/crashhandler_options.cpp
Generating ../generated/splash_options.cpp
Scanning dependencies of target mblur
Scanning dependencies of target splash
Scanning dependencies of target crashhandler
[  6%] Building CXX object splash/CMakeFiles/splash.dir/src/splash.cpp.o
[  7%] Building CXX object crashhandler/CMakeFiles/crashhandler.dir/src/crashhandler.cpp.o
[  8%] Building CXX object mblur/CMakeFiles/mblur.dir/src/mblur.cpp.o
[  8%] Building CXX object crashhandler/CMakeFiles/crashhandler.dir/__/generated/crashhandler_options.cpp.o
In file included from /usr/include/boost-1_46/boost/serialization/static_warning.hpp:73:0,
                 from /usr/include/boost-1_46/boost/serialization/extended_type_info_typeid.hpp:27,
                 from /usr/include/boost-1_46/boost/archive/detail/iserializer.hpp:47,
                 from /usr/include/boost-1_46/boost/archive/detail/interface_iarchive.hpp:22,
                 from /usr/include/boost-1_46/boost/archive/detail/common_iarchive.hpp:23,
                 from /usr/include/boost-1_46/boost/archive/basic_text_iarchive.hpp:31,
                 from /usr/include/boost-1_46/boost/archive/text_iarchive.hpp:24,
                 from /usr/include/compiz/core/serialization.h:36,
                 from /var/tmp/portage/x11-plugins/compiz-plugins-extra-0.9.2/work/plugins-extra/mblur/src/mblur.h:29,
                 from /var/tmp/portage/x11-plugins/compiz-plugins-extra-0.9.2/work/plugins-extra/mblur/src/mblur.cpp:25:
/usr/include/boost-1_46/boost/mpl/print.hpp: In instantiation of ‘boost::mpl::print<boost::serialization::BOOST_SERIALIZATION_STATIC_WARNING_LINE<98> >’:
/usr/include/boost-1_46/boost/serialization/static_warning.hpp:92:13:   instantiated from ‘boost::serialization::static_warning_test<false, 98>’
/usr/include/boost-1_46/boost/archive/detail/check.hpp:98:1:   instantiated from ‘void boost::archive::detail::check_object_tracking() [with T = PluginStateWriter<MblurScreen>]’
/usr/include/boost-1_46/boost/archive/detail/oserializer.hpp:313:9:   instantiated from ‘static void boost::archive::detail::save_non_pointer_type<Archive>::invoke(Archive&, T&) [with T = PluginStateWriter<MblurScreen>, Archive = boost::archive::text_oarchive]’
/usr/include/boost-1_46/boost/archive/detail/oserializer.hpp:525:5:   instantiated from ‘void boost::archive::save(Archive&, T&) [with Archive = boost::archive::text_oarchive, T = PluginStateWriter<MblurScreen>]’
/usr/include/boost-1_46/boost/archive/detail/common_oarchive.hpp:69:9:   instantiated from ‘void boost::archive::detail::common_oarchive<Archive>::save_override(T&, int) [with T = PluginStateWriter<MblurScreen>, Archive = boost::archive::text_oarchive]’
/usr/include/boost-1_46/boost/archive/basic_text_oarchive.hpp:80:9:   instantiated from ‘void boost::archive::basic_text_oarchive<Archive>::save_override(T&, int) [with T = PluginStateWriter<MblurScreen>, Archive = boost::archive::text_oarchive]’
/usr/include/boost-1_46/boost/archive/detail/interface_oarchive.hpp:63:9:   instantiated from ‘Archive& boost::archive::detail::interface_oarchive<Archive>::operator<<(T&) [with T = PluginStateWriter<MblurScreen>, Archive = boost::archive::text_oarchive]’
/usr/include/compiz/core/serialization.h:122:6:   instantiated from ‘void PluginStateWriter<T>::writeSerializedData() [with T = MblurScreen]’
/var/tmp/portage/x11-plugins/compiz-plugins-extra-0.9.2/work/plugins-extra/mblur/src/mblur.cpp:298:5:   instantiated from here
/usr/include/boost-1_46/boost/mpl/print.hpp:55:5: warning: comparison between signed and unsigned integer expressions
[  9%] Building CXX object splash/CMakeFiles/splash.dir/__/generated/splash_options.cpp.o
Linking CXX shared library libcrashhandler.so
[  9%] Built target crashhandler
[ 10%] Generating ../generated/bicubic.xml
[ 11%] Generating ../generated/bicubic_options.h
[ 11%] Generating ../generated/bicubic_options.cpp
Scanning dependencies of target bicubic
[ 12%] Building CXX object mblur/CMakeFiles/mblur.dir/__/generated/mblur_options.cpp.o
[ 12%] Building CXX object bicubic/CMakeFiles/bicubic.dir/src/bicubic.cpp.o
Linking CXX shared library libsplash.so
[ 12%] Built target splash
[ 13%] Generating ../generated/scalefilter.xml
[ 13%] Generating ../generated/scalefilter_options.h
[ 14%] Generating ../generated/scalefilter_options.cpp
Scanning dependencies of target scalefilter
[ 15%] Building CXX object scalefilter/CMakeFiles/scalefilter.dir/src/scalefilter.cpp.o
Linking CXX shared library libmblur.so
[ 15%] Built target mblur
[ 16%] Generating ../generated/cubeaddon.xml
[ 16%] Generating ../generated/cubeaddon_options.h
[ 17%] Building CXX object bicubic/CMakeFiles/bicubic.dir/__/generated/bicubic_options.cpp.o
[ 18%] Generating ../generated/cubeaddon_options.cpp
Scanning dependencies of target cubeaddon
[ 19%] Building CXX object cubeaddon/CMakeFiles/cubeaddon.dir/src/cubeaddon.cpp.o
[ 20%] Building CXX object scalefilter/CMakeFiles/scalefilter.dir/__/generated/scalefilter_options.cpp.o
Linking CXX shared library libbicubic.so
[ 20%] Built target bicubic
[ 21%] Generating ../generated/firepaint.xml
[ 21%] Generating ../generated/firepaint_options.h
[ 22%] Generating ../generated/firepaint_options.cpp
Linking CXX shared library libscalefilter.so
Scanning dependencies of target firepaint
[ 22%] Built target scalefilter
[ 23%] Building CXX object firepaint/CMakeFiles/firepaint.dir/src/firepaint.cpp.o
[ 24%] Generating ../generated/wallpaper.xml
[ 25%] Generating ../generated/wallpaper_options.h
[ 25%] Generating ../generated/wallpaper_options.cpp
Scanning dependencies of target wallpaper
[ 25%] Building CXX object wallpaper/CMakeFiles/wallpaper.dir/src/wallpaper.cpp.o
[ 26%] Building CXX object cubeaddon/CMakeFiles/cubeaddon.dir/__/generated/cubeaddon_options.cpp.o
In file included from /usr/include/boost-1_46/boost/serialization/static_warning.hpp:73:0,
                 from /usr/include/boost-1_46/boost/serialization/extended_type_info_typeid.hpp:27,
                 from /usr/include/boost-1_46/boost/archive/detail/iserializer.hpp:47,
                 from /usr/include/boost-1_46/boost/archive/detail/interface_iarchive.hpp:22,
                 from /usr/include/boost-1_46/boost/archive/detail/common_iarchive.hpp:23,
                 from /usr/include/boost-1_46/boost/archive/basic_text_iarchive.hpp:31,
                 from /usr/include/boost-1_46/boost/archive/text_iarchive.hpp:24,
                 from /usr/include/compiz/core/serialization.h:36,
                 from /var/tmp/portage/x11-plugins/compiz-plugins-extra-0.9.2/work/plugins-extra/firepaint/src/firepaint.h:27,
                 from /var/tmp/portage/x11-plugins/compiz-plugins-extra-0.9.2/work/plugins-extra/firepaint/src/firepaint.cpp:22:
/usr/include/boost-1_46/boost/mpl/print.hpp: In instantiation of ‘boost::mpl::print<boost::serialization::BOOST_SERIALIZATION_STATIC_WARNING_LINE<98> >’:
/usr/include/boost-1_46/boost/serialization/static_warning.hpp:92:13:   instantiated from ‘boost::serialization::static_warning_test<false, 98>’
/usr/include/boost-1_46/boost/archive/detail/check.hpp:98:1:   instantiated from ‘void boost::archive::detail::check_object_tracking() [with T = PluginStateWriter<FireScreen>]’
/usr/include/boost-1_46/boost/archive/detail/oserializer.hpp:313:9:   instantiated from ‘static void boost::archive::detail::save_non_pointer_type<Archive>::invoke(Archive&, T&) [with T = PluginStateWriter<FireScreen>, Archive = boost::archive::text_oarchive]’
/usr/include/boost-1_46/boost/archive/detail/oserializer.hpp:525:5:   instantiated from ‘void boost::archive::save(Archive&, T&) [with Archive = boost::archive::text_oarchive, T = PluginStateWriter<FireScreen>]’
/usr/include/boost-1_46/boost/archive/detail/common_oarchive.hpp:69:9:   instantiated from ‘void boost::archive::detail::common_oarchive<Archive>::save_override(T&, int) [with T = PluginStateWriter<FireScreen>, Archive = boost::archive::text_oarchive]’
/usr/include/boost-1_46/boost/archive/basic_text_oarchive.hpp:80:9:   instantiated from ‘void boost::archive::basic_text_oarchive<Archive>::save_override(T&, int) [with T = PluginStateWriter<FireScreen>, Archive = boost::archive::text_oarchive]’
/usr/include/boost-1_46/boost/archive/detail/interface_oarchive.hpp:63:9:   instantiated from ‘Archive& boost::archive::detail::interface_oarchive<Archive>::operator<<(T&) [with T = PluginStateWriter<FireScreen>, Archive = boost::archive::text_oarchive]’
/usr/include/compiz/core/serialization.h:122:6:   instantiated from ‘void PluginStateWriter<T>::writeSerializedData() [with T = FireScreen]’
/var/tmp/portage/x11-plugins/compiz-plugins-extra-0.9.2/work/plugins-extra/firepaint/src/firepaint.cpp:750:5:   instantiated from here
/usr/include/boost-1_46/boost/mpl/print.hpp:55:5: warning: comparison between signed and unsigned integer expressions
Linking CXX shared library libcubeaddon.so
[ 27%] Building CXX object wallpaper/CMakeFiles/wallpaper.dir/__/generated/wallpaper_options.cpp.o
[ 27%] Built target cubeaddon
[ 28%] Building CXX object firepaint/CMakeFiles/firepaint.dir/__/generated/firepaint_options.cpp.o
/var/tmp/portage/x11-plugins/compiz-plugins-extra-0.9.2/work/compiz-plugins-extra-0.9.2_build/generated/wallpaper_options.cpp: In constructor ‘WallpaperOptions::WallpaperOptions()’:
/var/tmp/portage/x11-plugins/compiz-plugins-extra-0.9.2/work/compiz-plugins-extra-0.9.2_build/generated/wallpaper_options.cpp:21:27: warning: unused variable ‘color’
Linking CXX shared library libwallpaper.so
[ 28%] Generating ../generated/maximumize.xml
[ 29%] Generating ../generated/maximumize_options.h
Linking CXX shared library libfirepaint.so
[ 29%] Built target wallpaper
[ 30%] Generating ../generated/addhelper.xml
[ 31%] Generating ../generated/addhelper_options.h
[ 32%] Generating ../generated/maximumize_options.cpp
[ 32%] Generating ../generated/addhelper_options.cpp
Scanning dependencies of target addhelper
Scanning dependencies of target maximumize
[ 32%] Building CXX object addhelper/CMakeFiles/addhelper.dir/src/addhelper.cpp.o
[ 33%] [ 33%] Built target firepaint
Building CXX object maximumize/CMakeFiles/maximumize.dir/src/maximumize.cpp.o
[ 34%] Building CXX object addhelper/CMakeFiles/addhelper.dir/__/generated/addhelper_options.cpp.o
[ 34%] Building CXX object maximumize/CMakeFiles/maximumize.dir/__/generated/maximumize_options.cpp.o
[ 35%] Generating ../generated/group.xml
[ 35%] Generating ../generated/group_options.h
In file included from /usr/include/boost-1_46/boost/serialization/static_warning.hpp:73:0,
                 from /usr/include/boost-1_46/boost/serialization/extended_type_info_typeid.hpp:27,
                 from /usr/include/boost-1_46/boost/archive/detail/iserializer.hpp:47,
                 from /usr/include/boost-1_46/boost/archive/detail/interface_iarchive.hpp:22,
                 from /usr/include/boost-1_46/boost/archive/detail/common_iarchive.hpp:23,
                 from /usr/include/boost-1_46/boost/archive/basic_text_iarchive.hpp:31,
                 from /usr/include/boost-1_46/boost/archive/text_iarchive.hpp:24,
                 from /usr/include/compiz/core/serialization.h:36,
                 from /var/tmp/portage/x11-plugins/compiz-plugins-extra-0.9.2/work/plugins-extra/addhelper/src/addhelper.h:30,
                 from /var/tmp/portage/x11-plugins/compiz-plugins-extra-0.9.2/work/plugins-extra/addhelper/src/addhelper.cpp:29:
/usr/include/boost-1_46/boost/mpl/print.hpp: In instantiation of ‘boost::mpl::print<boost::serialization::BOOST_SERIALIZATION_STATIC_WARNING_LINE<98> >’:
/usr/include/boost-1_46/boost/serialization/static_warning.hpp:92:13:   instantiated from ‘boost::serialization::static_warning_test<false, 98>’
/usr/include/boost-1_46/boost/archive/detail/check.hpp:98:1:   instantiated from ‘void boost::archive::detail::check_object_tracking() [with T = PluginStateWriter<AddWindow>]’
/usr/include/boost-1_46/boost/archive/detail/oserializer.hpp:313:9:   instantiated from ‘static void boost::archive::detail::save_non_pointer_type<Archive>::invoke(Archive&, T&) [with T = PluginStateWriter<AddWindow>, Archive = boost::archive::text_oarchive]’
/usr/include/boost-1_46/boost/archive/detail/oserializer.hpp:525:5:   instantiated from ‘void boost::archive::save(Archive&, T&) [with Archive = boost::archive::text_oarchive, T = PluginStateWriter<AddWindow>]’
/usr/include/boost-1_46/boost/archive/detail/common_oarchive.hpp:69:9:   instantiated from ‘void boost::archive::detail::common_oarchive<Archive>::save_override(T&, int) [with T = PluginStateWriter<AddWindow>, Archive = boost::archive::text_oarchive]’
/usr/include/boost-1_46/boost/archive/basic_text_oarchive.hpp:80:9:   instantiated from ‘void boost::archive::basic_text_oarchive<Archive>::save_override(T&, int) [with T = PluginStateWriter<AddWindow>, Archive = boost::archive::text_oarchive]’
/usr/include/boost-1_46/boost/archive/detail/interface_oarchive.hpp:63:9:   instantiated from ‘Archive& boost::archive::detail::interface_oarchive<Archive>::operator<<(T&) [with T = PluginStateWriter<AddWindow>, Archive = boost::archive::text_oarchive]’
/usr/include/compiz/core/serialization.h:122:6:   instantiated from ‘void PluginStateWriter<T>::writeSerializedData() [with T = AddWindow]’
/var/tmp/portage/x11-plugins/compiz-plugins-extra-0.9.2/work/plugins-extra/addhelper/src/addhelper.cpp:221:5:   instantiated from here
/usr/include/boost-1_46/boost/mpl/print.hpp:55:5: warning: comparison between signed and unsigned integer expressions
[ 36%] Generating ../generated/group_options.cpp
Scanning dependencies of target group
Linking CXX shared library libmaximumize.so
[ 36%] Built target maximumize
[ 37%] Generating ../generated/trailfocus.xml
[ 37%] Generating ../generated/trailfocus_options.h
[ 38%] Generating ../generated/trailfocus_options.cpp
Scanning dependencies of target trailfocus
[ 39%] Building CXX object group/CMakeFiles/group.dir/src/queues.cpp.o
[ 40%] Building CXX object trailfocus/CMakeFiles/trailfocus.dir/src/trailfocus.cpp.o
Linking CXX shared library libaddhelper.so
[ 40%] Built target addhelper
[ 41%] Building CXX object group/CMakeFiles/group.dir/src/glow.cpp.o
[ 41%] Building CXX object group/CMakeFiles/group.dir/src/init.cpp.o
[ 42%] Building CXX object trailfocus/CMakeFiles/trailfocus.dir/__/generated/trailfocus_options.cpp.o
Linking CXX shared library libtrailfocus.so
[ 42%] Built target trailfocus
[ 42%] [ 42%] Generating ../generated/showdesktop.xml
[ 43%] Generating ../generated/grid.xml
Generating ../generated/showdesktop_options.h
/var/tmp/portage/x11-plugins/compiz-plugins-extra-0.9.2/work/plugins-extra/group/src/init.cpp: In constructor ‘GroupScreen::GroupScreen(CompScreen*)’:
/var/tmp/portage/x11-plugins/compiz-plugins-extra-0.9.2/work/plugins-extra/group/src/init.cpp:373:29: warning: passing NULL to non-pointer argument 1 of ‘std::list<_Tp, _Alloc>::list(std::list::size_type, const value_type&, const allocator_type&) [with _Tp = GroupSelection*, _Alloc = std::allocator<GroupSelection*>, std::list::size_type = long unsigned int, value_type = GroupSelection*, allocator_type = std::allocator<GroupSelection*>]’[ 44%]
Generating ../generated/grid_options.h
[ 45%] Generating ../generated/showdesktop_options.cpp
Scanning dependencies of target showdesktop
[ 46%] Generating ../generated/grid_options.cpp
In file included from /usr/include/boost-1_46/boost/serialization/static_warning.hpp:73:0,
                 from /usr/include/boost-1_46/boost/serialization/extended_type_info_typeid.hpp:27,
                 from /usr/include/boost-1_46/boost/archive/detail/iserializer.hpp:47,
                 from /usr/include/boost-1_46/boost/archive/detail/interface_iarchive.hpp:22,
                 from /usr/include/boost-1_46/boost/archive/detail/common_iarchive.hpp:23,
                 from /usr/include/boost-1_46/boost/archive/basic_text_iarchive.hpp:31,
                 from /usr/include/boost-1_46/boost/archive/text_iarchive.hpp:24,
                 from /usr/include/compiz/core/serialization.h:36,
                 from /var/tmp/portage/x11-plugins/compiz-plugins-extra-0.9.2/work/plugins-extra/group/src/group.h:77,
                 from /var/tmp/portage/x11-plugins/compiz-plugins-extra-0.9.2/work/plugins-extra/group/src/init.cpp:27:
/usr/include/boost-1_46/boost/mpl/print.hpp: At global scope:
/usr/include/boost-1_46/boost/mpl/print.hpp: In instantiation of ‘boost::mpl::print<boost::serialization::BOOST_SERIALIZATION_STATIC_WARNING_LINE<98> >’:
/usr/include/boost-1_46/boost/serialization/static_warning.hpp:92:13:   instantiated from ‘boost::serialization::static_warning_test<false, 98>’
/usr/include/boost-1_46/boost/archive/detail/check.hpp:98:1:   instantiated from ‘void boost::archive::detail::check_object_tracking() [with T = PluginStateWriter<GroupScreen>]’
/usr/include/boost-1_46/boost/archive/detail/oserializer.hpp:313:9:   instantiated from ‘static void boost::archive::detail::save_non_pointer_type<Archive>::invoke(Archive&, T&) [with T = PluginStateWriter<GroupScreen>, Archive = boost::archive::text_oarchive]’
/usr/include/boost-1_46/boost/archive/detail/oserializer.hpp:525:5:   instantiated from ‘void boost::archive::save(Archive&, T&) [with Archive = boost::archive::text_oarchive, T = PluginStateWriter<GroupScreen>]’
/usr/include/boost-1_46/boost/archive/detail/common_oarchive.hpp:69:9:   instantiated from ‘void boost::archive::detail::common_oarchive<Archive>::save_override(T&, int) [with T = PluginStateWriter<GroupScreen>, Archive = boost::archive::text_oarchive]’
/usr/include/boost-1_46/boost/archive/basic_text_oarchive.hpp:80:9:   instantiated from ‘void boost::archive::basic_text_oarchive<Archive>::save_override(T&, int) [with T = PluginStateWriter<GroupScreen>, Archive = boost::archive::text_oarchive]’
/usr/include/boost-1_46/boost/archive/detail/interface_oarchive.hpp:63:9:   instantiated from ‘Archive& boost::archive::detail::interface_oarchive<Archive>::operator<<(T&) [with T = PluginStateWriter<GroupScreen>, Archive = boost::archive::text_oarchive]’
/usr/include/compiz/core/serialization.h:122:6:   instantiated from ‘void PluginStateWriter<T>::writeSerializedData() [with T = GroupScreen]’
/var/tmp/portage/x11-plugins/compiz-plugins-extra-0.9.2/work/plugins-extra/group/src/init.cpp:460:5:   instantiated from here
/usr/include/boost-1_46/boost/mpl/print.hpp:55:5: warning: comparison between signed and unsigned integer expressions
Scanning dependencies of target grid
[ 47%] Building CXX object showdesktop/CMakeFiles/showdesktop.dir/src/showdesktop.cpp.o
[ 48%] Building CXX object grid/CMakeFiles/grid.dir/src/grid.cpp.o
/var/tmp/portage/x11-plugins/compiz-plugins-extra-0.9.2/work/plugins-extra/showdesktop/src/showdesktop.cpp:81:2: warning: #warning need to make window->managed wrappable
[ 48%] Building CXX object showdesktop/CMakeFiles/showdesktop.dir/__/generated/showdesktop_options.cpp.o
[ 48%] Building CXX object grid/CMakeFiles/grid.dir/__/generated/grid_options.cpp.o
[ 49%] Building CXX object group/CMakeFiles/group.dir/src/selection.cpp.o
Linking CXX shared library libgrid.so
Linking CXX shared library libshowdesktop.so
[ 49%] Built target grid
[ 50%] Generating ../generated/showmouse.xml
[ 50%] Generating ../generated/showmouse_options.h
[ 51%] Generating ../generated/showmouse_options.cpp
Scanning dependencies of target showmouse
[ 51%] Built target showdesktop
[ 52%] Generating ../generated/notification.xml
[ 53%] Generating ../generated/notification_options.h
[ 53%] Generating ../generated/notification_options.cpp
Scanning dependencies of target notification
[ 54%] Building CXX object showmouse/CMakeFiles/showmouse.dir/src/showmouse.cpp.o
[ 54%] Building CXX object notification/CMakeFiles/notification.dir/src/notification.cpp.o
[ 55%] Building CXX object group/CMakeFiles/group.dir/src/cairo.cpp.o
In file included from /usr/include/boost-1_46/boost/serialization/static_warning.hpp:73:0,
                 from /usr/include/boost-1_46/boost/serialization/extended_type_info_typeid.hpp:27,
                 from /usr/include/boost-1_46/boost/archive/detail/iserializer.hpp:47,
                 from /usr/include/boost-1_46/boost/archive/detail/interface_iarchive.hpp:22,
                 from /usr/include/boost-1_46/boost/archive/detail/common_iarchive.hpp:23,
                 from /usr/include/boost-1_46/boost/archive/basic_text_iarchive.hpp:31,
                 from /usr/include/boost-1_46/boost/archive/text_iarchive.hpp:24,
                 from /usr/include/compiz/core/serialization.h:36,
                 from /var/tmp/portage/x11-plugins/compiz-plugins-extra-0.9.2/work/plugins-extra/showmouse/src/showmouse.h:26,
                 from /var/tmp/portage/x11-plugins/compiz-plugins-extra-0.9.2/work/plugins-extra/showmouse/src/showmouse.cpp:27:
/usr/include/boost-1_46/boost/mpl/print.hpp: In instantiation of ‘boost::mpl::print<boost::serialization::BOOST_SERIALIZATION_STATIC_WARNING_LINE<98> >’:
/usr/include/boost-1_46/boost/serialization/static_warning.hpp:92:13:   instantiated from ‘boost::serialization::static_warning_test<false, 98>’
/usr/include/boost-1_46/boost/archive/detail/check.hpp:98:1:   instantiated from ‘void boost::archive::detail::check_object_tracking() [with T = PluginStateWriter<ShowmouseScreen>]’
/usr/include/boost-1_46/boost/archive/detail/oserializer.hpp:313:9:   instantiated from ‘static void boost::archive::detail::save_non_pointer_type<Archive>::invoke(Archive&, T&) [with T = PluginStateWriter<ShowmouseScreen>, Archive = boost::archive::text_oarchive]’
/usr/include/boost-1_46/boost/archive/detail/oserializer.hpp:525:5:   instantiated from ‘void boost::archive::save(Archive&, T&) [with Archive = boost::archive::text_oarchive, T = PluginStateWriter<ShowmouseScreen>]’
/usr/include/boost-1_46/boost/archive/detail/common_oarchive.hpp:69:9:   instantiated from ‘void boost::archive::detail::common_oarchive<Archive>::save_override(T&, int) [with T = PluginStateWriter<ShowmouseScreen>, Archive = boost::archive::text_oarchive]’
/usr/include/boost-1_46/boost/archive/basic_text_oarchive.hpp:80:9:   instantiated from ‘void boost::archive::basic_text_oarchive<Archive>::save_override(T&, int) [with T = PluginStateWriter<ShowmouseScreen>, Archive = boost::archive::text_oarchive]’
/usr/include/boost-1_46/boost/archive/detail/interface_oarchive.hpp:63:9:   instantiated from ‘Archive& boost::archive::detail::interface_oarchive<Archive>::operator<<(T&) [with T = PluginStateWriter<ShowmouseScreen>, Archive = boost::archive::text_oarchive]’
/usr/include/compiz/core/serialization.h:122:6:   instantiated from ‘void PluginStateWriter<T>::writeSerializedData() [with T = ShowmouseScreen]’
/var/tmp/portage/x11-plugins/compiz-plugins-extra-0.9.2/work/plugins-extra/showmouse/src/showmouse.cpp:701:5:   instantiated from here
/usr/include/boost-1_46/boost/mpl/print.hpp:55:5: warning: comparison between signed and unsigned integer expressions
/var/tmp/portage/x11-plugins/compiz-plugins-extra-0.9.2/work/plugins-extra/notification/src/notification.cpp: In member function ‘virtual void NotificationScreen::logMessage(const char*, CompLogLevel, const char*)’:
/var/tmp/portage/x11-plugins/compiz-plugins-extra-0.9.2/work/plugins-extra/notification/src/notification.cpp:58:28: error: too many arguments to function ‘NotifyNotification* notify_notification_new(const char*, const char*, const char*)’
/usr/include/libnotify/notification.h:114:21: note: declared here
make[2]: *** [notification/CMakeFiles/notification.dir/src/notification.cpp.o] Error 1
make[1]: *** [notification/CMakeFiles/notification.dir/all] Error 2
make[1]: *** Waiting for unfinished jobs....
[ 55%] Building CXX object group/CMakeFiles/group.dir/src/tab.cpp.o
[ 56%] Building CXX object group/CMakeFiles/group.dir/src/group.cpp.o
[ 57%] Building CXX object showmouse/CMakeFiles/showmouse.dir/__/generated/showmouse_options.cpp.o
In file included from /usr/include/boost-1_46/boost/serialization/static_warning.hpp:73:0,
                 from /usr/include/boost-1_46/boost/serialization/extended_type_info_typeid.hpp:27,
                 from /usr/include/boost-1_46/boost/archive/detail/iserializer.hpp:47,
                 from /usr/include/boost-1_46/boost/archive/detail/interface_iarchive.hpp:22,
                 from /usr/include/boost-1_46/boost/archive/detail/common_iarchive.hpp:23,
                 from /usr/include/boost-1_46/boost/archive/basic_text_iarchive.hpp:31,
                 from /usr/include/boost-1_46/boost/archive/text_iarchive.hpp:24,
                 from /usr/include/compiz/core/serialization.h:36,
                 from /var/tmp/portage/x11-plugins/compiz-plugins-extra-0.9.2/work/plugins-extra/group/src/group.h:77,
                 from /var/tmp/portage/x11-plugins/compiz-plugins-extra-0.9.2/work/plugins-extra/group/src/tab.cpp:27:
/usr/include/boost-1_46/boost/mpl/print.hpp: In instantiation of ‘boost::mpl::print<boost::serialization::BOOST_SERIALIZATION_STATIC_WARNING_LINE<98> >’:
/usr/include/boost-1_46/boost/serialization/static_warning.hpp:92:13:   instantiated from ‘boost::serialization::static_warning_test<false, 98>’
/usr/include/boost-1_46/boost/archive/detail/check.hpp:98:1:   instantiated from ‘void boost::archive::detail::check_object_tracking() [with T = PluginStateWriter<GroupScreen>]’
/usr/include/boost-1_46/boost/archive/detail/oserializer.hpp:313:9:   instantiated from ‘static void boost::archive::detail::save_non_pointer_type<Archive>::invoke(Archive&, T&) [with T = PluginStateWriter<GroupScreen>, Archive = boost::archive::text_oarchive]’
/usr/include/boost-1_46/boost/archive/detail/oserializer.hpp:525:5:   instantiated from ‘void boost::archive::save(Archive&, T&) [with Archive = boost::archive::text_oarchive, T = PluginStateWriter<GroupScreen>]’
/usr/include/boost-1_46/boost/archive/detail/common_oarchive.hpp:69:9:   instantiated from ‘void boost::archive::detail::common_oarchive<Archive>::save_override(T&, int) [with T = PluginStateWriter<GroupScreen>, Archive = boost::archive::text_oarchive]’
/usr/include/boost-1_46/boost/archive/basic_text_oarchive.hpp:80:9:   instantiated from ‘void boost::archive::basic_text_oarchive<Archive>::save_override(T&, int) [with T = PluginStateWriter<GroupScreen>, Archive = boost::archive::text_oarchive]’
/usr/include/boost-1_46/boost/archive/detail/interface_oarchive.hpp:63:9:   instantiated from ‘Archive& boost::archive::detail::interface_oarchive<Archive>::operator<<(T&) [with T = PluginStateWriter<GroupScreen>, Archive = boost::archive::text_oarchive]’
/usr/include/compiz/core/serialization.h:122:6:   instantiated from ‘void PluginStateWriter<T>::writeSerializedData() [with T = GroupScreen]’
/var/tmp/portage/x11-plugins/compiz-plugins-extra-0.9.2/work/plugins-extra/group/src/tab.cpp:2548:30:   instantiated from here
/usr/include/boost-1_46/boost/mpl/print.hpp:55:5: warning: comparison between signed and unsigned integer expressions
In file included from /usr/include/boost-1_46/boost/serialization/static_warning.hpp:73:0,
                 from /usr/include/boost-1_46/boost/serialization/extended_type_info_typeid.hpp:27,
                 from /usr/include/boost-1_46/boost/archive/detail/iserializer.hpp:47,
                 from /usr/include/boost-1_46/boost/archive/detail/interface_iarchive.hpp:22,
                 from /usr/include/boost-1_46/boost/archive/detail/common_iarchive.hpp:23,
                 from /usr/include/boost-1_46/boost/archive/basic_text_iarchive.hpp:31,
                 from /usr/include/boost-1_46/boost/archive/text_iarchive.hpp:24,
                 from /usr/include/compiz/core/serialization.h:36,
                 from /var/tmp/portage/x11-plugins/compiz-plugins-extra-0.9.2/work/plugins-extra/group/src/group.h:77,
                 from /var/tmp/portage/x11-plugins/compiz-plugins-extra-0.9.2/work/plugins-extra/group/src/group.cpp:27:
/usr/include/boost-1_46/boost/mpl/print.hpp: In instantiation of ‘boost::mpl::print<boost::serialization::BOOST_SERIALIZATION_STATIC_WARNING_LINE<98> >’:
/usr/include/boost-1_46/boost/serialization/static_warning.hpp:92:13:   instantiated from ‘boost::serialization::static_warning_test<false, 98>’
/usr/include/boost-1_46/boost/archive/detail/check.hpp:98:1:   instantiated from ‘void boost::archive::detail::check_object_tracking() [with T = PluginStateWriter<GroupScreen>]’
/usr/include/boost-1_46/boost/archive/detail/oserializer.hpp:313:9:   instantiated from ‘static void boost::archive::detail::save_non_pointer_type<Archive>::invoke(Archive&, T&) [with T = PluginStateWriter<GroupScreen>, Archive = boost::archive::text_oarchive]’
/usr/include/boost-1_46/boost/archive/detail/oserializer.hpp:525:5:   instantiated from ‘void boost::archive::save(Archive&, T&) [with Archive = boost::archive::text_oarchive, T = PluginStateWriter<GroupScreen>]’
/usr/include/boost-1_46/boost/archive/detail/common_oarchive.hpp:69:9:   instantiated from ‘void boost::archive::detail::common_oarchive<Archive>::save_override(T&, int) [with T = PluginStateWriter<GroupScreen>, Archive = boost::archive::text_oarchive]’
/usr/include/boost-1_46/boost/archive/basic_text_oarchive.hpp:80:9:   instantiated from ‘void boost::archive::basic_text_oarchive<Archive>::save_override(T&, int) [with T = PluginStateWriter<GroupScreen>, Archive = boost::archive::text_oarchive]’
/usr/include/boost-1_46/boost/archive/detail/interface_oarchive.hpp:63:9:   instantiated from ‘Archive& boost::archive::detail::interface_oarchive<Archive>::operator<<(T&) [with T = PluginStateWriter<GroupScreen>, Archive = boost::archive::text_oarchive]’
/usr/include/compiz/core/serialization.h:122:6:   instantiated from ‘void PluginStateWriter<T>::writeSerializedData() [with T = GroupScreen]’
/var/tmp/portage/x11-plugins/compiz-plugins-extra-0.9.2/work/plugins-extra/group/src/group.cpp:553:27:   instantiated from here
/usr/include/boost-1_46/boost/mpl/print.hpp:55:5: warning: comparison between signed and unsigned integer expressions
Linking CXX shared library libshowmouse.so
[ 57%] Built target showmouse
[ 58%] Building CXX object group/CMakeFiles/group.dir/src/paint.cpp.o
[ 59%] Building CXX object group/CMakeFiles/group.dir/__/generated/group_options.cpp.o
Linking CXX shared library libgroup.so
[ 59%] Built target group
make: *** [all] Error 2
emake failed
 * ERROR: x11-plugins/compiz-plugins-extra-0.9.2 failed (compile phase):
 *   Make failed!
 *
 * Call stack:
 *     ebuild.sh, line   85:  Called src_compile
 *   environment, line 2523:  Called cmake-utils_src_compile
 *   environment, line  623:  Called _execute_optionaly 'src_compile'
 *   environment, line  224:  Called enable_cmake-utils_src_compile
 *   environment, line  872:  Called cmake-utils_src_make
 *   environment, line  642:  Called die
 * The specific snippet of code:
 *           emake "$@" || die "Make failed!";
 *
 * If you need support, post the output of 'emerge --info =x11-plugins/compiz-plugins-extra-0.9.2',
 * the complete build log and the output of 'emerge -pqv =x11-plugins/compiz-plugins-extra-0.9.2'.
 * This ebuild is from an overlay named 'desktop-effects': '/var/lib/layman/desktop-effects/'
 * The complete build log is located at '/var/tmp/portage/x11-plugins/compiz-plugins-extra-0.9.2/temp/build.log'.
 * The ebuild environment file is located at '/var/tmp/portage/x11-plugins/compiz-plugins-extra-0.9.2/temp/environment'.
 * S: '/var/tmp/portage/x11-plugins/compiz-plugins-extra-0.9.2/work/plugins-extra'

>>> Failed to emerge x11-plugins/compiz-plugins-extra-0.9.2, Log file:

>>>  '/var/tmp/portage/x11-plugins/compiz-plugins-extra-0.9.2/temp/build.log'

 * Messages for package x11-plugins/compiz-plugins-extra-0.9.2:

 * ERROR: x11-plugins/compiz-plugins-extra-0.9.2 failed (compile phase):
 *   Make failed!
 *
 * Call stack:
 *     ebuild.sh, line   85:  Called src_compile
 *   environment, line 2523:  Called cmake-utils_src_compile
 *   environment, line  623:  Called _execute_optionaly 'src_compile'
 *   environment, line  224:  Called enable_cmake-utils_src_compile
 *   environment, line  872:  Called cmake-utils_src_make
 *   environment, line  642:  Called die
 * The specific snippet of code:
 *           emake "$@" || die "Make failed!";
 *
 * If you need support, post the output of 'emerge --info =x11-plugins/compiz-plugins-extra-0.9.2',
 * the complete build log and the output of 'emerge -pqv =x11-plugins/compiz-plugins-extra-0.9.2'.
 * This ebuild is from an overlay named 'desktop-effects': '/var/lib/layman/desktop-effects/'
 * The complete build log is located at '/var/tmp/portage/x11-plugins/compiz-plugins-extra-0.9.2/temp/build.log'.
 * The ebuild environment file is located at '/var/tmp/portage/x11-plugins/compiz-plugins-extra-0.9.2/temp/environment'.
 * S: '/var/tmp/portage/x11-plugins/compiz-plugins-extra-0.9.2/work/plugins-extra'



If anyone has any ideas, I'd be very grateful.

Thanks,
Jim
_________________
Intel 2.2 Core 2 Duo, 4Gb Ram, 320GB Sata Drive and Nvidia card.
Back to top
View user's profile Send private message
Display posts from previous:   
Reply to topic    Gentoo Forums Forum Index Unsupported Software All times are GMT
Page 1 of 1

 
Jump to:  
You cannot post new topics in this forum
You cannot reply to topics in this forum
You cannot edit your posts in this forum
You cannot delete your posts in this forum
You cannot vote in polls in this forum