Gentoo Forums
Gentoo Forums
Gentoo Forums
Quick Search: in
chromium:live failed to emerge
View unanswered posts
View posts from last 24 hours

 
Reply to topic    Gentoo Forums Forum Index Unsupported Software
View previous topic :: View next topic  
Author Message
mathfeel
l33t
l33t


Joined: 03 Aug 2004
Posts: 700

PostPosted: Sat Jun 09, 2012 5:02 pm    Post subject: chromium:live failed to emerge Reply with quote

It failed at configuration phase:

Code:
Checked out revision 11689.
Syncing projects: 100% (90/90), done.
 * Copying source to /var/tmp/portage/www-client/chromium-9999-r1/work/chromium-9999
 * Installing/updating to version 21.0.1170.0 (Developer Build 141360)
>>> Source unpacked in /var/tmp/portage/www-client/chromium-9999-r1/work
>>> Preparing source in /var/tmp/portage/www-client/chromium-9999-r1/work/chromium-9999 ...
 * V8 version: bundled - 3.11.8.0; installed - 9999
>>> Source prepared.
>>> Configuring source in /var/tmp/portage/www-client/chromium-9999-r1/work/chromium-9999 ...
build/gyp_chromium --depth=. -Ddisable_sse2=1 -Dlinux_use_tcmalloc=0 -Ddisable_glibc=1 -Dflapper_version_h_file=/var/tmp/portage/www-client/chromium-9999-r1/temp/flapper_version.h -Duse_system_bzip2=1 -Duse_system_flac=1 -Duse_system_icu=1 -Duse_system_libevent=1 -Duse_system_libjpeg=1 -Duse_system_libpng=1 -Duse_system_libusb=1 -Duse_system_libwebp=1 -Duse_system_libxml=1 -Duse_system_speex=1 -Duse_system_v8=1 -Duse_system_xdg_utils=1 -Duse_system_yasm=1 -Duse_system_zlib=1 -Duse_cups=1 -Duse_gconf=1 -Duse_gnome_keyring=1 -Dlinux_link_gnome_keyring=1 -Duse_kerberos=0 -Duse_pulseaudio=0 -Dselinux=0 -Dlinux_sandbox_path=/usr/lib64/chromium-browser-live/chrome_sandbox -Dlinux_sandbox_chrome_path=/usr/lib64/chromium-browser-live/chrome -Dlinux_use_gold_binary=0 -Dlinux_use_gold_flags=0 -Dproprietary_codecs=1 -Dffmpeg_branding=Chrome -Dtarget_arch=x64 -Dwerror=
Updating projects from gyp files...
Traceback (most recent call last):
  File "build/gyp_chromium", line 173, in <module>
    sys.exit(gyp.main(args))
  File "/var/tmp/portage/www-client/chromium-9999-r1/work/chromium-9999/tools/gyp/pylib/gyp/__init__.py", line 471, in main
    options.circular_check)
  File "/var/tmp/portage/www-client/chromium-9999-r1/work/chromium-9999/tools/gyp/pylib/gyp/__init__.py", line 111, in Load
    depth, generator_input_info, check, circular_check)
  File "/var/tmp/portage/www-client/chromium-9999-r1/work/chromium-9999/tools/gyp/pylib/gyp/input.py", line 2444, in Load
    target_dict, PHASE_LATE, variables, build_file)
  File "/var/tmp/portage/www-client/chromium-9999-r1/work/chromium-9999/tools/gyp/pylib/gyp/input.py", line 1053, in ProcessVariablesAndConditionsInDict
    build_file)
  File "/var/tmp/portage/www-client/chromium-9999-r1/work/chromium-9999/tools/gyp/pylib/gyp/input.py", line 1068, in ProcessVariablesAndConditionsInList
    ProcessVariablesAndConditionsInDict(item, phase, variables, build_file)
  File "/var/tmp/portage/www-client/chromium-9999-r1/work/chromium-9999/tools/gyp/pylib/gyp/input.py", line 1053, in ProcessVariablesAndConditionsInDict
    build_file)
  File "/var/tmp/portage/www-client/chromium-9999-r1/work/chromium-9999/tools/gyp/pylib/gyp/input.py", line 1072, in ProcessVariablesAndConditionsInList
    expanded = ExpandVariables(item, phase, variables, build_file)
  File "/var/tmp/portage/www-client/chromium-9999-r1/work/chromium-9999/tools/gyp/pylib/gyp/input.py", line 755, in ExpandVariables
    build_file)
  File "/var/tmp/portage/www-client/chromium-9999-r1/work/chromium-9999/tools/gyp/pylib/gyp/input.py", line 1072, in ProcessVariablesAndConditionsInList
    expanded = ExpandVariables(item, phase, variables, build_file)
  File "/var/tmp/portage/www-client/chromium-9999-r1/work/chromium-9999/tools/gyp/pylib/gyp/input.py", line 739, in ExpandVariables
    ' in ' + build_file
KeyError: 'Undefined variable out_glibc64 in ppapi/ppapi_untrusted.gyp'
 * ERROR: www-client/chromium-9999-r1 failed (configure phase):
 *   (no error message)
 *
 * Call stack:
 *     ebuild.sh, line  85:  Called src_configure
 *   environment, line 6439:  Called die
 * The specific snippet of code:
 *       egyp_chromium ${myconf} || die
 *
 * If you need support, post the output of `emerge --info '=www-client/chromium-9999-r1'`,
 * the complete build log and the output of `emerge -pqv '=www-client/chromium-9999-r1'`.
 * The complete build log is located at '/var/log/portage/build/www-client/chromium-9999-r1:20120609-122253.log'.
 * For convenience, a symlink to the build log is located at '/var/tmp/portage/www-client/chromium-9999-r1/temp/build.log'.
 * The ebuild environment file is located at '/var/tmp/portage/www-client/chromium-9999-r1/temp/environment'.
 * Working directory: '/var/tmp/portage/www-client/chromium-9999-r1/work/chromium-9999'
 * S: '/var/tmp/portage/www-client/chromium-9999-r1/work/chromium-9999'

_________________
-----------------------------------------------------------
"In heaven all the interesting people are missing"
-- Friedrich Nietzsche
Back to top
View user's profile Send private message
joecool
n00b
n00b


Joined: 31 Aug 2004
Posts: 30

PostPosted: Thu Jun 21, 2012 2:33 am    Post subject: Reply with quote

Can you be a bit more verbose, I'm having the same error with gcc-4.7.1

Code:
Portage 2.2.0_alpha110_p47 (default/linux/amd64/10.0/no-multilib, gcc-4.7.1, glibc-2.15-r2, 3.4.3-ck2 x86_64)
=================================================================
System uname: Linux-3.4.3-ck2-x86_64-Intel-R-_Core-TM-_i7_CPU_M_620_@_2.67GHz-with-gentoo-2.1
Timestamp of tree: Thu, 21 Jun 2012 00:45:01 +0000
app-shells/bash:          4.2_p29
dev-java/java-config:     2.1.12
dev-lang/python:          2.7.3-r2, 3.2.3-r1
dev-util/cmake:           2.8.8-r3
dev-util/pkgconfig:       0.26
sys-apps/baselayout:      2.1-r1
sys-apps/openrc:          0.10.3
sys-apps/sandbox:         2.5
sys-devel/autoconf:       2.13, 2.69
sys-devel/automake:       1.11.5, 1.12.1
sys-devel/binutils:       2.22-r1
sys-devel/gcc:            4.7.1
sys-devel/gcc-config:     1.7.3
sys-devel/libtool:        2.4.2
sys-devel/make:           3.82-r3
sys-kernel/linux-headers: 3.4 (virtual/os-headers)
sys-libs/glibc:           2.15-r2
Repositories: gentoo bitcoin java-overlay pentoo sunrise local
Installed sets:
ACCEPT_KEYWORDS="amd64 ~amd64"
ACCEPT_LICENSE="*"
CBUILD="x86_64-pc-linux-gnu"
CFLAGS="-O2 -pipe -march=native -floop-interchange -floop-strip-mine -floop-block"
CHOST="x86_64-pc-linux-gnu"
CONFIG_PROTECT="/etc /usr/share/gnupg/qualified.txt /usr/share/openvpn/easy-rsa"
CONFIG_PROTECT_MASK="${EPREFIX}/etc/gconf /etc/ca-certificates.conf /etc/env.d /etc/fonts/fonts.conf /etc/gconf /etc/gentoo-release /etc/revdep-rebuild /etc/sandbox.d /etc/terminfo"
CXXFLAGS="-O2 -pipe -march=native -floop-interchange -floop-strip-mine -floop-block"
DISTDIR="/usr/portage/distfiles"
EMERGE_DEFAULT_OPTS="--quiet-build=n"
FCFLAGS="-O2 -pipe"
FEATURES="assume-digests binpkg-logs candy config-protect-if-modified distlocks ebuild-locks fixlafiles news parallel-fetch parse-eapi-ebuild-head preserve-libs protect-owned sandbox sfperms strict unknown-fea

tures-warn unmerge-logs unmerge-orphans userfetch"
FFLAGS="-O2 -pipe"
GENTOO_MIRRORS="http://lug.mtu.edu/gentoo/ http://gentoo.llarian.net/"
LANG="en_US.UTF-8"
LC_ALL="en_US.UTF-8"
LDFLAGS="-Wl,-O1 -Wl,--as-needed"
LINGUAS="en_US en"
MAKEOPTS="-j4"
PKGDIR="/usr/portage/packages"
PORTAGE_CONFIGROOT="/"
PORTAGE_RSYNC_OPTS="--recursive --links --safe-links --perms --times --compress --force --whole-file --delete --stats --human-readable --timeout=180 --exclude=/distfiles --exclude=/local --exclude=/packages"
PORTAGE_TMPDIR="/var/tmp"
PORTDIR="/usr/portage"
PORTDIR_OVERLAY="/var/lib/layman/bitcoin /var/lib/layman/java-overlay /var/lib/layman/pentoo /var/lib/layman/sunrise /usr/local/portage"
SYNC="rsync://rsync.us.gentoo.org/gentoo-portage"
USE="X alsa amd64 berkdb bzip2 cli corefonts cracklib crypt cups cxx dri gdbm gif gnutls gpm iconv icu ipv6 jpeg mmx mmxext modules mudflap ncurses nptl nptlonly opengl openmp pam pcre png ppds pppd readline sdl session sse sse2 sse3 sse4_1 ssl ssse3 tcpd threads tiff truetype unicode wifi xinerama xorg zlib" ALSA_CARDS="ali5451 als4000 atiixp atiixp-modem bt87x ca0106 cmipci emu10k1x ens1370 ens1371 es1938 es1968 fm801 hda-intel intel8x0 intel8x0m maestro3 trident usb-audio via82xx via82xx-modem ymfpci" ALSA_PCM_PLUGINS="adpcm alaw asym copy dmix dshare dsnoop empty extplug file hooks iec958 ioplug ladspa lfloat linear meter mmap_emul mulaw multi null plug rate route share shm softvol" APACHE2_MODULES="actions alias auth_basic authn_alias authn_anon authn_dbm authn_default authn_file authz_dbm authz_default authz_groupfile authz_host authz_owner authz_user autoindex cache cgi cgid dav dav_fs dav_lock deflate dir disk_cache env expires ext_filter file_cache filter headers include info log_config logio mem_cache mime mime_magic negotiation rewrite setenvif speling status unique_id userdir usertrack vhost_alias" CALLIGRA_FEATURES="kexi words flow plan sheets stage tables krita karbon braindump" CAMERAS="ptp2" COLLECTD_PLUGINS="df interface irq load memory rrdtool swap syslog" ELIBC="glibc" GPSD_PROTOCOLS="ashtech aivdm earthmate evermore fv18 garmin garmintxt gpsclock itrax mtk3301 nmea ntrip navcom oceanserver oldstyle oncore rtcm104v2 rtcm104v3 sirf superstar2 timing tsip tripmate tnt ubx" INPUT_DEVICES="keyboard mouse evdev" KERNEL="linux" LCD_DEVICES="bayrad cfontz cfontz633 glk hd44780 lb216 lcdm001 mtxorb ncurses text" LIBREOFFICE_EXTENSIONS="presenter-console presenter-minimizer" LINGUAS="en_US en" PHP_TARGETS="php5-3" PYTHON_TARGETS="python3_2 python2_7" RUBY_TARGETS="ruby18 ruby19" SANE_BACKENDS="hp hp3500 hp3900 hp4200 hp5400 hp5590 hpljm1005 hpsj5s" USERLAND="GNU" VIDEO_CARDS="fbdev intel vesa i965" XTABLES_ADDONS="quota2 psd pknock lscan length2 ipv4options ipset ipp2p iface geoip fuzzy condition tee tarpit sysrq steal rawnat logmark ipmark dhcpmac delude chaos account"
Unset:  CPPFLAGS, CTARGET, INSTALL_MASK, PORTAGE_BUNZIP2_COMMAND, PORTAGE_COMPRESS, PORTAGE_COMPRESS_FLAGS, PORTAGE_RSYNC_EXTRA_OPTS, USE_PYTHON


My error:

Code:

 * Copying source to /var/tmp/portage/www-client/chromium-9999-r1/work/chromium-9999
 * Installing/updating to version 22.0.1182.0 (Developer Build 143283)
>>> Source unpacked in /var/tmp/portage/www-client/chromium-9999-r1/work
>>> Preparing source in /var/tmp/portage/www-client/chromium-9999-r1/work/chromium-9999 ...
 * Applying user patches from /etc/portage/patches//www-client/chromium-9999 ...
 *   chromium-gcc-4.7-r1.patch ...
 * Done with patching
 * V8 version: bundled - 3.11.10.6; installed - 9999
>>> Source prepared.
>>> Configuring source in /var/tmp/portage/www-client/chromium-9999-r1/work/chromium-9999 ...
build/gyp_chromium --depth=. -Ddisable_sse2=1 -Dlinux_use_tcmalloc=0 -Ddisable_glibc=1 -Dflapper_version_h_file=/var/tmp/portage/www-client/chromium-9999-r1/temp/flapper_version.h -Duse_system_bzip2=1 -Duse_syu=1 -Duse_system_libevent=1 -Duse_system_libjpeg=1 -Duse_system_libpng=1 -Duse_system_libusb=1 -Duse_system_libxml=1 -Duse_system_speex=1 -Duse_system_v8=1 -Duse_system_xdg_utils=1 -Duse_system_yasm=1 -Duse_syuse_gconf=0 -Duse_gnome_keyring=0 -Dlinux_link_gnome_keyring=0 -Duse_kerberos=0 -Duse_pulseaudio=0 -Dselinux=0 -Dlinux_sandbox_path=/usr/lib64/chromium-browser-live/chrome_sandbox -Dlinux_sandbox_chrome_path=/live/chrome -Dlinux_use_gold_binary=0 -Dlinux_use_gold_flags=0 -Dproprietary_codecs=1 -Dffmpeg_branding=Chrome -Dtarget_arch=x64 -Dwerror=
Updating projects from gyp files...
Traceback (most recent call last):
  File "build/gyp_chromium", line 173, in <module>
    sys.exit(gyp.main(args))
  File "/var/tmp/portage/www-client/chromium-9999-r1/work/chromium-9999/tools/gyp/pylib/gyp/__init__.py", line 471, in main
    options.circular_check)
  File "/var/tmp/portage/www-client/chromium-9999-r1/work/chromium-9999/tools/gyp/pylib/gyp/__init__.py", line 111, in Load
    depth, generator_input_info, check, circular_check)
  File "/var/tmp/portage/www-client/chromium-9999-r1/work/chromium-9999/tools/gyp/pylib/gyp/input.py", line 2444, in Load
    target_dict, PHASE_LATE, variables, build_file)
  File "/var/tmp/portage/www-client/chromium-9999-r1/work/chromium-9999/tools/gyp/pylib/gyp/input.py", line 1053, in ProcessVariablesAndConditionsInDict
    build_file)
  File "/var/tmp/portage/www-client/chromium-9999-r1/work/chromium-9999/tools/gyp/pylib/gyp/input.py", line 1068, in ProcessVariablesAndConditionsInList
    ProcessVariablesAndConditionsInDict(item, phase, variables, build_file)
  File "/var/tmp/portage/www-client/chromium-9999-r1/work/chromium-9999/tools/gyp/pylib/gyp/input.py", line 1053, in ProcessVariablesAndConditionsInDict
    build_file)
  File "/var/tmp/portage/www-client/chromium-9999-r1/work/chromium-9999/tools/gyp/pylib/gyp/input.py", line 1072, in ProcessVariablesAndConditionsInList
    expanded = ExpandVariables(item, phase, variables, build_file)
  File "/var/tmp/portage/www-client/chromium-9999-r1/work/chromium-9999/tools/gyp/pylib/gyp/input.py", line 755, in ExpandVariables
    build_file)
  File "/var/tmp/portage/www-client/chromium-9999-r1/work/chromium-9999/tools/gyp/pylib/gyp/input.py", line 1072, in ProcessVariablesAndConditionsInList
    expanded = ExpandVariables(item, phase, variables, build_file)
  File "/var/tmp/portage/www-client/chromium-9999-r1/work/chromium-9999/tools/gyp/pylib/gyp/input.py", line 739, in ExpandVariables
    ' in ' + build_file
KeyError: 'Undefined variable out_glibc64 in ppapi/ppapi_untrusted.gyp'
Back to top
View user's profile Send private message
phajdan.jr
Retired Dev
Retired Dev


Joined: 23 Mar 2006
Posts: 1777
Location: Poland

PostPosted: Thu Jun 21, 2012 1:51 pm    Post subject: Reply with quote

This has been fixed by my upstream patch http://codereview.chromium.org/10537124/

I guess you're aware the 9999 ebuild may fail randomly.
_________________
http://phajdan-jr.blogspot.com/
Back to top
View user's profile Send private message
mathfeel
l33t
l33t


Joined: 03 Aug 2004
Posts: 700

PostPosted: Fri Jun 22, 2012 7:14 am    Post subject: Reply with quote

phajdan.jr wrote:
This has been fixed by my upstream patch http://codereview.chromium.org/10537124/

I guess you're aware the 9999 ebuild may fail randomly.


It appears so. Now new error:
Code:
At revision 120888.
Syncing projects: 100% (92/92), done.
 * Copying source to /var/tmp/portage/www-client/chromium-9999-r1/work/chromium-9999
 * Installing/updating to version 22.0.1183.0 (Developer Build 143368)
>>> Source unpacked in /var/tmp/portage/www-client/chromium-9999-r1/work
>>> Preparing source in /var/tmp/portage/www-client/chromium-9999-r1/work/chromium-9999 ...
 * V8 version: bundled - 3.11.10.6; installed - 9999
>>> Source prepared.
>>> Configuring source in /var/tmp/portage/www-client/chromium-9999-r1/work/chromium-9999 ...
build/gyp_chromium --depth=. -Ddisable_sse2=1 -Dlinux_use_tcmalloc=0 -Ddisable_glibc=1 -Dflapper_version_h_file=/var/tmp/portage/www-client/chromium-9999-r1/temp/flapper_version.h -Duse_system_bzip2=1 -Duse_system_flac=1 -Duse_system_icu=1 -Duse_system_libevent=1 -Duse_system_libjpeg=1 -Duse_system_libpng=1 -Duse_system_libusb=1 -Duse_system_libxml=1 -Duse_system_speex=1 -Duse_system_v8=1 -Duse_system_xdg_utils=1 -Duse_system_yasm=1 -Duse_system_zlib=1 -Duse_cups=1 -Duse_gconf=1 -Duse_gnome_keyring=1 -Dlinux_link_gnome_keyring=1 -Duse_kerberos=0 -Duse_pulseaudio=0 -Dselinux=0 -Dlinux_sandbox_path=/usr/lib64/chromium-browser-live/chrome_sandbox -Dlinux_sandbox_chrome_path=/usr/lib64/chromium-browser-live/chrome -Dlinux_use_gold_binary=0 -Dlinux_use_gold_flags=0 -Dproprietary_codecs=1 -Dffmpeg_branding=Chrome -Dtarget_arch=x64 -Dwerror=
Updating projects from gyp files...
Traceback (most recent call last):
  File "build/gyp_chromium", line 173, in <module>
    sys.exit(gyp.main(args))
  File "/var/tmp/portage/www-client/chromium-9999-r1/work/chromium-9999/tools/gyp/pylib/gyp/__init__.py", line 471, in main
    options.circular_check)
  File "/var/tmp/portage/www-client/chromium-9999-r1/work/chromium-9999/tools/gyp/pylib/gyp/__init__.py", line 111, in Load
    depth, generator_input_info, check, circular_check)
  File "/var/tmp/portage/www-client/chromium-9999-r1/work/chromium-9999/tools/gyp/pylib/gyp/input.py", line 2378, in Load
    depth, check)
  File "/var/tmp/portage/www-client/chromium-9999-r1/work/chromium-9999/tools/gyp/pylib/gyp/input.py", line 430, in LoadTargetBuildFile
    includes, depth, check)
  File "/var/tmp/portage/www-client/chromium-9999-r1/work/chromium-9999/tools/gyp/pylib/gyp/input.py", line 430, in LoadTargetBuildFile
    includes, depth, check)
  File "/var/tmp/portage/www-client/chromium-9999-r1/work/chromium-9999/tools/gyp/pylib/gyp/input.py", line 384, in LoadTargetBuildFile
    build_file_data, PHASE_EARLY, variables, build_file_path)
  File "/var/tmp/portage/www-client/chromium-9999-r1/work/chromium-9999/tools/gyp/pylib/gyp/input.py", line 1053, in ProcessVariablesAndConditionsInDict
    build_file)
  File "/var/tmp/portage/www-client/chromium-9999-r1/work/chromium-9999/tools/gyp/pylib/gyp/input.py", line 1068, in ProcessVariablesAndConditionsInList
    ProcessVariablesAndConditionsInDict(item, phase, variables, build_file)
  File "/var/tmp/portage/www-client/chromium-9999-r1/work/chromium-9999/tools/gyp/pylib/gyp/input.py", line 1053, in ProcessVariablesAndConditionsInDict
    build_file)
  File "/var/tmp/portage/www-client/chromium-9999-r1/work/chromium-9999/tools/gyp/pylib/gyp/input.py", line 1068, in ProcessVariablesAndConditionsInList
    ProcessVariablesAndConditionsInDict(item, phase, variables, build_file)
  File "/var/tmp/portage/www-client/chromium-9999-r1/work/chromium-9999/tools/gyp/pylib/gyp/input.py", line 1053, in ProcessVariablesAndConditionsInDict
    build_file)
  File "/var/tmp/portage/www-client/chromium-9999-r1/work/chromium-9999/tools/gyp/pylib/gyp/input.py", line 1072, in ProcessVariablesAndConditionsInList
    expanded = ExpandVariables(item, phase, variables, build_file)
  File "/var/tmp/portage/www-client/chromium-9999-r1/work/chromium-9999/tools/gyp/pylib/gyp/input.py", line 691, in ExpandVariables
    replacement = str(py_module.DoMain(parsed_contents[1:])).rstrip()
  File "/var/tmp/portage/www-client/chromium-9999-r1/work/chromium-9999/tools/grit/grit_info.py", line 142, in DoMain
    inputs = Inputs(filename, defines)
  File "/var/tmp/portage/www-client/chromium-9999-r1/work/chromium-9999/tools/grit/grit_info.py", line 107, in Inputs
    files.update(node.GetHtmlResourceFilenames())
  File "/var/tmp/portage/www-client/chromium-9999-r1/work/chromium-9999/tools/grit/grit/node/include.py", line 121, in GetHtmlResourceFilenames
    allow_external_script=allow_external_script)
  File "/var/tmp/portage/www-client/chromium-9999-r1/work/chromium-9999/tools/grit/grit/format/html_inline.py", line 365, in GetResourceFilenames
    (e.filename, filename, e.strerror))
Exception: Failed to open ../third_party/trace-viewer/src/tracing.html while trying to flatten ../third_party/trace-viewer/src/tracing.html. (No such file or directory) while loading dependencies of chrome/chrome.gyp while loading dependencies of build/all.gyp while trying to load build/all.gyp
 * ERROR: www-client/chromium-9999-r1 failed (configure phase):
 *   (no error message)
 *
 * Call stack:
 *     ebuild.sh, line  85:  Called src_configure
 *   environment, line 6480:  Called die
 * The specific snippet of code:
 *       egyp_chromium ${myconf} || die
 *
 * If you need support, post the output of `emerge --info '=www-client/chromium-9999-r1'`,
 * the complete build log and the output of `emerge -pqv '=www-client/chromium-9999-r1'`.
 * The complete build log is located at '/var/log/portage/build/www-client/chromium-9999-r1:20120621-113653.log'.
 * For convenience, a symlink to the build log is located at '/var/tmp/portage/www-client/chromium-9999-r1/temp/build.log'.
 * The ebuild environment file is located at '/var/tmp/portage/www-client/chromium-9999-r1/temp/environment'.
 * Working directory: '/var/tmp/portage/www-client/chromium-9999-r1/work/chromium-9999'
 * S: '/var/tmp/portage/www-client/chromium-9999-r1/work/chromium-9999'

_________________
-----------------------------------------------------------
"In heaven all the interesting people are missing"
-- Friedrich Nietzsche
Back to top
View user's profile Send private message
phajdan.jr
Retired Dev
Retired Dev


Joined: 23 Mar 2006
Posts: 1777
Location: Poland

PostPosted: Fri Jun 22, 2012 7:56 am    Post subject: Reply with quote

This has been fixed 2 days ago, please sync your tree.

http://sources.gentoo.org/cgi-bin/viewvc.cgi/gentoo-x86/www-client/chromium/chromium-9999-r1.ebuild?r1=1.120&r2=1.121

Remember to do that always before reporting a live ebuild problem.
_________________
http://phajdan-jr.blogspot.com/
Back to top
View user's profile Send private message
mathfeel
l33t
l33t


Joined: 03 Aug 2004
Posts: 700

PostPosted: Sun Jun 24, 2012 7:56 am    Post subject: Reply with quote

phajdan.jr wrote:
This has been fixed 2 days ago, please sync your tree.

http://sources.gentoo.org/cgi-bin/viewvc.cgi/gentoo-x86/www-client/chromium/chromium-9999-r1.ebuild?r1=1.120&r2=1.121

Remember to do that always before reporting a live ebuild problem.


Just did that. New errors keep piling on:
Code:
>>> Compiling source in /var/tmp/portage/www-client/chromium-9999-r1/work/chromium-9999 ...
make -j4 --load-average chrome chromedriver chrome_sandbox BUILDTYPE=Release V=1 CC.host=x86_64-pc-linux-gnu-gcc 'CFLAGS.host=-march=native -O2 -pipe -O2' CXX.host=x86_64-pc-linux-gnu-g++ 'CXXFLAGS.host=-march=native -O2 -pipe -O2' LINK.host=x86_64-pc-linux-gnu-g++ 'LDFLAGS.host=-Wl,-O1 -Wl,--as-needed -Wl,-O2 -Wl,--hash-style=both' AR.host=x86_64-pc-linux-gnu-ar
make: *** No rule to make target `build/util/LASTCHANGE', needed by `out/Release/obj/gen/chrome/common/chrome_version_info_posix.h'.  Stop.
 * ERROR: www-client/chromium-9999-r1 failed (compile phase):
 *   emake failed
 *
 * If you need support, post the output of `emerge --info '=www-client/chromium-9999-r1'`,
 * the complete build log and the output of `emerge -pqv '=www-client/chromium-9999-r1'`.
 * The complete build log is located at '/var/log/portage/build/www-client/chromium-9999-r1:20120624-071336.log'.
 * For convenience, a symlink to the build log is located at '/var/tmp/portage/www-client/chromium-9999-r1/temp/build.log'.
 * The ebuild environment file is located at '/var/tmp/portage/www-client/chromium-9999-r1/temp/environment'.
 * Working directory: '/var/tmp/portage/www-client/chromium-9999-r1/work/chromium-9999'
 * S: '/var/tmp/portage/www-client/chromium-9999-r1/work/chromium-9999'

_________________
-----------------------------------------------------------
"In heaven all the interesting people are missing"
-- Friedrich Nietzsche
Back to top
View user's profile Send private message
phajdan.jr
Retired Dev
Retired Dev


Joined: 23 Mar 2006
Posts: 1777
Location: Poland

PostPosted: Sun Jun 24, 2012 8:25 am    Post subject: Reply with quote

mathfeel wrote:
phajdan.jr wrote:
This has been fixed 2 days ago, please sync your tree.

http://sources.gentoo.org/cgi-bin/viewvc.cgi/gentoo-x86/www-client/chromium/chromium-9999-r1.ebuild?r1=1.120&r2=1.121

Remember to do that always before reporting a live ebuild problem.


Just did that. New errors keep piling on:
Code:
>>> Compiling source in /var/tmp/portage/www-client/chromium-9999-r1/work/chromium-9999 ...
make -j4 --load-average chrome chromedriver chrome_sandbox BUILDTYPE=Release V=1 CC.host=x86_64-pc-linux-gnu-gcc 'CFLAGS.host=-march=native -O2 -pipe -O2' CXX.host=x86_64-pc-linux-gnu-g++ 'CXXFLAGS.host=-march=native -O2 -pipe -O2' LINK.host=x86_64-pc-linux-gnu-g++ 'LDFLAGS.host=-Wl,-O1 -Wl,--as-needed -Wl,-O2 -Wl,--hash-style=both' AR.host=x86_64-pc-linux-gnu-ar
make: *** No rule to make target `build/util/LASTCHANGE', needed by `out/Release/obj/gen/chrome/common/chrome_version_info_posix.h'.  Stop.
 * ERROR: www-client/chromium-9999-r1 failed (compile phase):
 *   emake failed
 *
 * If you need support, post the output of `emerge --info '=www-client/chromium-9999-r1'`,
 * the complete build log and the output of `emerge -pqv '=www-client/chromium-9999-r1'`.
 * The complete build log is located at '/var/log/portage/build/www-client/chromium-9999-r1:20120624-071336.log'.
 * For convenience, a symlink to the build log is located at '/var/tmp/portage/www-client/chromium-9999-r1/temp/build.log'.
 * The ebuild environment file is located at '/var/tmp/portage/www-client/chromium-9999-r1/temp/environment'.
 * Working directory: '/var/tmp/portage/www-client/chromium-9999-r1/work/chromium-9999'
 * S: '/var/tmp/portage/www-client/chromium-9999-r1/work/chromium-9999'


This is https://bugs.gentoo.org/show_bug.cgi?id=422923
_________________
http://phajdan-jr.blogspot.com/
Back to top
View user's profile Send private message
mathfeel
l33t
l33t


Joined: 03 Aug 2004
Posts: 700

PostPosted: Mon Jun 25, 2012 2:38 am    Post subject: Reply with quote

phajdan.jr wrote:
This is https://bugs.gentoo.org/show_bug.cgi?id=422923


Is it generally a good idea to file a bug report in the Gentoo bug system against a live ebuild?
_________________
-----------------------------------------------------------
"In heaven all the interesting people are missing"
-- Friedrich Nietzsche
Back to top
View user's profile Send private message
Display posts from previous:   
Reply to topic    Gentoo Forums Forum Index Unsupported Software All times are GMT
Page 1 of 1

 
Jump to:  
You cannot post new topics in this forum
You cannot reply to topics in this forum
You cannot edit your posts in this forum
You cannot delete your posts in this forum
You cannot vote in polls in this forum