Gentoo Forums
Gentoo Forums
Gentoo Forums
Quick Search: in
[solved]help error compling libtasn1-3.4-r1
View unanswered posts
View posts from last 24 hours

 
Reply to topic    Gentoo Forums Forum Index Installing Gentoo
View previous topic :: View next topic  
Author Message
josei7
n00b
n00b


Joined: 07 Feb 2014
Posts: 22

PostPosted: Thu Mar 27, 2014 11:24 am    Post subject: [solved]help error compling libtasn1-3.4-r1 Reply with quote

i need help i upgrade my system to ultimate kernel and some packages dont compile,ok i solved it i read me the log and install text-unidecode and Unicode-EastAsianWidth and the compile,many thanks at all.

Last edited by josei7 on Fri Mar 28, 2014 11:07 am; edited 3 times in total
Back to top
View user's profile Send private message
Telemin
l33t
l33t


Joined: 25 Aug 2005
Posts: 734
Location: Glasgow, UK

PostPosted: Thu Mar 27, 2014 12:03 pm    Post subject: Reply with quote

Hi there,

We will need some more information if we are going to help you. Can you please post the output of:

Code:

emerge --info


Code:

cat /var/tmp/portage/dev-libs/libtasn1-3.4-r1/temp/build.log


Once you get back to us with these we can help find your problem :)

-Telemin-
_________________
The Geek formerly known as -Freestyling-
When you feel your problem has been solved please add [Solved] to the topic title.
Please adopt an unanswered post
Back to top
View user's profile Send private message
josei7
n00b
n00b


Joined: 07 Feb 2014
Posts: 22

PostPosted: Thu Mar 27, 2014 12:08 pm    Post subject: Reply with quote

Portage HEAD (default/linux/amd64/13.0/desktop, gcc-4.8.2, glibc-2.18-r1, 3.13.6-gentoo x86_64)
=================================================================
System uname: Linux-3.13.6-gentoo-x86_64-Intel-R-_Core-TM-_i7-3960X_CPU_@_3.30GHz-with-gentoo-2.2
KiB Mem: 24668452 total, 22019592 free
KiB Swap: 25165820 total, 25165820 free
Timestamp of tree: Sun, 23 Mar 2014 08:45:01 +0000
ld GNU ld (GNU Binutils) 2.24
distcc 3.1 x86_64-pc-linux-gnu [enabled]
app-shells/bash: 4.2_p45-r1
dev-java/java-config: 2.2.0
dev-lang/python: 2.7.6, 3.3.4
dev-util/cmake: 2.8.12.2
dev-util/pkgconfig: 0.28
sys-apps/baselayout: 2.2
sys-apps/openrc: 0.12.4
sys-apps/sandbox: 2.6-r1
sys-devel/autoconf: 2.13, 2.69
sys-devel/automake: 1.11.6, 1.12.6, 1.14.1
sys-devel/binutils: 2.24-r2
sys-devel/gcc: 4.8.2
sys-devel/gcc-config: 1.8
sys-devel/libtool: 2.4.2
sys-devel/make: 4.0-r1
sys-kernel/linux-headers: 3.13 (virtual/os-headers)
sys-libs/glibc: 2.18-r1
Repositories: gentoo steam-overlay gamerlay hasufell zugaina x-portage
ACCEPT_KEYWORDS="amd64 ~amd64"
ACCEPT_LICENSE="* -@EULA"
CBUILD="x86_64-pc-linux-gnu"
CFLAGS="-march=corei7-avx -O2 -pipe"
CHOST="x86_64-pc-linux-gnu"
CONFIG_PROTECT="/etc /usr/share/gnupg/qualified.txt"
CONFIG_PROTECT_MASK="/etc/ca-certificates.conf /etc/env.d /etc/fonts/fonts.conf /etc/gconf /etc/gentoo-release /etc/sandbox.d /etc/terminfo"
CXXFLAGS="-march=corei7-avx -O2 -pipe"
DISTDIR="/usr/portage/distfiles"
FCFLAGS="-O2 -pipe"
FEATURES="assume-digests binpkg-logs config-protect-if-modified distcc distlocks ebuild-locks fixlafiles merge-sync news parallel-fetch preserve-libs protect-owned sandbox sfperms strict unknown-features-warn unmerge-logs unmerge-orphans userfetch userpriv usersandbox usersync"
FFLAGS="-O2 -pipe"
GENTOO_MIRRORS="http://mirrors.linuxant.fr/distfiles.gentoo.org/ ftp://mirrors.linuxant.fr/distfiles.gentoo.org/ http://www.mirrorservice.org/sites/distfiles.gentoo.org/ rsync://rsync.mirrorservice.org/distfiles.gentoo.org/"
LANG="en_US.utf8"
LDFLAGS="-Wl,-O1 -Wl,--as-needed"
MAKEOPTS="-j13"
PKGDIR="/usr/portage/packages"
PORTAGE_CONFIGROOT="/"
PORTAGE_RSYNC_OPTS="--recursive --links --safe-links --perms --times --omit-dir-times --compress --force --whole-file --delete --stats --human-readable --timeout=180 --exclude=/distfiles --exclude=/local --exclude=/packages"
PORTAGE_TMPDIR="/var/tmp"
PORTDIR="/usr/portage"
PORTDIR_OVERLAY="/var/lib/layman/steam /var/lib/layman/gamerlay /var/lib/layman/hasufell /var/lib/layman/zugaina /usr/local/portage"
SYNC="rsync://rsync1.fr.gentoo.org/gentoo-portage"
USE="X a52 aac acl acpi aes-n1 alsa amd64 avcodec avformat berkdb bindist bluetooth branding bzip2 cairo caps cdda cdio cdr classic cli consolekit cracklib crypt cups cxx dbus development dmx doc dri dts dvd dvdnav dvdr egl emboss enca encode exif fam firefox flac fortran gallium gdbm gif gpm gtk iconv introspection ipv6 jit jpeg kdrive lcms ldap libkms libnotify lm_sensors lock mad mikmod minizip mmx mng mod modplug modules mp3 mp4 mpeg multilib ncurses network nls nptl ogg opengl openmp pam pango pcre pdf png policykit ppds pulseaudio python qt3support qt4 readline sasl sdl session source spell sqlite sse sse2 sse3 sse4_1 ssl startup-notification suid svg symlink syslog tcpd thunar tiff truetype trust udev udisks unicode upower usb vaapi vorbis wav wxwidgets x264 xcb xml xnest xorg xv xvfb xvid zlib" ABI_X86="64" ALSA_CARDS="ali5451 als4000 atiixp atiixp-modem bt87x ca0106 cmipci emu10k1x ens1370 ens1371 es1938 es1968 fm801 hda-intel intel8x0 intel8x0m maestro3 trident usb-audio via82xx via82xx-modem ymfpci" APACHE2_MODULES="authn_core authz_core socache_shmcb unixd actions alias auth_basic authn_alias authn_anon authn_dbm authn_default authn_file authz_dbm authz_default authz_groupfile authz_host authz_owner authz_user autoindex cache cgi cgid dav dav_fs dav_lock deflate dir disk_cache env expires ext_filter file_cache filter headers include info log_config logio mem_cache mime mime_magic negotiation rewrite setenvif speling status unique_id userdir usertrack vhost_alias" CALLIGRA_FEATURES="kexi words flow plan sheets stage tables krita karbon braindump author" CAMERAS="ptp2" COLLECTD_PLUGINS="df interface irq load memory rrdtool swap syslog" ELIBC="glibc" GPSD_PROTOCOLS="ashtech aivdm earthmate evermore fv18 garmin garmintxt gpsclock itrax mtk3301 nmea ntrip navcom oceanserver oldstyle oncore rtcm104v2 rtcm104v3 sirf superstar2 timing tsip tripmate tnt ublox ubx" INPUT_DEVICES="evdev keyboard mouse" KERNEL="linux" LCD_DEVICES="bayrad cfontz cfontz633 glk hd44780 lb216 lcdm001 mtxorb ncurses text" LIBREOFFICE_EXTENSIONS="presenter-console presenter-minimizer" LINGUAS="es_ES en_GB" OFFICE_IMPLEMENTATION="libreoffice" PHP_TARGETS="php5-5" PYTHON_SINGLE_TARGET="python2_7" PYTHON_TARGETS="python2_7" RUBY_TARGETS="ruby19 ruby20" USERLAND="GNU" VIDEO_CARDS="fglrx" XTABLES_ADDONS="quota2 psd pknock lscan length2 ipv4options ipset ipp2p iface geoip fuzzy condition tee tarpit sysrq steal rawnat logmark ipmark dhcpmac delude chaos account"
Unset: CPPFLAGS, CTARGET, EMERGE_DEFAULT_OPTS, INSTALL_MASK, LC_ALL, PORTAGE_BUNZIP2_COMMAND, PORTAGE_COMPRESS, PORTAGE_COMPRESS_FLAGS, PORTAGE_RSYNC_EXTRA_OPTS, USE_PYTHON
Back to top
View user's profile Send private message
josei7
n00b
n00b


Joined: 07 Feb 2014
Posts: 22

PostPosted: Thu Mar 27, 2014 12:29 pm    Post subject: Reply with quote

cat /var/tmp/portage/dev-libs/libtasn1-3.4-r1/temp/build.log its too long i dont know how to copy all the log
Back to top
View user's profile Send private message
josei7
n00b
n00b


Joined: 07 Feb 2014
Posts: 22

PostPosted: Thu Mar 27, 2014 12:32 pm    Post subject: Reply with quote

-e '/definition of _GL_WARN_ON_USE/r warn-on-use.h' \
< /var/tmp/portage/dev-libs/libtasn1-3.4-r1/work/libtasn1-3.4/gl/sys_stat.in.h; \
} > sys/stat.h-t && \
mv sys/stat.h-t sys/stat.h
rm -f unistd.h-t unistd.h && \
{ echo '/* DO NOT EDIT! GENERATED AUTOMATICALLY! */'; \
sed -e 's|@''GUARD_PREFIX''@|GL|g' \
-e 's|@''HAVE_UNISTD_H''@|1|g' \
-e 's|@''INCLUDE_NEXT''@|include_next|g' \
-e 's|@''PRAGMA_SYSTEM_HEADER''@|#pragma GCC system_header|g' \
-e 's|@''PRAGMA_COLUMNS''@||g' \
-e 's|@''NEXT_UNISTD_H''@|<unistd.h>|g' \
-e 's|@''WINDOWS_64_BIT_OFF_T''@|0|g' \
-e 's/@''GNULIB_CHDIR''@/0/g' \
-e 's/@''GNULIB_CHOWN''@/0/g' \
-e 's/@''GNULIB_CLOSE''@/0/g' \
-e 's/@''GNULIB_DUP''@/0/g' \
-e 's/@''GNULIB_DUP2''@/0/g' \
-e 's/@''GNULIB_DUP3''@/0/g' \
-e 's/@''GNULIB_ENVIRON''@/0/g' \
-e 's/@''GNULIB_EUIDACCESS''@/0/g' \
-e 's/@''GNULIB_FACCESSAT''@/0/g' \
-e 's/@''GNULIB_FCHDIR''@/0/g' \
-e 's/@''GNULIB_FCHOWNAT''@/0/g' \
-e 's/@''GNULIB_FDATASYNC''@/0/g' \
-e 's/@''GNULIB_FSYNC''@/0/g' \
-e 's/@''GNULIB_FTRUNCATE''@/0/g' \
-e 's/@''GNULIB_GETCWD''@/0/g' \
-e 's/@''GNULIB_GETDOMAINNAME''@/0/g' \
-e 's/@''GNULIB_GETDTABLESIZE''@/0/g' \
-e 's/@''GNULIB_GETGROUPS''@/0/g' \
-e 's/@''GNULIB_GETHOSTNAME''@/0/g' \
-e 's/@''GNULIB_GETLOGIN''@/0/g' \
-e 's/@''GNULIB_GETLOGIN_R''@/0/g' \
-e 's/@''GNULIB_GETPAGESIZE''@/0/g' \
-e 's/@''GNULIB_GETUSERSHELL''@/0/g' \
-e 's/@''GNULIB_GROUP_MEMBER''@/0/g' \
-e 's/@''GNULIB_ISATTY''@/0/g' \
-e 's/@''GNULIB_LCHOWN''@/0/g' \
-e 's/@''GNULIB_LINK''@/0/g' \
-e 's/@''GNULIB_LINKAT''@/0/g' \
-e 's/@''GNULIB_LSEEK''@/1/g' \
-e 's/@''GNULIB_PIPE''@/0/g' \
-e 's/@''GNULIB_PIPE2''@/0/g' \
-e 's/@''GNULIB_PREAD''@/0/g' \
-e 's/@''GNULIB_PWRITE''@/0/g' \
-e 's/@''GNULIB_READ''@/0/g' \
-e 's/@''GNULIB_READLINK''@/0/g' \
-e 's/@''GNULIB_READLINKAT''@/0/g' \
-e 's/@''GNULIB_RMDIR''@/0/g' \
-e 's/@''GNULIB_SETHOSTNAME''@/0/g' \
-e 's/@''GNULIB_SLEEP''@/0/g' \
-e 's/@''GNULIB_SYMLINK''@/0/g' \
-e 's/@''GNULIB_SYMLINKAT''@/0/g' \
-e 's/@''GNULIB_TTYNAME_R''@/0/g' \
-e 's/@''GNULIB_UNISTD_H_GETOPT''@/0/g' \
-e 's/@''GNULIB_UNISTD_H_NONBLOCKING''@/0/g' \
-e 's/@''GNULIB_UNISTD_H_SIGPIPE''@/0/g' \
-e 's/@''GNULIB_UNLINK''@/0/g' \
-e 's/@''GNULIB_UNLINKAT''@/0/g' \
-e 's/@''GNULIB_USLEEP''@/0/g' \
-e 's/@''GNULIB_WRITE''@/0/g' \
< /var/tmp/portage/dev-libs/libtasn1-3.4-r1/work/libtasn1-3.4/gl/unistd.in.h | \
sed -e 's|@''HAVE_CHOWN''@|1|g' \
-e 's|@''HAVE_DUP2''@|1|g' \
-e 's|@''HAVE_DUP3''@|1|g' \
-e 's|@''HAVE_EUIDACCESS''@|1|g' \
-e 's|@''HAVE_FACCESSAT''@|1|g' \
-e 's|@''HAVE_FCHDIR''@|1|g' \
-e 's|@''HAVE_FCHOWNAT''@|1|g' \
-e 's|@''HAVE_FDATASYNC''@|1|g' \
-e 's|@''HAVE_FSYNC''@|1|g' \
-e 's|@''HAVE_FTRUNCATE''@|1|g' \
-e 's|@''HAVE_GETDTABLESIZE''@|1|g' \
-e 's|@''HAVE_GETGROUPS''@|1|g' \
-e 's|@''HAVE_GETHOSTNAME''@|1|g' \
-e 's|@''HAVE_GETLOGIN''@|1|g' \
-e 's|@''HAVE_GETPAGESIZE''@|1|g' \
-e 's|@''HAVE_GROUP_MEMBER''@|1|g' \
-e 's|@''HAVE_LCHOWN''@|1|g' \
-e 's|@''HAVE_LINK''@|1|g' \
-e 's|@''HAVE_LINKAT''@|1|g' \
-e 's|@''HAVE_PIPE''@|1|g' \
-e 's|@''HAVE_PIPE2''@|1|g' \
-e 's|@''HAVE_PREAD''@|1|g' \
-e 's|@''HAVE_PWRITE''@|1|g' \
-e 's|@''HAVE_READLINK''@|1|g' \
-e 's|@''HAVE_READLINKAT''@|1|g' \
-e 's|@''HAVE_SETHOSTNAME''@|1|g' \
-e 's|@''HAVE_SLEEP''@|1|g' \
-e 's|@''HAVE_SYMLINK''@|1|g' \
-e 's|@''HAVE_SYMLINKAT''@|1|g' \
-e 's|@''HAVE_UNLINKAT''@|1|g' \
-e 's|@''HAVE_USLEEP''@|1|g' \
-e 's|@''HAVE_DECL_ENVIRON''@|1|g' \
-e 's|@''HAVE_DECL_FCHDIR''@|1|g' \
-e 's|@''HAVE_DECL_FDATASYNC''@|1|g' \
-e 's|@''HAVE_DECL_GETDOMAINNAME''@|1|g' \
-e 's|@''HAVE_DECL_GETLOGIN_R''@|1|g' \
-e 's|@''HAVE_DECL_GETPAGESIZE''@|1|g' \
-e 's|@''HAVE_DECL_GETUSERSHELL''@|1|g' \
-e 's|@''HAVE_DECL_SETHOSTNAME''@|1|g' \
-e 's|@''HAVE_DECL_TTYNAME_R''@|1|g' \
-e 's|@''HAVE_OS_H''@|0|g' \
-e 's|@''HAVE_SYS_PARAM_H''@|0|g' \
| \
sed -e 's|@''REPLACE_CHOWN''@|0|g' \
-e 's|@''REPLACE_CLOSE''@|0|g' \
-e 's|@''REPLACE_DUP''@|0|g' \
-e 's|@''REPLACE_DUP2''@|0|g' \
-e 's|@''REPLACE_FCHOWNAT''@|0|g' \
-e 's|@''REPLACE_FTRUNCATE''@|0|g' \
-e 's|@''REPLACE_GETCWD''@|0|g' \
-e 's|@''REPLACE_GETDOMAINNAME''@|0|g' \
-e 's|@''REPLACE_GETLOGIN_R''@|0|g' \
-e 's|@''REPLACE_GETGROUPS''@|0|g' \
-e 's|@''REPLACE_GETPAGESIZE''@|0|g' \
-e 's|@''REPLACE_ISATTY''@|0|g' \
-e 's|@''REPLACE_LCHOWN''@|0|g' \
-e 's|@''REPLACE_LINK''@|0|g' \
-e 's|@''REPLACE_LINKAT''@|0|g' \
-e 's|@''REPLACE_LSEEK''@|0|g' \
-e 's|@''REPLACE_PREAD''@|0|g' \
-e 's|@''REPLACE_PWRITE''@|0|g' \
-e 's|@''REPLACE_READ''@|0|g' \
-e 's|@''REPLACE_READLINK''@|0|g' \
-e 's|@''REPLACE_RMDIR''@|0|g' \
-e 's|@''REPLACE_SLEEP''@|0|g' \
-e 's|@''REPLACE_SYMLINK''@|0|g' \
-e 's|@''REPLACE_TTYNAME_R''@|0|g' \
-e 's|@''REPLACE_UNLINK''@|0|g' \
-e 's|@''REPLACE_UNLINKAT''@|0|g' \
-e 's|@''REPLACE_USLEEP''@|0|g' \
-e 's|@''REPLACE_WRITE''@|0|g' \
-e 's|@''UNISTD_H_HAVE_WINSOCK2_H''@|0|g' \
-e 's|@''UNISTD_H_HAVE_WINSOCK2_H_AND_USE_SOCKETS''@|0|g' \
-e '/definitions of _GL_FUNCDECL_RPL/r c++defs.h' \
-e '/definition of _GL_ARG_NONNULL/r arg-nonnull.h' \
-e '/definition of _GL_WARN_ON_USE/r warn-on-use.h'; \
} > unistd.h-t && \
mv unistd.h-t unistd.h
rm -f sys/time.h-t sys/time.h && \
{ echo '/* DO NOT EDIT! GENERATED AUTOMATICALLY! */'; \
sed -e 's|@''GUARD_PREFIX''@|GL|g' \
-e 's/@''HAVE_SYS_TIME_H''@/1/g' \
-e 's|@''INCLUDE_NEXT''@|include_next|g' \
-e 's|@''PRAGMA_SYSTEM_HEADER''@|#pragma GCC system_header|g' \
-e 's|@''PRAGMA_COLUMNS''@||g' \
-e 's|@''NEXT_SYS_TIME_H''@|<sys/time.h>|g' \
-e 's/@''GNULIB_GETTIMEOFDAY''@/1/g' \
-e 's|@''HAVE_WINSOCK2_H''@|0|g' \
-e 's/@''HAVE_GETTIMEOFDAY''@/1/g' \
-e 's/@''HAVE_STRUCT_TIMEVAL''@/1/g' \
-e 's/@''REPLACE_GETTIMEOFDAY''@/0/g' \
-e 's/@''REPLACE_STRUCT_TIMEVAL''@/0/g' \
-e '/definitions of _GL_FUNCDECL_RPL/r c++defs.h' \
-e '/definition of _GL_ARG_NONNULL/r arg-nonnull.h' \
-e '/definition of _GL_WARN_ON_USE/r warn-on-use.h' \
< /var/tmp/portage/dev-libs/libtasn1-3.4-r1/work/libtasn1-3.4/gl/sys_time.in.h; \
} > sys/time.h-t && \
mv sys/time.h-t sys/time.h
make all-recursive
make[3]: Entering directory '/var/tmp/portage/dev-libs/libtasn1-3.4-r1/work/libtasn1-3.4-amd64/gl'
make[4]: Entering directory '/var/tmp/portage/dev-libs/libtasn1-3.4-r1/work/libtasn1-3.4-amd64/gl'
/bin/sh ../libtool --tag=CC --mode=compile x86_64-pc-linux-gnu-gcc -std=gnu99 -DHAVE_CONFIG_H -I. -I/var/tmp/portage/dev-libs/libtasn1-3.4-r1/work/libtasn1-3.4/gl -I.. -march=corei7-avx -O2 -pipe -c -o gettime.lo /var/tmp/portage/dev-libs/libtasn1-3.4-r1/work/libtasn1-3.4/gl/gettime.c
/bin/sh ../libtool --tag=CC --mode=compile x86_64-pc-linux-gnu-gcc -std=gnu99 -DHAVE_CONFIG_H -I. -I/var/tmp/portage/dev-libs/libtasn1-3.4-r1/work/libtasn1-3.4/gl -I.. -march=corei7-avx -O2 -pipe -c -o progname.lo /var/tmp/portage/dev-libs/libtasn1-3.4-r1/work/libtasn1-3.4/gl/progname.c
/bin/sh ../libtool --tag=CC --mode=compile x86_64-pc-linux-gnu-gcc -std=gnu99 -DHAVE_CONFIG_H -I. -I/var/tmp/portage/dev-libs/libtasn1-3.4-r1/work/libtasn1-3.4/gl -I.. -march=corei7-avx -O2 -pipe -c -o read-file.lo /var/tmp/portage/dev-libs/libtasn1-3.4-r1/work/libtasn1-3.4/gl/read-file.c
/bin/sh ../libtool --tag=CC --mode=compile x86_64-pc-linux-gnu-gcc -std=gnu99 -DHAVE_CONFIG_H -I. -I/var/tmp/portage/dev-libs/libtasn1-3.4-r1/work/libtasn1-3.4/gl -I.. -march=corei7-avx -O2 -pipe -c -o timespec.lo /var/tmp/portage/dev-libs/libtasn1-3.4-r1/work/libtasn1-3.4/gl/timespec.c
/bin/sh ../libtool --tag=CC --mode=compile x86_64-pc-linux-gnu-gcc -std=gnu99 -DHAVE_CONFIG_H -I. -I/var/tmp/portage/dev-libs/libtasn1-3.4-r1/work/libtasn1-3.4/gl -I.. -march=corei7-avx -O2 -pipe -c -o unistd.lo /var/tmp/portage/dev-libs/libtasn1-3.4-r1/work/libtasn1-3.4/gl/unistd.c
/bin/sh ../libtool --tag=CC --mode=compile x86_64-pc-linux-gnu-gcc -std=gnu99 -DHAVE_CONFIG_H -I. -I/var/tmp/portage/dev-libs/libtasn1-3.4-r1/work/libtasn1-3.4/gl -I.. -march=corei7-avx -O2 -pipe -c -o version-etc.lo /var/tmp/portage/dev-libs/libtasn1-3.4-r1/work/libtasn1-3.4/gl/version-etc.c
/bin/sh ../libtool --tag=CC --mode=compile x86_64-pc-linux-gnu-gcc -std=gnu99 -DHAVE_CONFIG_H -I. -I/var/tmp/portage/dev-libs/libtasn1-3.4-r1/work/libtasn1-3.4/gl -I.. -march=corei7-avx -O2 -pipe -c -o version-etc-fsf.lo /var/tmp/portage/dev-libs/libtasn1-3.4-r1/work/libtasn1-3.4/gl/version-etc-fsf.c
libtool: compile: x86_64-pc-linux-gnu-gcc -std=gnu99 -DHAVE_CONFIG_H -I. -I/var/tmp/portage/dev-libs/libtasn1-3.4-r1/work/libtasn1-3.4/gl -I.. -march=corei7-avx -O2 -pipe -c /var/tmp/portage/dev-libs/libtasn1-3.4-r1/work/libtasn1-3.4/gl/progname.c -fPIC -DPIC -o .libs/progname.o
libtool: compile: x86_64-pc-linux-gnu-gcc -std=gnu99 -DHAVE_CONFIG_H -I. -I/var/tmp/portage/dev-libs/libtasn1-3.4-r1/work/libtasn1-3.4/gl -I.. -march=corei7-avx -O2 -pipe -c /var/tmp/portage/dev-libs/libtasn1-3.4-r1/work/libtasn1-3.4/gl/read-file.c -fPIC -DPIC -o .libs/read-file.o
libtool: compile: x86_64-pc-linux-gnu-gcc -std=gnu99 -DHAVE_CONFIG_H -I. -I/var/tmp/portage/dev-libs/libtasn1-3.4-r1/work/libtasn1-3.4/gl -I.. -march=corei7-avx -O2 -pipe -c /var/tmp/portage/dev-libs/libtasn1-3.4-r1/work/libtasn1-3.4/gl/timespec.c -fPIC -DPIC -o .libs/timespec.o
libtool: compile: x86_64-pc-linux-gnu-gcc -std=gnu99 -DHAVE_CONFIG_H -I. -I/var/tmp/portage/dev-libs/libtasn1-3.4-r1/work/libtasn1-3.4/gl -I.. -march=corei7-avx -O2 -pipe -c /var/tmp/portage/dev-libs/libtasn1-3.4-r1/work/libtasn1-3.4/gl/version-etc.c -fPIC -DPIC -o .libs/version-etc.o
distcc[19703] (dcc_build_somewhere) Warning: failed to distribute, running locally instead
distcc[19704] (dcc_build_somewhere) Warning: failed to distribute, running locally instead
distcc[19706] (dcc_build_somewhere) Warning: failed to distribute, running locally instead
libtool: compile: x86_64-pc-linux-gnu-gcc -std=gnu99 -DHAVE_CONFIG_H -I. -I/var/tmp/portage/dev-libs/libtasn1-3.4-r1/work/libtasn1-3.4/gl -I.. -march=corei7-avx -O2 -pipe -c /var/tmp/portage/dev-libs/libtasn1-3.4-r1/work/libtasn1-3.4/gl/unistd.c -fPIC -DPIC -o .libs/unistd.o
distcc[19710] (dcc_build_somewhere) Warning: failed to distribute, running locally instead
libtool: compile: x86_64-pc-linux-gnu-gcc -std=gnu99 -DHAVE_CONFIG_H -I. -I/var/tmp/portage/dev-libs/libtasn1-3.4-r1/work/libtasn1-3.4/gl -I.. -march=corei7-avx -O2 -pipe -c /var/tmp/portage/dev-libs/libtasn1-3.4-r1/work/libtasn1-3.4/gl/gettime.c -fPIC -DPIC -o .libs/gettime.o
distcc[19716] (dcc_build_somewhere) Warning: failed to distribute, running locally instead
distcc[19720] (dcc_build_somewhere) Warning: failed to distribute, running locally instead
libtool: compile: x86_64-pc-linux-gnu-gcc -std=gnu99 -DHAVE_CONFIG_H -I. -I/var/tmp/portage/dev-libs/libtasn1-3.4-r1/work/libtasn1-3.4/gl -I.. -march=corei7-avx -O2 -pipe -c /var/tmp/portage/dev-libs/libtasn1-3.4-r1/work/libtasn1-3.4/gl/version-etc-fsf.c -fPIC -DPIC -o .libs/version-etc-fsf.o
distcc[19731] (dcc_build_somewhere) Warning: failed to distribute, running locally instead
/bin/sh ../libtool --tag=CC --mode=link x86_64-pc-linux-gnu-gcc -std=gnu99 -march=corei7-avx -O2 -pipe -no-undefined -Wl,-O1 -Wl,--as-needed -o libgnu.la gettime.lo progname.lo read-file.lo timespec.lo unistd.lo version-etc.lo version-etc-fsf.lo
libtool: link: x86_64-pc-linux-gnu-ar cru .libs/libgnu.a .libs/gettime.o .libs/progname.o .libs/read-file.o .libs/timespec.o .libs/unistd.o .libs/version-etc.o .libs/version-etc-fsf.o
libtool: link: x86_64-pc-linux-gnu-ranlib .libs/libgnu.a
libtool: link: ( cd ".libs" && rm -f "libgnu.la" && ln -s "../libgnu.la" "libgnu.la" )
make[4]: Leaving directory '/var/tmp/portage/dev-libs/libtasn1-3.4-r1/work/libtasn1-3.4-amd64/gl'
make[3]: Leaving directory '/var/tmp/portage/dev-libs/libtasn1-3.4-r1/work/libtasn1-3.4-amd64/gl'
make[2]: Leaving directory '/var/tmp/portage/dev-libs/libtasn1-3.4-r1/work/libtasn1-3.4-amd64/gl'
Making all in lib
make[2]: Entering directory '/var/tmp/portage/dev-libs/libtasn1-3.4-r1/work/libtasn1-3.4-amd64/lib'
Making all in gllib
make[3]: Entering directory '/var/tmp/portage/dev-libs/libtasn1-3.4-r1/work/libtasn1-3.4-amd64/lib/gllib'
rm -f arg-nonnull.h-t arg-nonnull.h && \
sed -n -e '/GL_ARG_NONNULL/,$p' \
< /var/tmp/portage/dev-libs/libtasn1-3.4-r1/work/libtasn1-3.4/build-aux/snippet/arg-nonnull.h \
> arg-nonnull.h-t && \
mv arg-nonnull.h-t arg-nonnull.h
rm -f c++defs.h-t c++defs.h && \
sed -n -e '/_GL_CXXDEFS/,$p' \
< /var/tmp/portage/dev-libs/libtasn1-3.4-r1/work/libtasn1-3.4/build-aux/snippet/c++defs.h \
> c++defs.h-t && \
mv c++defs.h-t c++defs.h
rm -f warn-on-use.h-t warn-on-use.h && \
sed -n -e '/^.ifndef/,$p' \
< /var/tmp/portage/dev-libs/libtasn1-3.4-r1/work/libtasn1-3.4/build-aux/snippet/warn-on-use.h \
> warn-on-use.h-t && \
mv warn-on-use.h-t warn-on-use.h
rm -f string.h-t string.h && \
{ echo '/* DO NOT EDIT! GENERATED AUTOMATICALLY! */' && \
sed -e 's|@''GUARD_PREFIX''@|GL_LGL|g' \
-e 's|@''INCLUDE_NEXT''@|include_next|g' \
-e 's|@''PRAGMA_SYSTEM_HEADER''@|#pragma GCC system_header|g' \
-e 's|@''PRAGMA_COLUMNS''@||g' \
-e 's|@''NEXT_STRING_H''@|<string.h>|g' \
-e 's/@''GNULIB_FFSL''@/0/g' \
-e 's/@''GNULIB_FFSLL''@/0/g' \
-e 's/@''GNULIB_MBSLEN''@/0/g' \
-e 's/@''GNULIB_MBSNLEN''@/0/g' \
-e 's/@''GNULIB_MBSCHR''@/0/g' \
-e 's/@''GNULIB_MBSRCHR''@/0/g' \
-e 's/@''GNULIB_MBSSTR''@/0/g' \
-e 's/@''GNULIB_MBSCASECMP''@/0/g' \
-e 's/@''GNULIB_MBSNCASECMP''@/0/g' \
-e 's/@''GNULIB_MBSPCASECMP''@/0/g' \
-e 's/@''GNULIB_MBSCASESTR''@/0/g' \
-e 's/@''GNULIB_MBSCSPN''@/0/g' \
-e 's/@''GNULIB_MBSPBRK''@/0/g' \
-e 's/@''GNULIB_MBSSPN''@/0/g' \
-e 's/@''GNULIB_MBSSEP''@/0/g' \
-e 's/@''GNULIB_MBSTOK_R''@/0/g' \
-e 's/@''GNULIB_MEMCHR''@/0/g' \
-e 's/@''GNULIB_MEMMEM''@/0/g' \
-e 's/@''GNULIB_MEMPCPY''@/0/g' \
-e 's/@''GNULIB_MEMRCHR''@/0/g' \
-e 's/@''GNULIB_RAWMEMCHR''@/0/g' \
-e 's/@''GNULIB_STPCPY''@/0/g' \
-e 's/@''GNULIB_STPNCPY''@/0/g' \
-e 's/@''GNULIB_STRCHRNUL''@/0/g' \
-e 's/@''GNULIB_STRDUP''@/0/g' \
-e 's/@''GNULIB_STRNCAT''@/0/g' \
-e 's/@''GNULIB_STRNDUP''@/0/g' \
-e 's/@''GNULIB_STRNLEN''@/0/g' \
-e 's/@''GNULIB_STRPBRK''@/0/g' \
-e 's/@''GNULIB_STRSEP''@/0/g' \
-e 's/@''GNULIB_STRSTR''@/0/g' \
-e 's/@''GNULIB_STRCASESTR''@/0/g' \
-e 's/@''GNULIB_STRTOK_R''@/0/g' \
-e 's/@''GNULIB_STRERROR''@/0/g' \
-e 's/@''GNULIB_STRERROR_R''@/0/g' \
-e 's/@''GNULIB_STRSIGNAL''@/0/g' \
-e 's/@''GNULIB_STRVERSCMP''@/1/g' \
< /var/tmp/portage/dev-libs/libtasn1-3.4-r1/work/libtasn1-3.4/lib/gllib/string.in.h | \
sed -e 's|@''HAVE_FFSL''@|1|g' \
-e 's|@''HAVE_FFSLL''@|1|g' \
-e 's|@''HAVE_MBSLEN''@|0|g' \
-e 's|@''HAVE_MEMCHR''@|1|g' \
-e 's|@''HAVE_DECL_MEMMEM''@|1|g' \
-e 's|@''HAVE_MEMPCPY''@|1|g' \
-e 's|@''HAVE_DECL_MEMRCHR''@|1|g' \
-e 's|@''HAVE_RAWMEMCHR''@|1|g' \
-e 's|@''HAVE_STPCPY''@|1|g' \
-e 's|@''HAVE_STPNCPY''@|1|g' \
-e 's|@''HAVE_STRCHRNUL''@|1|g' \
-e 's|@''HAVE_DECL_STRDUP''@|1|g' \
-e 's|@''HAVE_DECL_STRNDUP''@|1|g' \
-e 's|@''HAVE_DECL_STRNLEN''@|1|g' \
-e 's|@''HAVE_STRPBRK''@|1|g' \
-e 's|@''HAVE_STRSEP''@|1|g' \
-e 's|@''HAVE_STRCASESTR''@|1|g' \
-e 's|@''HAVE_DECL_STRTOK_R''@|1|g' \
-e 's|@''HAVE_DECL_STRERROR_R''@|1|g' \
-e 's|@''HAVE_DECL_STRSIGNAL''@|1|g' \
-e 's|@''HAVE_STRVERSCMP''@|1|g' \
-e 's|@''REPLACE_STPNCPY''@|0|g' \
-e 's|@''REPLACE_MEMCHR''@|0|g' \
-e 's|@''REPLACE_MEMMEM''@|0|g' \
-e 's|@''REPLACE_STRCASESTR''@|0|g' \
-e 's|@''REPLACE_STRCHRNUL''@|0|g' \
-e 's|@''REPLACE_STRDUP''@|0|g' \
-e 's|@''REPLACE_STRSTR''@|0|g' \
-e 's|@''REPLACE_STRERROR''@|0|g' \
-e 's|@''REPLACE_STRERROR_R''@|0|g' \
-e 's|@''REPLACE_STRNCAT''@|0|g' \
-e 's|@''REPLACE_STRNDUP''@|0|g' \
-e 's|@''REPLACE_STRNLEN''@|0|g' \
-e 's|@''REPLACE_STRSIGNAL''@|0|g' \
-e 's|@''REPLACE_STRTOK_R''@|0|g' \
-e 's|@''UNDEFINE_STRTOK_R''@|0|g' \
-e '/definitions of _GL_FUNCDECL_RPL/r c++defs.h' \
-e '/definition of _GL_ARG_NONNULL/r arg-nonnull.h' \
-e '/definition of _GL_WARN_ON_USE/r warn-on-use.h'; \
< /var/tmp/portage/dev-libs/libtasn1-3.4-r1/work/libtasn1-3.4/lib/gllib/string.in.h; \
} > string.h-t && \
mv string.h-t string.h
make all-recursive
make[4]: Entering directory '/var/tmp/portage/dev-libs/libtasn1-3.4-r1/work/libtasn1-3.4-amd64/lib/gllib'
make[5]: Entering directory '/var/tmp/portage/dev-libs/libtasn1-3.4-r1/work/libtasn1-3.4-amd64/lib/gllib'
/bin/sh ../../libtool --tag=CC --mode=compile x86_64-pc-linux-gnu-gcc -std=gnu99 -DHAVE_CONFIG_H -I. -I/var/tmp/portage/dev-libs/libtasn1-3.4-r1/work/libtasn1-3.4/lib/gllib -I../.. -fvisibility=hidden -march=corei7-avx -O2 -pipe -c -o hash-pjw-bare.lo /var/tmp/portage/dev-libs/libtasn1-3.4-r1/work/libtasn1-3.4/lib/gllib/hash-pjw-bare.c
libtool: compile: x86_64-pc-linux-gnu-gcc -std=gnu99 -DHAVE_CONFIG_H -I. -I/var/tmp/portage/dev-libs/libtasn1-3.4-r1/work/libtasn1-3.4/lib/gllib -I../.. -fvisibility=hidden -march=corei7-avx -O2 -pipe -c /var/tmp/portage/dev-libs/libtasn1-3.4-r1/work/libtasn1-3.4/lib/gllib/hash-pjw-bare.c -fPIC -DPIC -o .libs/hash-pjw-bare.o
distcc[19838] (dcc_build_somewhere) Warning: failed to distribute, running locally instead
/bin/sh ../../libtool --tag=CC --mode=link x86_64-pc-linux-gnu-gcc -std=gnu99 -fvisibility=hidden -march=corei7-avx -O2 -pipe -no-undefined -Wl,-O1 -Wl,--as-needed -o libgnu.la hash-pjw-bare.lo
libtool: link: x86_64-pc-linux-gnu-ar cru .libs/libgnu.a .libs/hash-pjw-bare.o
libtool: link: x86_64-pc-linux-gnu-ranlib .libs/libgnu.a
libtool: link: ( cd ".libs" && rm -f "libgnu.la" && ln -s "../libgnu.la" "libgnu.la" )
make[5]: Leaving directory '/var/tmp/portage/dev-libs/libtasn1-3.4-r1/work/libtasn1-3.4-amd64/lib/gllib'
make[4]: Leaving directory '/var/tmp/portage/dev-libs/libtasn1-3.4-r1/work/libtasn1-3.4-amd64/lib/gllib'
make[3]: Leaving directory '/var/tmp/portage/dev-libs/libtasn1-3.4-r1/work/libtasn1-3.4-amd64/lib/gllib'
make[3]: Entering directory '/var/tmp/portage/dev-libs/libtasn1-3.4-r1/work/libtasn1-3.4-amd64/lib'
/bin/sh ../libtool --tag=CC --mode=compile x86_64-pc-linux-gnu-gcc -std=gnu99 -DHAVE_CONFIG_H -I. -I/var/tmp/portage/dev-libs/libtasn1-3.4-r1/work/libtasn1-3.4/lib -I.. -I/var/tmp/portage/dev-libs/libtasn1-3.4-r1/work/libtasn1-3.4/lib/gllib -DASN1_BUILDING -fvisibility=hidden -march=corei7-avx -O2 -pipe -c -o ASN1.lo /var/tmp/portage/dev-libs/libtasn1-3.4-r1/work/libtasn1-3.4/lib/ASN1.c
/bin/sh ../libtool --tag=CC --mode=compile x86_64-pc-linux-gnu-gcc -std=gnu99 -DHAVE_CONFIG_H -I. -I/var/tmp/portage/dev-libs/libtasn1-3.4-r1/work/libtasn1-3.4/lib -I.. -I/var/tmp/portage/dev-libs/libtasn1-3.4-r1/work/libtasn1-3.4/lib/gllib -DASN1_BUILDING -fvisibility=hidden -march=corei7-avx -O2 -pipe -c -o coding.lo /var/tmp/portage/dev-libs/libtasn1-3.4-r1/work/libtasn1-3.4/lib/coding.c
/bin/sh ../libtool --tag=CC --mode=compile x86_64-pc-linux-gnu-gcc -std=gnu99 -DHAVE_CONFIG_H -I. -I/var/tmp/portage/dev-libs/libtasn1-3.4-r1/work/libtasn1-3.4/lib -I.. -I/var/tmp/portage/dev-libs/libtasn1-3.4-r1/work/libtasn1-3.4/lib/gllib -DASN1_BUILDING -fvisibility=hidden -march=corei7-avx -O2 -pipe -c -o decoding.lo /var/tmp/portage/dev-libs/libtasn1-3.4-r1/work/libtasn1-3.4/lib/decoding.c
/bin/sh ../libtool --tag=CC --mode=compile x86_64-pc-linux-gnu-gcc -std=gnu99 -DHAVE_CONFIG_H -I. -I/var/tmp/portage/dev-libs/libtasn1-3.4-r1/work/libtasn1-3.4/lib -I.. -I/var/tmp/portage/dev-libs/libtasn1-3.4-r1/work/libtasn1-3.4/lib/gllib -DASN1_BUILDING -fvisibility=hidden -march=corei7-avx -O2 -pipe -c -o element.lo /var/tmp/portage/dev-libs/libtasn1-3.4-r1/work/libtasn1-3.4/lib/element.c
/bin/sh ../libtool --tag=CC --mode=compile x86_64-pc-linux-gnu-gcc -std=gnu99 -DHAVE_CONFIG_H -I. -I/var/tmp/portage/dev-libs/libtasn1-3.4-r1/work/libtasn1-3.4/lib -I.. -I/var/tmp/portage/dev-libs/libtasn1-3.4-r1/work/libtasn1-3.4/lib/gllib -DASN1_BUILDING -fvisibility=hidden -march=corei7-avx -O2 -pipe -c -o errors.lo /var/tmp/portage/dev-libs/libtasn1-3.4-r1/work/libtasn1-3.4/lib/errors.c
/bin/sh ../libtool --tag=CC --mode=compile x86_64-pc-linux-gnu-gcc -std=gnu99 -DHAVE_CONFIG_H -I. -I/var/tmp/portage/dev-libs/libtasn1-3.4-r1/work/libtasn1-3.4/lib -I.. -I/var/tmp/portage/dev-libs/libtasn1-3.4-r1/work/libtasn1-3.4/lib/gllib -DASN1_BUILDING -fvisibility=hidden -march=corei7-avx -O2 -pipe -c -o gstr.lo /var/tmp/portage/dev-libs/libtasn1-3.4-r1/work/libtasn1-3.4/lib/gstr.c
/bin/sh ../libtool --tag=CC --mode=compile x86_64-pc-linux-gnu-gcc -std=gnu99 -DHAVE_CONFIG_H -I. -I/var/tmp/portage/dev-libs/libtasn1-3.4-r1/work/libtasn1-3.4/lib -I.. -I/var/tmp/portage/dev-libs/libtasn1-3.4-r1/work/libtasn1-3.4/lib/gllib -DASN1_BUILDING -fvisibility=hidden -march=corei7-avx -O2 -pipe -c -o parser_aux.lo /var/tmp/portage/dev-libs/libtasn1-3.4-r1/work/libtasn1-3.4/lib/parser_aux.c
/bin/sh ../libtool --tag=CC --mode=compile x86_64-pc-linux-gnu-gcc -std=gnu99 -DHAVE_CONFIG_H -I. -I/var/tmp/portage/dev-libs/libtasn1-3.4-r1/work/libtasn1-3.4/lib -I.. -I/var/tmp/portage/dev-libs/libtasn1-3.4-r1/work/libtasn1-3.4/lib/gllib -DASN1_BUILDING -fvisibility=hidden -march=corei7-avx -O2 -pipe -c -o structure.lo /var/tmp/portage/dev-libs/libtasn1-3.4-r1/work/libtasn1-3.4/lib/structure.c
/bin/sh ../libtool --tag=CC --mode=compile x86_64-pc-linux-gnu-gcc -std=gnu99 -DHAVE_CONFIG_H -I. -I/var/tmp/portage/dev-libs/libtasn1-3.4-r1/work/libtasn1-3.4/lib -I.. -I/var/tmp/portage/dev-libs/libtasn1-3.4-r1/work/libtasn1-3.4/lib/gllib -DASN1_BUILDING -fvisibility=hidden -march=corei7-avx -O2 -pipe -c -o version.lo /var/tmp/portage/dev-libs/libtasn1-3.4-r1/work/libtasn1-3.4/lib/version.c
libtool: compile: x86_64-pc-linux-gnu-gcc -std=gnu99 -DHAVE_CONFIG_H -I. -I/var/tmp/portage/dev-libs/libtasn1-3.4-r1/work/libtasn1-3.4/lib -I.. -I/var/tmp/portage/dev-libs/libtasn1-3.4-r1/work/libtasn1-3.4/lib/gllib -DASN1_BUILDING -fvisibility=hidden -march=corei7-avx -O2 -pipe -c /var/tmp/portage/dev-libs/libtasn1-3.4-r1/work/libtasn1-3.4/lib/coding.c -fPIC -DPIC -o .libs/coding.o
distcc[19931] (dcc_build_somewhere) Warning: failed to distribute, running locally instead
libtool: compile: x86_64-pc-linux-gnu-gcc -std=gnu99 -DHAVE_CONFIG_H -I. -I/var/tmp/portage/dev-libs/libtasn1-3.4-r1/work/libtasn1-3.4/lib -I.. -I/var/tmp/portage/dev-libs/libtasn1-3.4-r1/work/libtasn1-3.4/lib/gllib -DASN1_BUILDING -fvisibility=hidden -march=corei7-avx -O2 -pipe -c /var/tmp/portage/dev-libs/libtasn1-3.4-r1/work/libtasn1-3.4/lib/errors.c -fPIC -DPIC -o .libs/errors.o
distcc[19936] (dcc_build_somewhere) Warning: failed to distribute, running locally instead
libtool: compile: x86_64-pc-linux-gnu-gcc -std=gnu99 -DHAVE_CONFIG_H -I. -I/var/tmp/portage/dev-libs/libtasn1-3.4-r1/work/libtasn1-3.4/lib -I.. -I/var/tmp/portage/dev-libs/libtasn1-3.4-r1/work/libtasn1-3.4/lib/gllib -DASN1_BUILDING -fvisibility=hidden -march=corei7-avx -O2 -pipe -c /var/tmp/portage/dev-libs/libtasn1-3.4-r1/work/libtasn1-3.4/lib/decoding.c -fPIC -DPIC -o .libs/decoding.o
libtool: compile: x86_64-pc-linux-gnu-gcc -std=gnu99 -DHAVE_CONFIG_H -I. -I/var/tmp/portage/dev-libs/libtasn1-3.4-r1/work/libtasn1-3.4/lib -I.. -I/var/tmp/portage/dev-libs/libtasn1-3.4-r1/work/libtasn1-3.4/lib/gllib -DASN1_BUILDING -fvisibility=hidden -march=corei7-avx -O2 -pipe -c /var/tmp/portage/dev-libs/libtasn1-3.4-r1/work/libtasn1-3.4/lib/ASN1.c -fPIC -DPIC -o .libs/ASN1.o
libtool: compile: x86_64-pc-linux-gnu-gcc -std=gnu99 -DHAVE_CONFIG_H -I. -I/var/tmp/portage/dev-libs/libtasn1-3.4-r1/work/libtasn1-3.4/lib -I.. -I/var/tmp/portage/dev-libs/libtasn1-3.4-r1/work/libtasn1-3.4/lib/gllib -DASN1_BUILDING -fvisibility=hidden -march=corei7-avx -O2 -pipe -c /var/tmp/portage/dev-libs/libtasn1-3.4-r1/work/libtasn1-3.4/lib/gstr.c -fPIC -DPIC -o .libs/gstr.o
distcc[19954] (dcc_build_somewhere) Warning: failed to distribute, running locally instead
distcc[19955] (dcc_build_somewhere) Warning: failed to distribute, running locally instead
libtool: compile: x86_64-pc-linux-gnu-gcc -std=gnu99 -DHAVE_CONFIG_H -I. -I/var/tmp/portage/dev-libs/libtasn1-3.4-r1/work/libtasn1-3.4/lib -I.. -I/var/tmp/portage/dev-libs/libtasn1-3.4-r1/work/libtasn1-3.4/lib/gllib -DASN1_BUILDING -fvisibility=hidden -march=corei7-avx -O2 -pipe -c /var/tmp/portage/dev-libs/libtasn1-3.4-r1/work/libtasn1-3.4/lib/element.c -fPIC -DPIC -o .libs/element.o
libtool: compile: x86_64-pc-linux-gnu-gcc -std=gnu99 -DHAVE_CONFIG_H -I. -I/var/tmp/portage/dev-libs/libtasn1-3.4-r1/work/libtasn1-3.4/lib -I.. -I/var/tmp/portage/dev-libs/libtasn1-3.4-r1/work/libtasn1-3.4/lib/gllib -DASN1_BUILDING -fvisibility=hidden -march=corei7-avx -O2 -pipe -c /var/tmp/portage/dev-libs/libtasn1-3.4-r1/work/libtasn1-3.4/lib/version.c -fPIC -DPIC -o .libs/version.o
libtool: compile: x86_64-pc-linux-gnu-gcc -std=gnu99 -DHAVE_CONFIG_H -I. -I/var/tmp/portage/dev-libs/libtasn1-3.4-r1/work/libtasn1-3.4/lib -I.. -I/var/tmp/portage/dev-libs/libtasn1-3.4-r1/work/libtasn1-3.4/lib/gllib -DASN1_BUILDING -fvisibility=hidden -march=corei7-avx -O2 -pipe -c /var/tmp/portage/dev-libs/libtasn1-3.4-r1/work/libtasn1-3.4/lib/parser_aux.c -fPIC -DPIC -o .libs/parser_aux.o
distcc[19969] (dcc_build_somewhere) Warning: failed to distribute, running locally instead
libtool: compile: x86_64-pc-linux-gnu-gcc -std=gnu99 -DHAVE_CONFIG_H -I. -I/var/tmp/portage/dev-libs/libtasn1-3.4-r1/work/libtasn1-3.4/lib -I.. -I/var/tmp/portage/dev-libs/libtasn1-3.4-r1/work/libtasn1-3.4/lib/gllib -DASN1_BUILDING -fvisibility=hidden -march=corei7-avx -O2 -pipe -c /var/tmp/portage/dev-libs/libtasn1-3.4-r1/work/libtasn1-3.4/lib/structure.c -fPIC -DPIC -o .libs/structure.o
distcc[19973] (dcc_build_somewhere) Warning: failed to distribute, running locally instead
distcc[19974] (dcc_build_somewhere) Warning: failed to distribute, running locally instead
distcc[19975] (dcc_build_somewhere) Warning: failed to distribute, running locally instead
distcc[19976] (dcc_build_somewhere) Warning: failed to distribute, running locally instead
/bin/sh ../libtool --tag=CC --mode=link x86_64-pc-linux-gnu-gcc -std=gnu99 -fvisibility=hidden -march=corei7-avx -O2 -pipe -no-undefined -version-info 8:0:2 -Wl,--version-script=/var/tmp/portage/dev-libs/libtasn1-3.4-r1/work/libtasn1-3.4/lib/libtasn1.map -Wl,-O1 -Wl,--as-needed -o libtasn1.la -rpath /usr/lib64 ASN1.lo coding.lo decoding.lo element.lo errors.lo gstr.lo parser_aux.lo structure.lo version.lo gllib/libgnu.la
libtool: link: x86_64-pc-linux-gnu-gcc -std=gnu99 -shared -fPIC -DPIC .libs/ASN1.o .libs/coding.o .libs/decoding.o .libs/element.o .libs/errors.o .libs/gstr.o .libs/parser_aux.o .libs/structure.o .libs/version.o -Wl,--whole-archive gllib/.libs/libgnu.a -Wl,--no-whole-archive -Wl,--as-needed -march=corei7-avx -O2 -Wl,--version-script=/var/tmp/portage/dev-libs/libtasn1-3.4-r1/work/libtasn1-3.4/lib/libtasn1.map -Wl,-O1 -Wl,-soname -Wl,libtasn1.so.6 -o .libs/libtasn1.so.6.2.0
libtool: link: (cd ".libs" && rm -f "libtasn1.so.6" && ln -s "libtasn1.so.6.2.0" "libtasn1.so.6")
libtool: link: (cd ".libs" && rm -f "libtasn1.so" && ln -s "libtasn1.so.6.2.0" "libtasn1.so")
libtool: link: ( cd ".libs" && rm -f "libtasn1.la" && ln -s "../libtasn1.la" "libtasn1.la" )
make[3]: Leaving directory '/var/tmp/portage/dev-libs/libtasn1-3.4-r1/work/libtasn1-3.4-amd64/lib'
make[2]: Leaving directory '/var/tmp/portage/dev-libs/libtasn1-3.4-r1/work/libtasn1-3.4-amd64/lib'
Making all in src
make[2]: Entering directory '/var/tmp/portage/dev-libs/libtasn1-3.4-r1/work/libtasn1-3.4-amd64/src'
x86_64-pc-linux-gnu-gcc -std=gnu99 -DHAVE_CONFIG_H -I. -I/var/tmp/portage/dev-libs/libtasn1-3.4-r1/work/libtasn1-3.4/src -I.. -I/var/tmp/portage/dev-libs/libtasn1-3.4-r1/work/libtasn1-3.4/lib -I/var/tmp/portage/dev-libs/libtasn1-3.4-r1/work/libtasn1-3.4/gl -I../gl -march=corei7-avx -O2 -pipe -c /var/tmp/portage/dev-libs/libtasn1-3.4-r1/work/libtasn1-3.4/src/asn1Parser.c
x86_64-pc-linux-gnu-gcc -std=gnu99 -DHAVE_CONFIG_H -I. -I/var/tmp/portage/dev-libs/libtasn1-3.4-r1/work/libtasn1-3.4/src -I.. -I/var/tmp/portage/dev-libs/libtasn1-3.4-r1/work/libtasn1-3.4/lib -I/var/tmp/portage/dev-libs/libtasn1-3.4-r1/work/libtasn1-3.4/gl -I../gl -march=corei7-avx -O2 -pipe -c /var/tmp/portage/dev-libs/libtasn1-3.4-r1/work/libtasn1-3.4/src/asn1Coding.c
x86_64-pc-linux-gnu-gcc -std=gnu99 -DHAVE_CONFIG_H -I. -I/var/tmp/portage/dev-libs/libtasn1-3.4-r1/work/libtasn1-3.4/src -I.. -I/var/tmp/portage/dev-libs/libtasn1-3.4-r1/work/libtasn1-3.4/lib -I/var/tmp/portage/dev-libs/libtasn1-3.4-r1/work/libtasn1-3.4/gl -I../gl -march=corei7-avx -O2 -pipe -c /var/tmp/portage/dev-libs/libtasn1-3.4-r1/work/libtasn1-3.4/src/asn1Decoding.c
x86_64-pc-linux-gnu-gcc -std=gnu99 -DHAVE_CONFIG_H -I. -I/var/tmp/portage/dev-libs/libtasn1-3.4-r1/work/libtasn1-3.4/src -I.. -I/var/tmp/portage/dev-libs/libtasn1-3.4-r1/work/libtasn1-3.4/lib -I/var/tmp/portage/dev-libs/libtasn1-3.4-r1/work/libtasn1-3.4/gl -I../gl -march=corei7-avx -O2 -pipe -c /var/tmp/portage/dev-libs/libtasn1-3.4-r1/work/libtasn1-3.4/src/benchmark.c
distcc[20075] (dcc_build_somewhere) Warning: failed to distribute, running locally instead
distcc[20076] (dcc_build_somewhere) Warning: failed to distribute, running locally instead
distcc[20077] (dcc_build_somewhere) Warning: failed to distribute, running locally instead
distcc[20078] (dcc_build_somewhere) Warning: failed to distribute, running locally instead
/bin/sh ../libtool --tag=CC --mode=link x86_64-pc-linux-gnu-gcc -std=gnu99 -march=corei7-avx -O2 -pipe -Wl,-O1 -Wl,--as-needed -o asn1Parser asn1Parser.o ../lib/libtasn1.la ../gl/libgnu.la
/bin/sh ../libtool --tag=CC --mode=link x86_64-pc-linux-gnu-gcc -std=gnu99 -march=corei7-avx -O2 -pipe -Wl,-O1 -Wl,--as-needed -o asn1Decoding asn1Decoding.o benchmark.o ../lib/libtasn1.la ../gl/libgnu.la
/bin/sh ../libtool --tag=CC --mode=link x86_64-pc-linux-gnu-gcc -std=gnu99 -march=corei7-avx -O2 -pipe -Wl,-O1 -Wl,--as-needed -o asn1Coding asn1Coding.o ../lib/libtasn1.la ../gl/libgnu.la
libtool: link: x86_64-pc-linux-gnu-gcc -std=gnu99 -march=corei7-avx -O2 -pipe -Wl,-O1 -o .libs/asn1Parser asn1Parser.o -Wl,--as-needed ../lib/.libs/libtasn1.so ../gl/.libs/libgnu.a
libtool: link: x86_64-pc-linux-gnu-gcc -std=gnu99 -march=corei7-avx -O2 -pipe -Wl,-O1 -o .libs/asn1Decoding asn1Decoding.o benchmark.o -Wl,--as-needed ../lib/.libs/libtasn1.so ../gl/.libs/libgnu.a
libtool: link: x86_64-pc-linux-gnu-gcc -std=gnu99 -march=corei7-avx -O2 -pipe -Wl,-O1 -o .libs/asn1Coding asn1Coding.o -Wl,--as-needed ../lib/.libs/libtasn1.so ../gl/.libs/libgnu.a
make[2]: Leaving directory '/var/tmp/portage/dev-libs/libtasn1-3.4-r1/work/libtasn1-3.4-amd64/src'
Making all in examples
make[2]: Entering directory '/var/tmp/portage/dev-libs/libtasn1-3.4-r1/work/libtasn1-3.4-amd64/examples'
make all-am
make[3]: Entering directory '/var/tmp/portage/dev-libs/libtasn1-3.4-r1/work/libtasn1-3.4-amd64/examples'
x86_64-pc-linux-gnu-gcc -std=gnu99 -DHAVE_CONFIG_H -I. -I/var/tmp/portage/dev-libs/libtasn1-3.4-r1/work/libtasn1-3.4/examples -I.. -I/var/tmp/portage/dev-libs/libtasn1-3.4-r1/work/libtasn1-3.4/lib -I/var/tmp/portage/dev-libs/libtasn1-3.4-r1/work/libtasn1-3.4/gl -I../gl -march=corei7-avx -O2 -pipe -c /var/tmp/portage/dev-libs/libtasn1-3.4-r1/work/libtasn1-3.4/examples/CertificateExample.c
x86_64-pc-linux-gnu-gcc -std=gnu99 -DHAVE_CONFIG_H -I. -I/var/tmp/portage/dev-libs/libtasn1-3.4-r1/work/libtasn1-3.4/examples -I.. -I/var/tmp/portage/dev-libs/libtasn1-3.4-r1/work/libtasn1-3.4/lib -I/var/tmp/portage/dev-libs/libtasn1-3.4-r1/work/libtasn1-3.4/gl -I../gl -march=corei7-avx -O2 -pipe -c /var/tmp/portage/dev-libs/libtasn1-3.4-r1/work/libtasn1-3.4/examples/pkix_asn1_tab.c
x86_64-pc-linux-gnu-gcc -std=gnu99 -DHAVE_CONFIG_H -I. -I/var/tmp/portage/dev-libs/libtasn1-3.4-r1/work/libtasn1-3.4/examples -I.. -I/var/tmp/portage/dev-libs/libtasn1-3.4-r1/work/libtasn1-3.4/lib -I/var/tmp/portage/dev-libs/libtasn1-3.4-r1/work/libtasn1-3.4/gl -I../gl -march=corei7-avx -O2 -pipe -c /var/tmp/portage/dev-libs/libtasn1-3.4-r1/work/libtasn1-3.4/examples/CrlExample.c
distcc[20263] (dcc_build_somewhere) Warning: failed to distribute, running locally instead
distcc[20264] (dcc_build_somewhere) Warning: failed to distribute, running locally instead
distcc[20265] (dcc_build_somewhere) Warning: failed to distribute, running locally instead
/bin/sh ../libtool --tag=CC --mode=link x86_64-pc-linux-gnu-gcc -std=gnu99 -march=corei7-avx -O2 -pipe -Wl,-O1 -Wl,--as-needed -o CrlExample CrlExample.o pkix_asn1_tab.o ../lib/libtasn1.la ../gl/libgnu.la
/bin/sh ../libtool --tag=CC --mode=link x86_64-pc-linux-gnu-gcc -std=gnu99 -march=corei7-avx -O2 -pipe -Wl,-O1 -Wl,--as-needed -o CertificateExample CertificateExample.o pkix_asn1_tab.o ../lib/libtasn1.la ../gl/libgnu.la
libtool: link: x86_64-pc-linux-gnu-gcc -std=gnu99 -march=corei7-avx -O2 -pipe -Wl,-O1 -o .libs/CrlExample CrlExample.o pkix_asn1_tab.o -Wl,--as-needed ../lib/.libs/libtasn1.so ../gl/.libs/libgnu.a
libtool: link: x86_64-pc-linux-gnu-gcc -std=gnu99 -march=corei7-avx -O2 -pipe -Wl,-O1 -o .libs/CertificateExample CertificateExample.o pkix_asn1_tab.o -Wl,--as-needed ../lib/.libs/libtasn1.so ../gl/.libs/libgnu.a
make[3]: Leaving directory '/var/tmp/portage/dev-libs/libtasn1-3.4-r1/work/libtasn1-3.4-amd64/examples'
make[2]: Leaving directory '/var/tmp/portage/dev-libs/libtasn1-3.4-r1/work/libtasn1-3.4-amd64/examples'
Making all in tests
make[2]: Entering directory '/var/tmp/portage/dev-libs/libtasn1-3.4-r1/work/libtasn1-3.4-amd64/tests'
make[2]: Nothing to be done for 'all'.
make[2]: Leaving directory '/var/tmp/portage/dev-libs/libtasn1-3.4-r1/work/libtasn1-3.4-amd64/tests'
Making all in doc
make[2]: Entering directory '/var/tmp/portage/dev-libs/libtasn1-3.4-r1/work/libtasn1-3.4-amd64/doc'
Making all in cyclo
make[3]: Entering directory '/var/tmp/portage/dev-libs/libtasn1-3.4-r1/work/libtasn1-3.4-amd64/doc/cyclo'
make[3]: Nothing to be done for 'all'.
make[3]: Leaving directory '/var/tmp/portage/dev-libs/libtasn1-3.4-r1/work/libtasn1-3.4-amd64/doc/cyclo'
make[3]: Entering directory '/var/tmp/portage/dev-libs/libtasn1-3.4-r1/work/libtasn1-3.4-amd64/doc'
/bin/mkdir -p man texi; \
for i in `/var/tmp/portage/dev-libs/libtasn1-3.4-r1/work/libtasn1-3.4/doc/gdoc -listfunc /var/tmp/portage/dev-libs/libtasn1-3.4-r1/work/libtasn1-3.4/lib/decoding.c /var/tmp/portage/dev-libs/libtasn1-3.4-r1/work/libtasn1-3.4/lib/errors.c /var/tmp/portage/dev-libs/libtasn1-3.4-r1/work/libtasn1-3.4/lib/parser_aux.c /var/tmp/portage/dev-libs/libtasn1-3.4-r1/work/libtasn1-3.4/lib/coding.c /var/tmp/portage/dev-libs/libtasn1-3.4-r1/work/libtasn1-3.4/lib/element.c /var/tmp/portage/dev-libs/libtasn1-3.4-r1/work/libtasn1-3.4/lib/gstr.c /var/tmp/portage/dev-libs/libtasn1-3.4-r1/work/libtasn1-3.4/lib/structure.c /var/tmp/portage/dev-libs/libtasn1-3.4-r1/work/libtasn1-3.4/lib/ASN1.c /var/tmp/portage/dev-libs/libtasn1-3.4-r1/work/libtasn1-3.4/lib/version.c`; do \
echo -n "Creating documentation for $i... " && \
/var/tmp/portage/dev-libs/libtasn1-3.4-r1/work/libtasn1-3.4/doc/gdoc -man \
-module libtasn1 \
-pkg-name "GNU Libtasn1" \
-sourceversion 3.4 \
-include libtasn1.h \
-seeinfo libtasn1 -verbatimcopying \
-copyright "2006-2013 Free Software Foundation, Inc." \
-function $i \
/var/tmp/portage/dev-libs/libtasn1-3.4-r1/work/libtasn1-3.4/lib/decoding.c /var/tmp/portage/dev-libs/libtasn1-3.4-r1/work/libtasn1-3.4/lib/errors.c /var/tmp/portage/dev-libs/libtasn1-3.4-r1/work/libtasn1-3.4/lib/parser_aux.c /var/tmp/portage/dev-libs/libtasn1-3.4-r1/work/libtasn1-3.4/lib/coding.c /var/tmp/portage/dev-libs/libtasn1-3.4-r1/work/libtasn1-3.4/lib/element.c /var/tmp/portage/dev-libs/libtasn1-3.4-r1/work/libtasn1-3.4/lib/gstr.c /var/tmp/portage/dev-libs/libtasn1-3.4-r1/work/libtasn1-3.4/lib/structure.c /var/tmp/portage/dev-libs/libtasn1-3.4-r1/work/libtasn1-3.4/lib/ASN1.c /var/tmp/portage/dev-libs/libtasn1-3.4-r1/work/libtasn1-3.4/lib/version.c > man/$i.3 && \
/var/tmp/portage/dev-libs/libtasn1-3.4-r1/work/libtasn1-3.4/doc/gdoc -texinfo -function $i \
/var/tmp/portage/dev-libs/libtasn1-3.4-r1/work/libtasn1-3.4/lib/decoding.c /var/tmp/portage/dev-libs/libtasn1-3.4-r1/work/libtasn1-3.4/lib/errors.c /var/tmp/portage/dev-libs/libtasn1-3.4-r1/work/libtasn1-3.4/lib/parser_aux.c /var/tmp/portage/dev-libs/libtasn1-3.4-r1/work/libtasn1-3.4/lib/coding.c /var/tmp/portage/dev-libs/libtasn1-3.4-r1/work/libtasn1-3.4/lib/element.c /var/tmp/portage/dev-libs/libtasn1-3.4-r1/work/libtasn1-3.4/lib/gstr.c /var/tmp/portage/dev-libs/libtasn1-3.4-r1/work/libtasn1-3.4/lib/structure.c /var/tmp/portage/dev-libs/libtasn1-3.4-r1/work/libtasn1-3.4/lib/ASN1.c /var/tmp/portage/dev-libs/libtasn1-3.4-r1/work/libtasn1-3.4/lib/version.c > texi/$i.texi && \
echo "ok"; \
done; \
for i in /var/tmp/portage/dev-libs/libtasn1-3.4-r1/work/libtasn1-3.4/lib/decoding.c /var/tmp/portage/dev-libs/libtasn1-3.4-r1/work/libtasn1-3.4/lib/errors.c /var/tmp/portage/dev-libs/libtasn1-3.4-r1/work/libtasn1-3.4/lib/parser_aux.c /var/tmp/portage/dev-libs/libtasn1-3.4-r1/work/libtasn1-3.4/lib/coding.c /var/tmp/portage/dev-libs/libtasn1-3.4-r1/work/libtasn1-3.4/lib/element.c /var/tmp/portage/dev-libs/libtasn1-3.4-r1/work/libtasn1-3.4/lib/gstr.c /var/tmp/portage/dev-libs/libtasn1-3.4-r1/work/libtasn1-3.4/lib/structure.c /var/tmp/portage/dev-libs/libtasn1-3.4-r1/work/libtasn1-3.4/lib/ASN1.c /var/tmp/portage/dev-libs/libtasn1-3.4-r1/work/libtasn1-3.4/lib/version.c; do \
BASE=`basename $i`; \
echo -n "Creating documentation for $i... " && \
/var/tmp/portage/dev-libs/libtasn1-3.4-r1/work/libtasn1-3.4/doc/gdoc -texinfo $i > texi/$BASE.texi && \
echo "ok"; \
done
Creating documentation for asn1_get_length_der... ok
Creating documentation for asn1_get_tag_der... ok
Creating documentation for asn1_get_length_ber... ok
Creating documentation for asn1_get_octet_der... ok
Creating documentation for asn1_get_bit_der... ok
Creating documentation for asn1_der_decoding... ok
Creating documentation for asn1_der_decoding_element... ok
Creating documentation for asn1_der_decoding_startEnd... ok
Creating documentation for asn1_expand_any_defined_by... ok
Creating documentation for asn1_expand_octet_string... ok
Creating documentation for asn1_decode_simple_der... ok
Creating documentation for asn1_perror... ok
Creating documentation for asn1_strerror... ok
Creating documentation for asn1_find_node... ok
Creating documentation for asn1_length_der... ok
Creating documentation for asn1_octet_der... ok
Creating documentation for asn1_encode_simple_der... ok
Creating documentation for asn1_bit_der... ok
Creating documentation for asn1_der_coding... ok
Creating documentation for asn1_write_value... ok
Creating documentation for asn1_read_value... ok
Creating documentation for asn1_read_value_type... ok
Creating documentation for asn1_read_tag... ok
Creating documentation for asn1_read_node_value... ok
Creating documentation for asn1_array2tree... ok
Creating documentation for asn1_delete_structure... ok
Creating documentation for asn1_delete_structure2... ok
Creating documentation for asn1_delete_element... ok
Creating documentation for asn1_create_element... ok
Creating documentation for asn1_print_structure... ok
Creating documentation for asn1_number_of_elements... ok
Creating documentation for asn1_find_structure_from_oid... ok
Creating documentation for asn1_copy_node... ok
Creating documentation for asn1_parser2tree... ok
Creating documentation for asn1_parser2array... ok
Creating documentation for asn1_check_version... ok
Creating documentation for /var/tmp/portage/dev-libs/libtasn1-3.4-r1/work/libtasn1-3.4/lib/decoding.c... ok
Creating documentation for /var/tmp/portage/dev-libs/libtasn1-3.4-r1/work/libtasn1-3.4/lib/errors.c... ok
Creating documentation for /var/tmp/portage/dev-libs/libtasn1-3.4-r1/work/libtasn1-3.4/lib/parser_aux.c... ok
Creating documentation for /var/tmp/portage/dev-libs/libtasn1-3.4-r1/work/libtasn1-3.4/lib/coding.c... ok
Creating documentation for /var/tmp/portage/dev-libs/libtasn1-3.4-r1/work/libtasn1-3.4/lib/element.c... ok
Creating documentation for /var/tmp/portage/dev-libs/libtasn1-3.4-r1/work/libtasn1-3.4/lib/gstr.c... ok
Creating documentation for /var/tmp/portage/dev-libs/libtasn1-3.4-r1/work/libtasn1-3.4/lib/structure.c... ok
Creating documentation for /var/tmp/portage/dev-libs/libtasn1-3.4-r1/work/libtasn1-3.4/lib/ASN1.c... ok
Creating documentation for /var/tmp/portage/dev-libs/libtasn1-3.4-r1/work/libtasn1-3.4/lib/version.c... ok
touch stamp_docs
make[3]: Leaving directory '/var/tmp/portage/dev-libs/libtasn1-3.4-r1/work/libtasn1-3.4-amd64/doc'
make[2]: Leaving directory '/var/tmp/portage/dev-libs/libtasn1-3.4-r1/work/libtasn1-3.4-amd64/doc'
make[2]: Entering directory '/var/tmp/portage/dev-libs/libtasn1-3.4-r1/work/libtasn1-3.4-amd64'
make[2]: Nothing to be done for 'all-am'.
make[2]: Leaving directory '/var/tmp/portage/dev-libs/libtasn1-3.4-r1/work/libtasn1-3.4-amd64'
make[1]: Leaving directory '/var/tmp/portage/dev-libs/libtasn1-3.4-r1/work/libtasn1-3.4-amd64'
>>> Source compiled.
>>> Test phase [not enabled]: dev-libs/libtasn1-3.4-r1

>>> Install libtasn1-3.4-r1 into /var/tmp/portage/dev-libs/libtasn1-3.4-r1/image/ category dev-libs
* amd64: running multilib-minimal_abi_src_install
make -j24 DESTDIR=/var/tmp/portage/dev-libs/libtasn1-3.4-r1/image/ install
Making install in gl
make[1]: Entering directory '/var/tmp/portage/dev-libs/libtasn1-3.4-r1/work/libtasn1-3.4-amd64/gl'
make install-recursive
make[2]: Entering directory '/var/tmp/portage/dev-libs/libtasn1-3.4-r1/work/libtasn1-3.4-amd64/gl'
make[3]: Entering directory '/var/tmp/portage/dev-libs/libtasn1-3.4-r1/work/libtasn1-3.4-amd64/gl'
make[4]: Entering directory '/var/tmp/portage/dev-libs/libtasn1-3.4-r1/work/libtasn1-3.4-amd64/gl'
make[4]: Nothing to be done for 'install-exec-am'.
make[4]: Nothing to be done for 'install-data-am'.
make[4]: Leaving directory '/var/tmp/portage/dev-libs/libtasn1-3.4-r1/work/libtasn1-3.4-amd64/gl'
make[3]: Leaving directory '/var/tmp/portage/dev-libs/libtasn1-3.4-r1/work/libtasn1-3.4-amd64/gl'
make[2]: Leaving directory '/var/tmp/portage/dev-libs/libtasn1-3.4-r1/work/libtasn1-3.4-amd64/gl'
make[1]: Leaving directory '/var/tmp/portage/dev-libs/libtasn1-3.4-r1/work/libtasn1-3.4-amd64/gl'
Making install in lib
make[1]: Entering directory '/var/tmp/portage/dev-libs/libtasn1-3.4-r1/work/libtasn1-3.4-amd64/lib'
Making install in gllib
make[2]: Entering directory '/var/tmp/portage/dev-libs/libtasn1-3.4-r1/work/libtasn1-3.4-amd64/lib/gllib'
make install-recursive
make[3]: Entering directory '/var/tmp/portage/dev-libs/libtasn1-3.4-r1/work/libtasn1-3.4-amd64/lib/gllib'
make[4]: Entering directory '/var/tmp/portage/dev-libs/libtasn1-3.4-r1/work/libtasn1-3.4-amd64/lib/gllib'
make[5]: Entering directory '/var/tmp/portage/dev-libs/libtasn1-3.4-r1/work/libtasn1-3.4-amd64/lib/gllib'
make[5]: Nothing to be done for 'install-exec-am'.
make[5]: Nothing to be done for 'install-data-am'.
make[5]: Leaving directory '/var/tmp/portage/dev-libs/libtasn1-3.4-r1/work/libtasn1-3.4-amd64/lib/gllib'
make[4]: Leaving directory '/var/tmp/portage/dev-libs/libtasn1-3.4-r1/work/libtasn1-3.4-amd64/lib/gllib'
make[3]: Leaving directory '/var/tmp/portage/dev-libs/libtasn1-3.4-r1/work/libtasn1-3.4-amd64/lib/gllib'
make[2]: Leaving directory '/var/tmp/portage/dev-libs/libtasn1-3.4-r1/work/libtasn1-3.4-amd64/lib/gllib'
make[2]: Entering directory '/var/tmp/portage/dev-libs/libtasn1-3.4-r1/work/libtasn1-3.4-amd64/lib'
make[3]: Entering directory '/var/tmp/portage/dev-libs/libtasn1-3.4-r1/work/libtasn1-3.4-amd64/lib'
/bin/mkdir -p '/var/tmp/portage/dev-libs/libtasn1-3.4-r1/image//usr/lib64'
/bin/mkdir -p '/var/tmp/portage/dev-libs/libtasn1-3.4-r1/image//usr/include'
/bin/mkdir -p '/var/tmp/portage/dev-libs/libtasn1-3.4-r1/image//usr/lib64/pkgconfig'
/bin/sh ../libtool --mode=install /usr/bin/install -c libtasn1.la '/var/tmp/portage/dev-libs/libtasn1-3.4-r1/image//usr/lib64'
/usr/bin/install -c -m 644 /var/tmp/portage/dev-libs/libtasn1-3.4-r1/work/libtasn1-3.4/lib/libtasn1.h '/var/tmp/portage/dev-libs/libtasn1-3.4-r1/image//usr/include'
/usr/bin/install -c -m 644 libtasn1.pc '/var/tmp/portage/dev-libs/libtasn1-3.4-r1/image//usr/lib64/pkgconfig'
libtool: install: /usr/bin/install -c .libs/libtasn1.so.6.2.0 /var/tmp/portage/dev-libs/libtasn1-3.4-r1/image//usr/lib64/libtasn1.so.6.2.0
libtool: install: (cd /var/tmp/portage/dev-libs/libtasn1-3.4-r1/image//usr/lib64 && { ln -s -f libtasn1.so.6.2.0 libtasn1.so.6 || { rm -f libtasn1.so.6 && ln -s libtasn1.so.6.2.0 libtasn1.so.6; }; })
libtool: install: (cd /var/tmp/portage/dev-libs/libtasn1-3.4-r1/image//usr/lib64 && { ln -s -f libtasn1.so.6.2.0 libtasn1.so || { rm -f libtasn1.so && ln -s libtasn1.so.6.2.0 libtasn1.so; }; })
libtool: install: /usr/bin/install -c .libs/libtasn1.lai /var/tmp/portage/dev-libs/libtasn1-3.4-r1/image//usr/lib64/libtasn1.la
libtool: install: warning: remember to run `libtool --finish /usr/lib64'
make[3]: Leaving directory '/var/tmp/portage/dev-libs/libtasn1-3.4-r1/work/libtasn1-3.4-amd64/lib'
make[2]: Leaving directory '/var/tmp/portage/dev-libs/libtasn1-3.4-r1/work/libtasn1-3.4-amd64/lib'
make[1]: Leaving directory '/var/tmp/portage/dev-libs/libtasn1-3.4-r1/work/libtasn1-3.4-amd64/lib'
Making install in src
make[1]: Entering directory '/var/tmp/portage/dev-libs/libtasn1-3.4-r1/work/libtasn1-3.4-amd64/src'
make[2]: Entering directory '/var/tmp/portage/dev-libs/libtasn1-3.4-r1/work/libtasn1-3.4-amd64/src'
make[2]: Nothing to be done for 'install-data-am'.
/bin/mkdir -p '/var/tmp/portage/dev-libs/libtasn1-3.4-r1/image//usr/bin'
/bin/sh ../libtool --mode=install /usr/bin/install -c asn1Parser asn1Coding asn1Decoding '/var/tmp/portage/dev-libs/libtasn1-3.4-r1/image//usr/bin'
libtool: install: warning: `../lib/libtasn1.la' has not been installed in `/usr/lib64'
libtool: install: /usr/bin/install -c .libs/asn1Parser /var/tmp/portage/dev-libs/libtasn1-3.4-r1/image//usr/bin/asn1Parser
libtool: install: warning: `../lib/libtasn1.la' has not been installed in `/usr/lib64'
libtool: install: /usr/bin/install -c .libs/asn1Coding /var/tmp/portage/dev-libs/libtasn1-3.4-r1/image//usr/bin/asn1Coding
libtool: install: warning: `../lib/libtasn1.la' has not been installed in `/usr/lib64'
libtool: install: /usr/bin/install -c .libs/asn1Decoding /var/tmp/portage/dev-libs/libtasn1-3.4-r1/image//usr/bin/asn1Decoding
make[2]: Leaving directory '/var/tmp/portage/dev-libs/libtasn1-3.4-r1/work/libtasn1-3.4-amd64/src'
make[1]: Leaving directory '/var/tmp/portage/dev-libs/libtasn1-3.4-r1/work/libtasn1-3.4-amd64/src'
Making install in examples
make[1]: Entering directory '/var/tmp/portage/dev-libs/libtasn1-3.4-r1/work/libtasn1-3.4-amd64/examples'
make install-am
make[2]: Entering directory '/var/tmp/portage/dev-libs/libtasn1-3.4-r1/work/libtasn1-3.4-amd64/examples'
make[3]: Entering directory '/var/tmp/portage/dev-libs/libtasn1-3.4-r1/work/libtasn1-3.4-amd64/examples'
make[3]: Nothing to be done for 'install-exec-am'.
make[3]: Nothing to be done for 'install-data-am'.
make[3]: Leaving directory '/var/tmp/portage/dev-libs/libtasn1-3.4-r1/work/libtasn1-3.4-amd64/examples'
make[2]: Leaving directory '/var/tmp/portage/dev-libs/libtasn1-3.4-r1/work/libtasn1-3.4-amd64/examples'
make[1]: Leaving directory '/var/tmp/portage/dev-libs/libtasn1-3.4-r1/work/libtasn1-3.4-amd64/examples'
Making install in tests
make[1]: Entering directory '/var/tmp/portage/dev-libs/libtasn1-3.4-r1/work/libtasn1-3.4-amd64/tests'
make[2]: Entering directory '/var/tmp/portage/dev-libs/libtasn1-3.4-r1/work/libtasn1-3.4-amd64/tests'
make[2]: Nothing to be done for 'install-exec-am'.
make[2]: Nothing to be done for 'install-data-am'.
make[2]: Leaving directory '/var/tmp/portage/dev-libs/libtasn1-3.4-r1/work/libtasn1-3.4-amd64/tests'
make[1]: Leaving directory '/var/tmp/portage/dev-libs/libtasn1-3.4-r1/work/libtasn1-3.4-amd64/tests'
Making install in doc
make[1]: Entering directory '/var/tmp/portage/dev-libs/libtasn1-3.4-r1/work/libtasn1-3.4-amd64/doc'
Making install in cyclo
make[2]: Entering directory '/var/tmp/portage/dev-libs/libtasn1-3.4-r1/work/libtasn1-3.4-amd64/doc/cyclo'
make[3]: Entering directory '/var/tmp/portage/dev-libs/libtasn1-3.4-r1/work/libtasn1-3.4-amd64/doc/cyclo'
make[3]: Nothing to be done for 'install-exec-am'.
make[3]: Nothing to be done for 'install-data-am'.
make[3]: Leaving directory '/var/tmp/portage/dev-libs/libtasn1-3.4-r1/work/libtasn1-3.4-amd64/doc/cyclo'
make[2]: Leaving directory '/var/tmp/portage/dev-libs/libtasn1-3.4-r1/work/libtasn1-3.4-amd64/doc/cyclo'
make[2]: Entering directory '/var/tmp/portage/dev-libs/libtasn1-3.4-r1/work/libtasn1-3.4-amd64/doc'
restore=: && backupdir=".am$$" && \
am__cwd=`pwd` && CDPATH="${ZSH_VERSION+.}:" && cd /var/tmp/portage/dev-libs/libtasn1-3.4-r1/work/libtasn1-3.4/doc && \
rm -rf $backupdir && mkdir $backupdir && \
if (/bin/sh /var/tmp/portage/dev-libs/libtasn1-3.4-r1/work/libtasn1-3.4/build-aux/missing makeinfo --version) >/dev/null 2>&1; then \
for f in /var/tmp/portage/dev-libs/libtasn1-3.4-r1/work/libtasn1-3.4/doc/libtasn1.info /var/tmp/portage/dev-libs/libtasn1-3.4-r1/work/libtasn1-3.4/doc/libtasn1.info-[0-9] /var/tmp/portage/dev-libs/libtasn1-3.4-r1/work/libtasn1-3.4/doc/libtasn1.info-[0-9][0-9] /var/tmp/portage/dev-libs/libtasn1-3.4-r1/work/libtasn1-3.4/doc/libtasn1.i[0-9] /var/tmp/portage/dev-libs/libtasn1-3.4-r1/work/libtasn1-3.4/doc/libtasn1.i[0-9][0-9]; do \
if test -f $f; then mv $f $backupdir; restore=mv; else :; fi; \
done; \
else :; fi && \
cd "$am__cwd"; \
if /bin/sh /var/tmp/portage/dev-libs/libtasn1-3.4-r1/work/libtasn1-3.4/build-aux/missing makeinfo -I ../doc -I /var/tmp/portage/dev-libs/libtasn1-3.4-r1/work/libtasn1-3.4/doc \
-o /var/tmp/portage/dev-libs/libtasn1-3.4-r1/work/libtasn1-3.4/doc/libtasn1.info /var/tmp/portage/dev-libs/libtasn1-3.4-r1/work/libtasn1-3.4/doc/libtasn1.texi; \
then \
rc=0; \
CDPATH="${ZSH_VERSION+.}:" && cd /var/tmp/portage/dev-libs/libtasn1-3.4-r1/work/libtasn1-3.4/doc; \
else \
rc=$?; \
CDPATH="${ZSH_VERSION+.}:" && cd /var/tmp/portage/dev-libs/libtasn1-3.4-r1/work/libtasn1-3.4/doc && \
$restore $backupdir/* `echo ".//var/tmp/portage/dev-libs/libtasn1-3.4-r1/work/libtasn1-3.4/doc/libtasn1.info" | sed 's|[^/]*$||'`; \
fi; \
rm -rf $backupdir; exit $rc
Can't locate Unicode/EastAsianWidth.pm in @INC (you may need to install the Unicode::EastAsianWidth module) (@INC contains: /usr/share/texinfo /etc/perl /usr/local/lib64/perl5/5.18.2/x86_64-linux /usr/local/lib64/perl5/5.18.2 /usr/lib64/perl5/vendor_perl/5.18.2/x86_64-linux /usr/lib64/perl5/vendor_perl/5.18.2 /usr/local/lib64/perl5 /usr/lib64/perl5/vendor_perl /usr/lib64/perl5/5.18.2/x86_64-linux /usr/lib64/perl5/5.18.2 .) at /usr/share/texinfo/Texinfo/Convert/Unicode.pm line 31.
BEGIN failed--compilation aborted at /usr/share/texinfo/Texinfo/Convert/Unicode.pm line 31.
Compilation failed in require at /usr/share/texinfo/Texinfo/Convert/Text.pm line 27.
BEGIN failed--compilation aborted at /usr/share/texinfo/Texinfo/Convert/Text.pm line 27.
Compilation failed in require at /usr/share/texinfo/Texinfo/Parser.pm line 55.
BEGIN failed--compilation aborted at /usr/share/texinfo/Texinfo/Parser.pm line 55.
Compilation failed in require at /usr/bin/makeinfo line 101.
BEGIN failed--compilation aborted at /usr/bin/makeinfo line 101.
Makefile:1058: recipe for target '/var/tmp/portage/dev-libs/libtasn1-3.4-r1/work/libtasn1-3.4/doc/libtasn1.info' failed
make[2]: *** [/var/tmp/portage/dev-libs/libtasn1-3.4-r1/work/libtasn1-3.4/doc/libtasn1.info] Error 2
make[2]: Leaving directory '/var/tmp/portage/dev-libs/libtasn1-3.4-r1/work/libtasn1-3.4-amd64/doc'
Makefile:1314: recipe for target 'install-recursive' failed
make[1]: *** [install-recursive] Error 1
make[1]: Leaving directory '/var/tmp/portage/dev-libs/libtasn1-3.4-r1/work/libtasn1-3.4-amd64/doc'
Makefile:991: recipe for target 'install-recursive' failed
make: *** [install-recursive] Error 1
* ERROR: dev-libs/libtasn1-3.4-r1::gentoo failed (install phase):
* emake failed
*
* If you need support, post the output of `emerge --info '=dev-libs/libtasn1-3.4-r1::gentoo'`,
* the complete build log and the output of `emerge -pqv '=dev-libs/libtasn1-3.4-r1::gentoo'`.
* The complete build log is located at '/var/tmp/portage/dev-libs/libtasn1-3.4-r1/temp/build.log'.
* The ebuild environment file is located at '/var/tmp/portage/dev-libs/libtasn1-3.4-r1/temp/environment'.
* Working directory: '/var/tmp/portage/dev-libs/libtasn1-3.4-r1/work/libtasn1-3.4-amd64'
* S: '/var/tmp/portage/dev-libs/libtasn1-3.4-r1/work/libtasn1-3.4'
Back to top
View user's profile Send private message
TomWij
Retired Dev
Retired Dev


Joined: 04 Jul 2012
Posts: 1553

PostPosted: Thu Mar 27, 2014 7:05 pm    Post subject: Reply with quote

josei7 wrote:
Can't locate Unicode/EastAsianWidth.pm in @INC
Run the command `perl-cleaner --all` (from the package app-admin/perl-cleaner) which will rebuild modules and reverse dependencies that became broken due to the Perl upgrade.
Back to top
View user's profile Send private message
josei7
n00b
n00b


Joined: 07 Feb 2014
Posts: 22

PostPosted: Fri Mar 28, 2014 8:51 am    Post subject: Reply with quote

* Finding left over modules and header

* The following files remain. These were either installed by hand
* or edited. This script cannot deal with them.

/usr/lib32/perl5/5.12.4/i686-linux/CORE/op.h
/usr/lib32/perl5/5.12.4/i686-linux/CORE/XSUB.h
/usr/lib32/perl5/5.12.4/i686-linux/CORE/pp.h
/usr/lib32/perl5/5.12.4/i686-linux/CORE/regexp.h
/usr/lib32/perl5/5.12.4/i686-linux/CORE/git_version.h
/usr/lib32/perl5/5.12.4/i686-linux/CORE/mydtrace.h
/usr/lib32/perl5/5.12.4/i686-linux/CORE/utfebcdic.h
/usr/lib32/perl5/5.12.4/i686-linux/CORE/EXTERN.h
/usr/lib32/perl5/5.12.4/i686-linux/CORE/fakesdio.h
/usr/lib32/perl5/5.12.4/i686-linux/CORE/sv.h
/usr/lib32/perl5/5.12.4/i686-linux/CORE/malloc_ctl.h
/usr/lib32/perl5/5.12.4/i686-linux/CORE/util.h
/usr/lib32/perl5/5.12.4/i686-linux/CORE/cop.h
/usr/lib32/perl5/5.12.4/i686-linux/CORE/INTERN.h
/usr/lib32/perl5/5.12.4/i686-linux/CORE/embedvar.h
/usr/lib32/perl5/5.12.4/i686-linux/CORE/intrpvar.h
/usr/lib32/perl5/5.12.4/i686-linux/CORE/pad.h
/usr/lib32/perl5/5.12.4/i686-linux/CORE/config.h
/usr/lib32/perl5/5.12.4/i686-linux/CORE/hv.h
/usr/lib32/perl5/5.12.4/i686-linux/CORE/bitcount.h
/usr/lib32/perl5/5.12.4/i686-linux/CORE/keywords.h
/usr/lib32/perl5/5.12.4/i686-linux/CORE/regcharclass.h
/usr/lib32/perl5/5.12.4/i686-linux/CORE/pp_proto.h
/usr/lib32/perl5/5.12.4/i686-linux/CORE/opcode.h
/usr/lib32/perl5/5.12.4/i686-linux/CORE/embed.h
/usr/lib32/perl5/5.12.4/i686-linux/CORE/uudmap.h
/usr/lib32/perl5/5.12.4/i686-linux/CORE/iperlsys.h
/usr/lib32/perl5/5.12.4/i686-linux/CORE/perlio.h
/usr/lib32/perl5/5.12.4/i686-linux/CORE/nostdio.h
/usr/lib32/perl5/5.12.4/i686-linux/CORE/regcomp.h
/usr/lib32/perl5/5.12.4/i686-linux/CORE/scope.h
/usr/lib32/perl5/5.12.4/i686-linux/CORE/unixish.h
/usr/lib32/perl5/5.12.4/i686-linux/CORE/thread.h
/usr/lib32/perl5/5.12.4/i686-linux/CORE/perlsdio.h
/usr/lib32/perl5/5.12.4/i686-linux/CORE/dosish.h
/usr/lib32/perl5/5.12.4/i686-linux/CORE/regnodes.h
/usr/lib32/perl5/5.12.4/i686-linux/CORE/mg.h
/usr/lib32/perl5/5.12.4/i686-linux/CORE/time64.h
/usr/lib32/perl5/5.12.4/i686-linux/CORE/overload.h
/usr/lib32/perl5/5.12.4/i686-linux/CORE/perlapi.h
/usr/lib32/perl5/5.12.4/i686-linux/CORE/opnames.h
/usr/lib32/perl5/5.12.4/i686-linux/CORE/uconfig.h
/usr/lib32/perl5/5.12.4/i686-linux/CORE/utf8.h
/usr/lib32/perl5/5.12.4/i686-linux/CORE/parser.h
/usr/lib32/perl5/5.12.4/i686-linux/CORE/proto.h
/usr/lib32/perl5/5.12.4/i686-linux/CORE/handy.h
/usr/lib32/perl5/5.12.4/i686-linux/CORE/perlsfio.h
/usr/lib32/perl5/5.12.4/i686-linux/CORE/cc_runtime.h
/usr/lib32/perl5/5.12.4/i686-linux/CORE/warnings.h
/usr/lib32/perl5/5.12.4/i686-linux/CORE/fakethr.h
/usr/lib32/perl5/5.12.4/i686-linux/CORE/av.h
/usr/lib32/perl5/5.12.4/i686-linux/CORE/patchlevel.h
/usr/lib32/perl5/5.12.4/i686-linux/CORE/perly.h
/usr/lib32/perl5/5.12.4/i686-linux/CORE/reentr.h
/usr/lib32/perl5/5.12.4/i686-linux/CORE/form.h
/usr/lib32/perl5/5.12.4/i686-linux/CORE/perlvars.h
/usr/lib32/perl5/5.12.4/i686-linux/CORE/perliol.h
/usr/lib32/perl5/5.12.4/i686-linux/CORE/gv.h
/usr/lib32/perl5/5.12.4/i686-linux/CORE/time64_config.h
/usr/lib32/perl5/5.12.4/i686-linux/CORE/cv.h
/usr/lib32/perl5/5.12.4/i686-linux/CORE/perl.h
/usr/lib32/perl5/5.12.4/i686-linux/auto/Digest/SHA/SHA.so
/usr/lib32/perl5/5.12.4/i686-linux/auto/Digest/MD5/MD5.so
/usr/lib32/perl5/5.12.4/i686-linux/auto/Time/HiRes/HiRes.so
/usr/lib32/perl5/5.12.4/i686-linux/auto/Time/Piece/Piece.so
/usr/lib32/perl5/5.12.4/i686-linux/auto/re/re.so
/usr/lib32/perl5/5.12.4/i686-linux/auto/Sys/Hostname/Hostname.so
/usr/lib32/perl5/5.12.4/i686-linux/auto/Sys/Syslog/Syslog.so
/usr/lib32/perl5/5.12.4/i686-linux/auto/DB_File/DB_File.so
/usr/lib32/perl5/5.12.4/i686-linux/auto/IPC/SysV/SysV.so
/usr/lib32/perl5/5.12.4/i686-linux/auto/POSIX/POSIX.so
/usr/lib32/perl5/5.12.4/i686-linux/auto/Hash/Util/FieldHash/FieldHash.so
/usr/lib32/perl5/5.12.4/i686-linux/auto/Hash/Util/Util.so
/usr/lib32/perl5/5.12.4/i686-linux/auto/Compress/Raw/Bzip2/Bzip2.so
/usr/lib32/perl5/5.12.4/i686-linux/auto/Compress/Raw/Zlib/Zlib.so
/usr/lib32/perl5/5.12.4/i686-linux/auto/MIME/Base64/Base64.so
/usr/lib32/perl5/5.12.4/i686-linux/auto/Text/Soundex/Soundex.so
/usr/lib32/perl5/5.12.4/i686-linux/auto/Storable/Storable.so
/usr/lib32/perl5/5.12.4/i686-linux/auto/Opcode/Opcode.so
/usr/lib32/perl5/5.12.4/i686-linux/auto/I18N/Langinfo/Langinfo.so
/usr/lib32/perl5/5.12.4/i686-linux/auto/Math/BigInt/FastCalc/FastCalc.so
/usr/lib32/perl5/5.12.4/i686-linux/auto/Data/Dumper/Dumper.so
/usr/lib32/perl5/5.12.4/i686-linux/auto/attributes/attributes.so
/usr/lib32/perl5/5.12.4/i686-linux/auto/Cwd/Cwd.so
/usr/lib32/perl5/5.12.4/i686-linux/auto/Socket/Socket.so
/usr/lib32/perl5/5.12.4/i686-linux/auto/threads/threads.so
/usr/lib32/perl5/5.12.4/i686-linux/auto/threads/shared/shared.so
/usr/lib32/perl5/5.12.4/i686-linux/auto/SDBM_File/SDBM_File.so
/usr/lib32/perl5/5.12.4/i686-linux/auto/GDBM_File/GDBM_File.so
/usr/lib32/perl5/5.12.4/i686-linux/auto/mro/mro.so
/usr/lib32/perl5/5.12.4/i686-linux/auto/Encode/Byte/Byte.so
/usr/lib32/perl5/5.12.4/i686-linux/auto/Encode/TW/TW.so
/usr/lib32/perl5/5.12.4/i686-linux/auto/Encode/Symbol/Symbol.so
/usr/lib32/perl5/5.12.4/i686-linux/auto/Encode/KR/KR.so
/usr/lib32/perl5/5.12.4/i686-linux/auto/Encode/CN/CN.so
/usr/lib32/perl5/5.12.4/i686-linux/auto/Encode/Encode.so
/usr/lib32/perl5/5.12.4/i686-linux/auto/Encode/EBCDIC/EBCDIC.so
/usr/lib32/perl5/5.12.4/i686-linux/auto/Encode/JP/JP.so
/usr/lib32/perl5/5.12.4/i686-linux/auto/Encode/Unicode/Unicode.so
/usr/lib32/perl5/5.12.4/i686-linux/auto/B/B.so
/usr/lib32/perl5/5.12.4/i686-linux/auto/Fcntl/Fcntl.so
/usr/lib32/perl5/5.12.4/i686-linux/auto/Filter/Util/Call/Call.so
/usr/lib32/perl5/5.12.4/i686-linux/auto/IO/IO.so
/usr/lib32/perl5/5.12.4/i686-linux/auto/Devel/PPPort/PPPort.so
/usr/lib32/perl5/5.12.4/i686-linux/auto/Devel/DProf/DProf.so
/usr/lib32/perl5/5.12.4/i686-linux/auto/Devel/Peek/Peek.so
/usr/lib32/perl5/5.12.4/i686-linux/auto/List/Util/Util.so
/usr/lib32/perl5/5.12.4/i686-linux/auto/File/Glob/Glob.so
/usr/lib32/perl5/5.12.4/i686-linux/auto/NDBM_File/NDBM_File.so
/usr/lib32/perl5/5.12.4/i686-linux/auto/PerlIO/encoding/encoding.so
/usr/lib32/perl5/5.12.4/i686-linux/auto/PerlIO/scalar/scalar.so
/usr/lib32/perl5/5.12.4/i686-linux/auto/PerlIO/via/via.so
/usr/lib32/perl5/5.12.4/i686-linux/auto/Unicode/Normalize/Normalize.so
/usr/lib32/perl5/5.12.4/Encode/encode.h
/usr/lib64/perl5/vendor_perl/5.16.3/XML/SAX/ParserDetails.ini
Back to top
View user's profile Send private message
josei7
n00b
n00b


Joined: 07 Feb 2014
Posts: 22

PostPosted: Fri Mar 28, 2014 8:52 am    Post subject: Reply with quote

i run perl-cleaner --all and some packages dont remerge what i do
Back to top
View user's profile Send private message
TomWij
Retired Dev
Retired Dev


Joined: 04 Jul 2012
Posts: 1553

PostPosted: Fri Mar 28, 2014 10:45 am    Post subject: Reply with quote

josei7 wrote:
i run perl-cleaner --all and some packages dont remerge what i do


Can you share their build log such that we can see what is going on with those re-emerges?

josei7 wrote:
* The following files remain. These were either installed by hand
* or edited. This script cannot deal with them.


After asking the Perl maintainers; I was told by an user that if you don't have those Perl version installed, you can safely remove them, only after all the perl-cleaner emerges have succeeded.
Back to top
View user's profile Send private message
josei7
n00b
n00b


Joined: 07 Feb 2014
Posts: 22

PostPosted: Fri Mar 28, 2014 11:07 am    Post subject: Reply with quote

Thanks for you support.It is clear for me.I will follow your indications,many thanks and best regards.
Back to top
View user's profile Send private message
TomWij
Retired Dev
Retired Dev


Joined: 04 Jul 2012
Posts: 1553

PostPosted: Fri Mar 28, 2014 12:17 pm    Post subject: Reply with quote

josei7 wrote:
Thanks for you support.It is clear for me.I will follow your indications,many thanks and best regards.


Upon a second check, these files are part of emul-linux-x86-baselibs which still need to get updated; so, you might want to keep them to prevent breakage in 32 bit applications, as an update of baselibs will make them go away. In the event that you have already removed them, and something broke, re-emerging emul-linux-x86-baselibs will suffice.
Back to top
View user's profile Send private message
josei7
n00b
n00b


Joined: 07 Feb 2014
Posts: 22

PostPosted: Fri Mar 28, 2014 6:01 pm    Post subject: Reply with quote

Tom, thanks for your warning. I realized those files related to lib32 compatibility and i didn't remove them.Thanks again and best regards.
Back to top
View user's profile Send private message
Display posts from previous:   
Reply to topic    Gentoo Forums Forum Index Installing Gentoo All times are GMT
Page 1 of 1

 
Jump to:  
You cannot post new topics in this forum
You cannot reply to topics in this forum
You cannot edit your posts in this forum
You cannot delete your posts in this forum
You cannot vote in polls in this forum